has Smoking Status
type: ObjectProperty
domain: Patient Role
range: Current Smoking Status
comment: Added

TestDate
type: DatatypeProperty
comment: Patient Blood Test report

has Breathing Rate
type: DatatypeProperty
comment: Added

has Current Resp
type: DatatypeProperty
comment: Added

reportable Date
type: DatatypeProperty
comment: Added
comment: DateTime format" CCYY-MM-DDThh:mm:ss

Acute Heart Failure
type: Class
subclass of: Heart Failure
comment: Acute heart failuredevelops suddenly and symptoms are initially severe.Acute heart failurecan follow a heart attack that has caused damage to an area of ​​your heart. It can also be caused by a sudden lack of ability of the body to compensate for chronic heart failure.

Age
type: Class
subclass of: Risk Factors Indicators
comment: Patient [age >21 and age <100]

Air Polution
type: Class
subclass of: Risk Factors Indicators
comment: Fine particulate matter (particulate matter with diameters less than 2.5 µm or PM2.5) can increase the risk of cardiovascular events.

Body Mass Index BMI
type: Class
subclass of: Risk Factors Indicators
comment: Facts: If BMI is less than 18.5 kg/m2, it falls within the underweight range. If BMI is 18.5 to 24.9 kg/m2, it falls within the Healthy Weight range. If BMI is 25.0 to 29.9 kg/m2, it falls within the overweight range. If your BMI is 30.0 kg/m2 or higher, it falls within the obese range.

Chronic Heart Failure
type: Class
subclass of: Heart Failure
comment: Chronic heart failureis very common. Symptoms appear slowly over time and gradually worsen. If symptoms such as shortness of breath worsen within a very short time in a patient with chronic heart failure, we call it an episode of acute heart failure

Current Smoking Status
type: Class
comment: Added

Diabetes Mellitus
type: Class
subclass of: Risk Factors Indicators
comment: Patients aged 30–40 years with duration of diabetes > 20 years/HbA1c > 75 mmol/mol/persistent albuminuria > 30 mg/day or eGFR < 60 ml/min/proliferative retinopathy/treated hypertension/current smoking/autonomic neuropathy/total cholesterol > 5 mmol/l with reduced HDL/central obesity/family history of premature CVD

Elevated Blood Pressure
type: Class
subclass of: Blood Pressure Category
comment: Normal Blood Pressure: Systolic: (Upper number) = between 120-129 mm Hg Diastolic: (Lower number) =<80 mm Hg

Estimated Glomerular Filteration Rate-eGFR
type: Class
subclass of: Risk Factors Indicators
comment: eGFR (estimated glomerular filtration rate) is a measure of how well your kidneys are working. Your eGFR is an estimated number based on a blood test and your age, sex, and body type.

Genetic Predisposition
type: Class
subclass of: Risk Factors Indicators
comment: Approximately 40% of the risk for cardiovascular disease lies in hereditary factors.1 DNA, located within genes, is hereby crucial. Molecular biology or cytogenetic tests can determine ones’ predisposition from genetic material.

HDL Cholesterol-Desireable
type: Class
subclass of: HDL Cholesterol
comment: Men: 60 mg/dL (1.6 mmol/L) or above Women: 60 mg/dL (1.6 mmol/L) or above

HDL Cholesterol At Risk
type: Class
subclass of: HDL Cholesterol
comment: Men: Less than 40 mg/dL (1.0 mmol/L) Women: Less than 50 mg/dL (1.3 mmol/L)

High Blood Pressure-HyperTension Stage-1
type: Class
subclass of: Blood Pressure Category
comment: High Blood Pressure Stage-1: Systolic (Upper number): between 130-139 mm Hg Diastolic (Lower number): between 80-89 mm Hg

High Blood Pressure-HyperTension Stage-2
type: Class
subclass of: Blood Pressure Category
comment: High Blood Pressure Stage-2: Systolic (Upper number): Ranged [140 or Higher] mm Hg Diastolic (Lower number): Ranged [90 or Higher] mm Hg

Hypertensive Crisis
type: Class
subclass of: Blood Pressure Category
comment: Hypertensive Crisis (Consult your docotor immediately): Systolic (Upper number): Ranged [Higher than 180] mm Hg Diastolic (Lower number): Ranged [Higher than 120] mm Hg

Ischemic Heart Disease
type: Class
subclass of: Stroke
comment: Ischemic strokes are caused by interruption of the blood supply to the brain, while hemorrhagic strokes result from the rupture of a blood vessel or an abnormal vascular structure. About 87% of strokes are ischemic, the rest being hemorrhagic.

Non-alcohoolic Fatty Liver Disease
type: Class
subclass of: Risk Factors Indicators
comment: Nonalcoholic fatty liver disease (NAFLD) is associated with an increased risk for future cardiovascular disease (CVD), including coronary heart disease (CHD), heart failure, stroke, and arrhythmia.1

Normal Blood Pressure
type: Class
subclass of: Blood Pressure Category
comment: Normal Blood Pressure: Systolic mm Hg (Upper number)=<120 Diastolic mm Hg (Lower number)=<80

Obesity
type: Class
subclass of: Risk Factors Indicators
comment: Obesity is associated with an increased risk of developing cardiovascular disease (CVD), particularly heart failure (HF) and coronary heart disease (CHD)

Psychosocial Factors
type: Class
subclass of: Risk Factors Indicators
comment: Rapidly accruing evidence from a diversity of disciplines supports the hypothesis that psychosocial factors are related to morbidity and mortality due to cardiovascular diseases

eGFR-Stage-1
type: Class
subclass of: Estimated Glomerular Filteration Rate-eGFR
comment: Normal kidney function Some signs of kidney damage, such as protein in urine (i.e., pee) or physical damage to the kidneys.

eGFR-Stage-2
type: Class
subclass of: Estimated Glomerular Filteration Rate-eGFR
comment: Mild loss of kidney function Signs of kidney damage, such as protein in urine or physical damage to the kidneys

Antihypertensive Agents
type: NamedIndividual
type: Remedies for PreHospital Care
comment: Antihypertensive agents Medicine- To reduce BP and other risk factors of heart disease

Aspirin
type: NamedIndividual
type: Anti-diabetic Medication
type: Cardiac Care Remdies
type: Medication
type: Remedies for PreHospital Care
comment: Aspirin is in a group of medications called salicylates. It works by stopping the production of certain natural substances that cause fever, pain, swelling, and blood clots.

Congenital Heart Disease1
type: NamedIndividual
type: Congenital Heart Disease
type: Cardiovascular Diseases
has ICD-Code: Congenital Heart Disease ICD-10 CM Code-Q24.9
comment: Q24.9: Congenital malformation of heart, unspecified

Entonox
type: NamedIndividual
type: Cardiac Care Remdies
type: Remedies for PreHospital Care
comment: Entonox is a mixture of a gas called nitrous oxide and oxygen. It is also called gas and air. You can breathe in Entonox to control pain and anxiety during some medical tests and procedures.