Vineland Motor Skills Domain
type: Class
type: Quantity Variable
subclass of: Physical And Mental Assessment
comment: This class denotes Vineland Motor Skills Domain

Daily exposure to second hand smoke
type: Class
type: Quality Value
subclass of: Frequently exposed to second hand smoke
comment: This class denotes Daily exposure to second hand smoke
notation: 250

environmental tobacco smoke exposure frequency
type: Class
type: Quantity Variable
type: Node shape
subclass of: environmental tobacco smoke exposure measurement
subclass of: SIO_001367
comment: The frequency at which a subject is exposed to second hand tobacco smoke; measured in days per week, hours per day, etc.

Date of Last Pesticide Treatment Inside Home
type: Class
type: Node shape
subclass of: time interval
subclass of: HHEAR_00062
comment: date of last pesticide treatment inside the home

Adulthood Followup
type: Class
type: Node shape
subclass of: HHEAR_00554
subclass of: Restriction
  some values from: Adulthood Period
  on property: intervalDuring
comment: A study followup that occurs during the Adulthood Period of a subject

Percentile Rank Between 26% and 75%
type: Class
type: Quality Value
type: Node shape
subclass of: Percentile Rank
comment: This class denotes Percentile between 26% and 75%
notation: 957

Endotoxin
type: Class
subclass of: toxin
comment: This class denotes Endotoxin

Trinidad and Tobago
type: geographic region
comment: The country of Trinidad and Tobago
SIO_000313: Outside United States

N-Acetyl-S- (2-hydroxyethyl)-L-cysteine
type: Class
type: Facet Value
subclass of: Volatile Organic Compound
comment: This class denotes N-Acetyl-S- (2-hydroxyethyl)-L-cysteine
notation: HEMA2

(aminomethyl)phosphonic acid
type: Class
type: Node shape
type: Facet Value
subclass of: HHEAR_01374
comment: A member of the class of phosphonic acids that is phosphonic acid substituted by an aminomethyl group. It is a metabolite of the herbicide glyphosate. Source: CHEBI
notation: AMPA

on property: currency
has value: USD

Study Location
type: Class
type: Node shape
subclass of: Location
subclass of: Restriction
  some values from: Study
  on property: SIO_000145
comment: The location where a clinical study is conducted; this could be a hospital, medical school, university, or other research institution.

Vineland Communication Domain
type: Class
type: Quantity Variable
subclass of: Physical And Mental Assessment
comment: This class denotes Vineland Communication Domain

Several times a week exposure to second hand smoke
type: Class
type: Quality Value
subclass of: Frequently exposed to second hand smoke
comment: This class denotes Several times a week exposure to second hand smoke
notation: 251

Mosquito Repellant Exposure
type: Class
type: Node shape
subclass of: HHEAR_00062
comment: exposure to mosquito repellants

Number of Lower Respiratory Tract Infections
type: Class
type: Node shape
subclass of: Physical And Mental Assessment
subclass of: SIO_000794
subclass of: Restriction
  some values from: Lower Respiratory Tract Infection
  on property: SIO_000215
comment: The number of lower respiratory tract infections contracted by a subject during a specified period of time

Cell
type: Class
subclass of: biological entity
subclass of: HHEAR_00177

sequence_alteration
type: Class
type: Node shape
subclass of: allele
comment: A sequence_alteration is a sequence_feature whose extent is the deviation from another sequence.

Pregnancy Followup 6
type: Class
type: Node shape
subclass of: Study Followup 6
comment: This class denotes Pregnancy Followup 6

Probability Score
type: Class
type: Node shape
subclass of: score
comment: A Probability Score is a measure of how good forecasts are in matching observed outcomes.

2-(1-Hydroxy-7-methyloctoxy)carbonylbenzoate
type: Class
type: Node shape
type: Facet Value
subclass of: Phthalate
comment: This class denotes 2-(1-Hydroxy-7-methyloctoxy)carbonylbenzoate
notation: MHINP

Neurological Issues from Infectious Causes of Airway Obstruction
type: Class
type: Quality Value
type: Node shape
subclass of: NCIT C25262
comment: Infectious conditions that cause airway obstruction, e.g. Croup
notation: 412

Interferon gamma
type: Class
type: Facet Value
subclass of: Protein
subclass of: HHEAR_01389
comment: This class denotes Interferon gamma
notation: IFNG

Diagnosis Year
type: Class
type: Node shape
subclass of: year
comment: The year in which a subject is diagnosed with a condition

Vineland Daily Living Skills Domain
type: Class
type: Quantity Variable
subclass of: Physical And Mental Assessment
comment: This class denotes Vineland Daily Living Skills Domain

Language
type: Class
type: Quality Variable
subclass of: Acculturation
comment: This class denotes Language
editorial note: Needs to be rooted in sio

Percentile Rank Less Than Or Equal To 2%
type: Class
type: Quality Value
type: Node shape
subclass of: Percentile Rank
comment: Percentile rank of less than or equal to 2%
notation: 955

glyphosate
type: Class
type: Node shape
type: Facet Value
subclass of: HHEAR_01374
comment: A phosphonic acid resulting from the formal oxidative coupling of the methyl group of methylphosphonic acid with the amino group of glycine. It is one of the most commonly used herbicides worldwide, and the only one to target the enzyme 5-enolpyruvyl-3-shikimate phosphate synthase (EPSPS). Source: ChEBI
notation: GPS

Neurological Issues from Non-infectious Causes of Airway Obstruction
type: Class
type: Quality Value
type: Node shape
subclass of: NCIT C25262
comment: Non-infectious (mostly congenital or cancer) causes for airway obstruction
notation: 413

Vineland Socialization Domain
type: Class
type: Quantity Variable
subclass of: Physical And Mental Assessment
comment: This class denotes Vineland Socialization Domain

Date of Last Lawn Or Garden Pesticide Treatment
type: Class
type: Node shape
subclass of: time interval
subclass of: HHEAR_00062
comment: This class denotes date of last lawn or garden pesticide treatment

FEF 25-75 Predicted Value
type: Class
type: Quality Variable
subclass of: Forced Expiratory Flow at 25-75 Percent
subclass of: Restriction
  on property: hasUnit
  has value: liter
definition: The expected or predicted FEF 25-75 value for a patient based on their demographics (typically age, height, sex, and race) and comparison with a population control group.

Adulthood Baseline
type: Class
type: Node shape
subclass of: Study Baseline
subclass of: Restriction
  some values from: Adulthood Period
  on property: intervalDuring
comment: A study baseline that occurs during the Adulthood Period of a subject

Perfluorooctanoic acid
type: Class
type: Facet Value
subclass of: Perfluoroakyl and Polyfluoroalkyl Substance
comment: This class denotes Perfluorooctanoic acid
notation: PFOA

Nunavut, Canada
type: geographic region
comment: The state, province, or territory of Nunavut, Canada
SIO_000313: Canada

Percentile Rank Between 3% and 10%
type: Class
type: Quality Value
type: Node shape
subclass of: Percentile Rank
comment: This class denotes Percentile between 3% and 10%
notation: 956

Age at First Lower Respiratory Tract Infection
type: Class
type: Quantity Variable
type: Node shape
subclass of: HHEAR_00549
subclass of: age
comment: The age at which a subject contracts their first lower respiratory tract infection

oxidised LDL
type: Class
type: Node shape
subclass of: HHEAR_01391
comment: An oxidised form of low-density lipoprotein (LDL), regulated in vivo by a complex set of biochemical reactions and chiefly stimulated by the presence of necrotic cell debris and free radicals in the endothelium. (Source: ChEBI)
notation: OXLDL

New Hampshire, United States of America
type: geographic region
comment: The state, province, or territory of New Hampshire, United States of America
SIO_000313: Q24460

Recruited At UPMC Magee-Womens Hospital
type: Class
type: Quality Value
type: Node shape
subclass of: Population Group by Recruitment Location
subclass of: Restriction
  on property: SIO_000668
  has value: Q30253944
comment: A population group of study participants that were recruited at UPMC Magee-Womens Hospital
notation: 699

Mullens Verbal Domain
type: Class
type: Quantity Variable
subclass of: Physical And Mental Assessment
subclass of: Restriction
  some values from: CAO_03174
  on property: wasDerivedFrom
subclass of: Restriction
  some values from: CAO_03173
  on property: wasDerivedFrom
definition: A composite score derived from the Mullens Receptive Language and Mullens Expressive Language scales.

Neurological Issues with Spinal Cord
type: Class
type: Quality Value
type: Node shape
subclass of: NCIT C25262
comment: These would include spinal cord and spine injuries our conditions.
notation: 409

native cell
type: Class
subclass of: Cell
comment: This class denotes native cell

biomarker
type: Class
type: Node shape
subclass of: CHEBI_47867
comment: A substance used as an indicator of a biological state. (Source: ChEBI)

Nitrogen Oxide
type: Class
subclass of: Air Pollutant
subclass of: HHEAR_00548
comment: This class denotes Nitrogen Oxide

First Lower Respiratory Tract Infection Occurred Before One Year
type: Class
type: Node shape
subclass of: Age at First Lower Respiratory Tract Infection
comment: Indicates that a subject's first lower respiratory tract infection occurred before they were one year old.

Neurological Issues with Cerebral Spinal Fluid
type: Class
type: Quality Value
type: Node shape
subclass of: NCIT C25262
comment: Conditions that cause obstruction to cerebral spinal fluid flow or absorption
notation: 410

docosanoic acid
type: Class
type: Facet Value
subclass of: Fatty Acid
notation: C220
definition: A straight-chain, C22, long-chain saturated fatty acid.

Mullens Non-Verbal Domain
type: Class
type: Quantity Variable
subclass of: Physical And Mental Assessment
subclass of: Restriction
  some values from: CAO_03171
  on property: wasDerivedFrom
subclass of: Restriction
  some values from: CAO_03172
  on property: wasDerivedFrom
definition: A composite score derived from the Mullens Visual Reception and Mullens Fine Motor scales..

Water Utility
type: Class
type: Quality Value
type: Node shape
subclass of: Water Source
comment: public utility responsible for water supply and wastewater disposal (Source: wikidata.org)
notation: 993

microgram per gram
type: Class
type: unit of measurement
subclass of: concentration unit
notation: ug/g

Recruited At Columbia University
type: Class
type: Quality Value
type: Node shape
subclass of: Population Group by Recruitment Location
comment: A population group of study participants that were recruited at Columbia University
notation: 571

Saint Vincent and the Grenadines
type: geographic region
comment: The country of Saint Vincent and the Grenadines
SIO_000313: Outside United States

Postnatal Period
type: Class
type: Node shape
subclass of: time interval
comment: The time period after birth.

kilodalton
type: unit of measurement
notation: kDa

Interleukin-17F
type: Class
type: Facet Value
subclass of: Protein
subclass of: HHEAR_01389
comment: This class denotes Interleukin-17F
notation: IL17F

SIO_000980
type: Quality Value
notation: 107

Behavioral Experimental Paradigm Condition
type: Class
subclass of: HHEAR_00198
comment: This class denotes Behavioral Experimental Paradigm Condition

Afghanistan
type: geographic region
comment: The country of Afghanistan
SIO_000313: Outside United States

Recruited At Indiana University
type: Class
type: Quality Value
type: Node shape
subclass of: Population Group by Recruitment Location
subclass of: Restriction
  on property: SIO_000668
  has value: Q1079140
comment: A population group of study participants that were recruited at Indiana University
notation: 696

e-cigarette behavior
type: Class
type: Node shape
subclass of: NBO_0001845
comment: Inhaling and exhaling the vapors produced by electronic cigarette, or "vaping" devices.

Skin rash
type: Class
type: Quality Value
subclass of: HP_0011123
comment: A red eruption of the skin.
notation: 426

dalton
type: unit of measurement
notation: Da

SIO_000981
type: Quality Value
notation: 108

Rarely exposed to second hand smoke from E-cigarettes
type: Class
type: Quality Value
subclass of: environmental e-cigarette smoke exposure measurement
comment: This class denotes Rarely exposed to second hand smoke from E-cigarettes
notation: 258

Lack of spontaneous play
type: Class
subclass of: biological quality
comment: This class denotes Lack of spontaneous play

Mestizo
type: Class
type: Node shape
subclass of: Mixed Ethnicity
comment: (in Latin America) a man of mixed race, especially one having Spanish and indigenous descent.
notation: 904
intersection of: NCIT C17459
intersection of: Indigenous

Percentile Rank Of 0.4%
type: Class
type: Quality Value
type: Node shape
subclass of: Percentile Rank Less Than 2%
comment: A percentile rank value of 0.4%
notation: 1032

HHEAR Ontology v1.12
type: Ontology
version IRI: v1.12
comment: The Human Health Exposure Analysis Resource (HHEAR) measures exposures that cover the breadth of the “exposome,” which encompasses all environmental exposures including chemical, physical, and biological stressors, as well as lifestyle and social environments, from conception through adulthood. Read more at: https://hhearprogram.org

domestic garden
type: Class
type: Node shape
subclass of: environment
comment: A garden that is associated with a human house. This association is generally one of spatial proximity or parthood.

Bisphenol F
type: Class
type: Facet Value
subclass of: CHEBI_33853
comment: This class denotes Bisphenol F
notation: BPF

Amerindian
type: Class
type: Node shape
subclass of: Indigenous
comment: a member of one of the indigenous peoples of the Americas (used chiefly in anthropological and linguistic contexts).
notation: 905

Personal Computer Count
type: Class
type: Quantity Variable
subclass of: Household Appliance Count
definition: The number of personal computers in a household or possessed by a subject
was approved by: PER-Jeanette-Stingone

Drinking Water
type: Class
type: Facet
subclass of: Environmental Material
definition: Drinking water is water which may be consumed by humans with no adverse effects on their health.
definition: Drinking Water

Fms-related tyrosine kinase 3 ligand
type: Class
type: Facet Value
subclass of: Protein
subclass of: HHEAR_01389
comment: This class denotes Fms-related tyrosine kinase 3 ligand
notation: FLT3L

Several times a week exposure to second hand smoke from E-cigarettes
type: Class
type: Quality Value
subclass of: environmental e-cigarette smoke exposure measurement
comment: This class denotes Several times a week exposure to second hand smoke from E-cigarettes
notation: 256

Afro-Ecuadorian
type: Class
type: Quality Value
type: Node shape
subclass of: Non-White Hispanic
comment: A person who identifies as Afro-ecuadorian ethnicity
notation: 1030

skin fold thickness, suprailiac
type: Class
subclass of: Anthropometry
comment: This class denotes skin fold thickness, suprailiac

Rented Single Family House
type: Class
type: Quality Value
type: Node shape
subclass of: HHEAR_00546
comment: A single family house that is rented by the residents living there
notation: 962

Amarela
type: Class
type: Node shape
subclass of: Mixed Ethnicity
comment: Amarela is a yellow skin color that is one of the Brazilian classifications of race [ https://content.iospress.com/articles/statistical-journal-of-the-iaos/sji180471 ] - originates from people with Asian heritage.
notation: 902

Several times a month exposure to second hand smoke from E-cigarettes
type: Class
type: Quality Value
subclass of: environmental e-cigarette smoke exposure measurement
comment: This class denotes Several times a month exposure to second hand smoke from E-cigarettes
notation: 257

systemic lupus erythematosus
type: Class
subclass of: lupus erythematosus
comment: A lupus erythematosus that is an inflammation of connective tissue marked by skin rashes, joint pain and swelling, inflammation of the kidneys and inflammation of the tissue surrounding the heart. (Source: Disease Ontology)

forced vital capacity (FVC)
type: Class
type: Quality Variable
subclass of: CMO_0000094
comment: This class denotes forced vital capacity (FVC)

Percentile Rank Of 0.1%
type: Class
type: Quality Value
type: Node shape
subclass of: Percentile Rank Less Than 2%
comment: A percentile rank value of 0.1%
notation: 1031

Rented Apartment
type: Class
type: Quality Value
type: Node shape
subclass of: Apartment
comment: An apartment that is rented by its residents
notation: 965

South Korea
type: geographic region
comment: The country of South Korea
SIO_000313: Outside United States

Uses Iron Supplement
type: Class
type: Quality Value
subclass of: nutrition intake
comment: This class denotes Uses Iron Supplement
notation: 332

Never exposed to second hand smoke
type: Class
type: Quality Value
subclass of: Second Hand Smoke Exposure by Frequency
subclass of: HHEAR_01126
comment: This class denotes Never exposed to second hand smoke
notation: 254

Inattentive/Distracted - Off Task Behaviors Total Score
type: Class
type: Quality Variable
type: Node shape
subclass of: Total Score
comment: This class denotes Inattentive/Distracted - Off Task Behaviors Total Score

AMAI Socioeconomic Status Level C+
type: Class
type: Node shape
subclass of: High Socioeconomic Status
comment: This class denotes AMAI Socioeconomic Status Level C+

HLA Complex
type: Class
type: Quality Variable
type: Node shape
subclass of: Medical History
subclass of: Protein Family
comment: A family of proteins that are essential for the presentation of peptide antigens on cell surfaces that modulate the host defensive activities of T-cells. This protein family includes major histocompatibility complex (MHC) class I and class II proteins. [Definition Source: NCI]

Subungual Exostosis
type: Class
type: Node shape
subclass of: Disease
comment: A benign lesion that affects the distal phalanx, most often the great toe. Grossly it consists of a cartilage cap and a bony stalk. Microscopically it is characterized by an osteochondromatous proliferation with a gradual transition of a peripheral spindle-cell proliferation to hyaline cartilage to trabecular bone. Pain and swelling are present. Simple resection is usually curative. [Definition Source: NCI]

Has Not Received Developmental Neuropsychological Assessment
type: Class
type: Quality Value
type: Node shape
subclass of: Developmental Neuropsychological Assessment
comment: This class denotes Has Not Received Developmental Neuropsychological Assessment
notation: 958

Forty Eight Hours Prior to Baseline
type: Class
type: Node shape
subclass of: duration
subclass of: Restriction
  some values from: Study Baseline
  on property: intervalMeets
comment: This class denotes Forty Eight Hours Prior to Baseline

molecular messenger
type: Class
subclass of: Thing
comment: This class denotes molecular messenger

fine respirable suspended particulate matter
type: Class
type: Quality Variable
subclass of: respirable suspended particulate matter
comment: A portion of fine respirable suspended particulate matter is a form of particulate matter composed primarily of solid particles each with a diameter of 2.5 micrometers or less. [database_cross_reference: https://en.wikipedia.org/wiki/Particulates]

Folic Acid Vitamin Supplement
type: Class
subclass of: Vitamin
subclass of: Restriction
  some values from: CHEBI_27470
  on property: SIO_000369
comment: This class denotes Folic Acid Vitamin Supplement

Daily Exposure to Second Hand Smoke from E-cigarettes
type: Class
type: Quality Value
subclass of: environmental e-cigarette smoke exposure measurement
comment: This class denotes Daily Exposure to Second Hand Smoke from E-cigarettes
notation: 255

Out of Seat/Physical Movement in Seat - Off Task Behaviors
type: Class
type: Quality Variable
type: Node shape
subclass of: Total Score
comment: This class denotes Out of Seat/Physical Movement in Seat - Off Task Behaviors

AMAI Socioeconomic Status Level C
type: Class
type: Node shape
subclass of: Medium Socioeconomic Status
comment: This class denotes AMAI Socioeconomic Status Level C

Bolivia
type: geographic region
comment: The country of Bolivia
SIO_000313: Outside United States

2-hydroxynaphthalene
type: Class
type: Facet Value
subclass of: polycyclic hydrocarbon
comment: This class denotes 2-hydroxynaphthalene
notation: NAP2

Mulatto
type: Class
type: Node shape
subclass of: Mixed Ethnicity
comment: Mulatto is a racial classification to refer to people of mixed African and European ancestry. Its use is considered outdated and offensive in several languages, including English and Dutch, whereas in languages such as Italian, Spanish and Portuguese it is not, and can even be a source of pride. [ https://en.wikipedia.org/wiki/Mulatto ]
notation: 901

Owned Single Family House
type: Class
type: Quality Value
type: Node shape
subclass of: HHEAR_00546
comment: A single family house that is owned (or mortgaged) by the residents living there
notation: 963

Feeding Method
type: Class
type: Node shape
subclass of: nutrition intake
comment: A description of the technique for the manner in which a subject is administered food. [Definition Source: NCI]

red blood cell morphological measurement
type: Class
subclass of: Thing
comment: This class denotes red blood cell morphological measurement

Study Hospital
type: Class
type: Node shape
subclass of: Hospital
subclass of: Study Location
comment: The hospital at which a study is conducted

Several times a month exposure to second hand smoke
type: Class
type: Quality Value
subclass of: Not Frequently Exposed to Second Hand Smoke
comment: This class denotes Several times a month exposure to second hand smoke
notation: 252

Science Indicator
type: Class
subclass of: Thing
comment: This class denotes Science Indicator

AMAI Socioeconomic Levels Index
type: Class
type: Node shape
subclass of: Socioeconomic Status Index
comment: The Mexican Association of Market Intelligence and Opinion Agencies (AMAI) Socioeconomic Levels Index (NSE)

Has Used Cannabinoids But No Longer
type: Class
type: Quality Value
subclass of: Cannabis Consumption
comment: This class denotes Has Used Cannabinoids But No Longer
notation: 331

Uses Personal Mosquito Repellant
type: Class
type: Quality Value
type: Node shape
subclass of: Mosquito Repellant Exposure
comment: indicates that a subject uses personal mosquito repellant
notation: 1029

Pregnancy Followup 7
type: Class
type: Node shape
subclass of: Study Followup 7
comment: This class denotes Pregnancy Followup 7

Iron Vitamin Supplement
type: Class
subclass of: Vitamin
subclass of: Restriction
  some values from: CHEBI_18248
  on property: SIO_000369
comment: This class denotes Iron Vitamin Supplement

Duration of Smoking at Least One Cigarette Per Day
type: Class
type: Node shape
subclass of: OBA_2050116
comment: duration a subject has smoked at least one cigarette per day

Rarely exposed to second hand smoke
type: Class
type: Quality Value
subclass of: Not Frequently Exposed to Second Hand Smoke
comment: This class denotes Rarely exposed to second hand smoke
notation: 253

AMAI Socioeconomic Status Level A/B
type: Class
type: Node shape
subclass of: High Socioeconomic Status
comment: This class denotes AMAI Socioeconomic Status Level A/B

Vietnam
type: geographic region
comment: The country of Vietnam
SIO_000313: Outside United States

ARC syndrome
type: Class
type: Quality Value
subclass of: phenotype
comment: This class denotes ARC syndrome
notation: 1019

Pregnancy Followup 8
type: Class
type: Node shape
subclass of: Study Followup 8
subclass of:
  intersection of: Restriction
    some values from: Pregnancy Followup 7
    on property: intervalAfter
comment: This class denotes Pregnancy Followup 8

Has Received Developmental Neuropsychological Assessment
type: Class
type: Quality Value
type: Node shape
subclass of: Developmental Neuropsychological Assessment
comment: This class denotes Has Received Developmental Neuropsychological Assessment
notation: 959

Age of 18 Years or Older
type: Class
type: Node shape
type: Facet Value
subclass of: age
comment: The age range of a subject starting at the beginning of their eighteenth year.

on property: minValue
has value: 1000

Armenia
type: geographic region
comment: The country of Armenia
SIO_000313: Outside United States

N-Acetyl-S-(phenyl)-L-cysteine(ng/mL)
type: Class
subclass of: Volatile Organic Compound
comment: This class denotes N-Acetyl-S-(phenyl)-L-cysteine(ng/mL)
notation: VOCPMA
editorial note: To Do: align with CHEBI.

Result repeated with diluted sample
type: Class
subclass of: comment
comment: This class denotes Result repeated with diluted sample

Boiler Count
type: Class
type: Quantity Variable
subclass of: Household Appliance Count
definition: A boiler is an object that heats up water. This attribute quantifies the number of boilers in the home.
was approved by: PER-Jeanette-Stingone

skin fold thickness, tricep
type: Class
subclass of: Anthropometry
comment: This class denotes skin fold thickness, tricep

Does Not Use Antibiotics
type: Class
type: Quality Value
type: Node shape
subclass of: Pharmacotherapy
comment: Indicates that a subject does not currently (or during a specified time period) use antibiotics
notation: 647
disjoint with: Uses Antibiotics

Puff of Albuterol
type: Class
type: Node shape
subclass of: dose
subclass of: Uses Albuterol Inhaler
subclass of: Restriction
  some values from: albuterol
  on property: SIO_000230
comment: A single administration of inhaled Albuterol

Number of Puffs of Albuterol Since Going to Sleep
type: Class
type: Quantity Variable
type: Node shape
subclass of: Number of Puffs of Albuterol
subclass of: Number of Nights of Albuterol Use
comment: This class denotes Number of Puffs of Albuterol Since Going to Sleep

Study Population
type: Class
type: Node shape
type: Facet Category
subclass of: Study Indicator
comment: This class denotes Study Population

Bahrain
type: geographic region
comment: The country of Bahrain
SIO_000313: Outside United States

Uzbekistan
type: geographic region
comment: The country of Uzbekistan
SIO_000313: Outside United States

Result repeated and confirmed
type: Class
subclass of: comment
comment: This class denotes Result repeated and confirmed

N-Acetyl-S-(trichlorovinyl)-L-cys(ng/mL)
type: Class
subclass of: Volatile Organic Compound
comment: This class denotes N-Acetyl-S-(trichlorovinyl)-L-cys(ng/mL)
notation: VOCTCV
editorial note: To Do: align with CHEBI.

Los Angeles
type: Quality Value
type: NamedIndividual
type: geographic region
comment: largest city in California, United States
notation: 1203
SIO_000313: Q99

Buccal Cell
type: Class
subclass of: Cell
definition: Cells collected from the inner epithelium of the cheek

skin fold thickness, subscapular
type: Class
subclass of: Anthropometry
comment: This class denotes skin fold thickness, subscapular

Does Not Breastfeed
type: Class
type: Quality Value
type: Node shape
subclass of: Feeding Method
comment: Indicates that a mother does not currently (or during a specified period of time) breastfeed her child.
notation: 648

Assessment
type: Class
type: Node shape
subclass of: AnalyticalMethod
comment: A measurement, evaluation, or judgment for a study variable pertaining to the status of a subject.

N-Acetyl-S-(n-propyl)-L-cysteine(ng/mL)
type: Class
subclass of: Volatile Organic Compound
comment: This class denotes N-Acetyl-S-(n-propyl)-L-cysteine(ng/mL)
notation: VOCBPM
editorial note: To Do: align with CHEBI.

Reverse-Phase Mass Spectrometry Profiling
type: Class
subclass of: Mass Spectrometry
comment: This class denotes Reverse-Phase Mass Spectrometry Profiling

Bathroom Count
type: Class
type: Quantity Variable
subclass of: Room Count
definition: Total Number of Bathrooms in the Home
was approved by: PER-Jeanette-Stingone

Annual Income More Than $50,000
type: Class
type: Quality Value
type: Node shape
subclass of: NCIT C70811
subclass of:
  on property: maxValue
subclass of:
  on property: minValue
  has value: 50000
subclass of:
  on property: SIO_000900
  has value: year
subclass of:
  on property: currency
  has value: USD
comment: This class denotes Annual Income More Than $50,000
notation: 731

Age From 02 to 12 Years Old
type: Class
type: Quality Value
type: Node shape
type: Facet Value
subclass of: age
comment: The age range of a subject starting at the beginning of their second year and ending at the end of their twelfth year.
notation: 1047

Montelukast (Singulair)
type: Class
subclass of: Asthma Controller Medication
comment: This class denotes Montelukast (Singulair)

3-(Ethylcarbamoyl)benzoic acid
type: Class
type: Node shape
type: Facet Value
subclass of: HHEAR_01374
comment: This class denotes 3-(Ethylcarbamoyl)benzoic acid
notation: ECBA

Result reported based on fewer replicates than required
type: Class
subclass of: comment
comment: This class denotes Result reported based on fewer replicates than required

N-Acetyl-S-(phenyl)-L-cysteine
type: Class
subclass of: Volatile Organic Compound
comment: This class denotes N-Acetyl-S-(phenyl)-L-cysteine
notation: PMA
editorial note: To Do: align with CHEBI.

Bedroom Count
type: Class
type: Quantity Variable
subclass of: Room Count
definition: Total Number of Bedrooms in the Home
was approved by: PER-Jeanette-Stingone

Living Quarters
type: Class
subclass of: Human Dwelling
comment: Housing in which people can reside. (Source: NCI Thesaurus)

Number of Puffs of Albuterol
type: Class
type: Quantity Variable
type: Node shape
subclass of: SIO_000794
subclass of: Prescription Medication and Dietary Supplements
comment: This class denotes Number of Puffs of Albuterol

Age From 13 to 17 Years Old
type: Class
type: Quality Value
type: Node shape
type: Facet Value
subclass of: age
comment: The age range of a subject starting at the beginning of their thirteenth year and ending at the end of their seventeenth year.
notation: 1048

Non-Alcoholic Fatty Liver Disease Activity Score
type: Class
type: Node shape
subclass of: Research or Clinical Assessment Tool
subclass of: Restriction
  some values from: non-alcoholic fatty liver disease
  on property: SIO_000668
comment: The histopathological evaluation of nonalcoholic fatty liver disease (NAFLD) and nonalcoholic steatohepatitis (NASH) based on the NAFLD scoring system. (Kleiner DE, Brunt EM, Van Natta M, Behling C, Contos MJ, Cummings OW, Ferrell LD, Liu YC, Torbenson MS, Unalp-Arida A, Yeh M, McCullough AJ, Sanyal AJ; Nonalcoholic Steatohepatitis Clinical Research Network. Design and validation of a histological scoring system for nonalcoholic fatty liver disease. Hepatology. 2005 Jun;41(6):1313-21.) (Source: NCI Thesaurus)

Vineland adaptive behavior scales-daily living - domestic
type: Class
subclass of: Vineland Daily Living Skills Domain
comment: This class denotes Vineland adaptive behavior scales-daily living - domestic

Pregnancy Followup 5
type: Class
type: Node shape
subclass of: Study Followup 5
comment: This class denotes Pregnancy Followup 5

N-Acetyl-S-(benzyl)-L-cysteine(ng/mL)
type: Class
subclass of: Volatile Organic Compound
comment: This class denotes N-Acetyl-S-(benzyl)-L-cysteine(ng/mL)
notation: VOCBMA
editorial note: To Do: align with CHEBI.

Apgar Score
type: Class
type: Quantity Variable
subclass of: SIO_001112
subclass of: HHEAR_00036
subclass of: Restriction
  on property: SIO_000300
  all values from: Datatype
    intersection of: Datatype
      on datatype: integer
definition: A method to quickly summarize the health of newborn children. The Apgar score was invented by Virginia Apgar in 1952 when Apgar was an anesthesiologist who developed the score in order to ascertain the effects of obstetric anesthesia on babies. The Apgar scale is determined by evaluating the newborn baby on five simple criteria on a scale from zero to two, then summing up the five values thus obtained. The resulting Apgar score ranges from zero to 10. The five criteria are summarized using words chosen to form a backronym (Appearance, Pulse, Grimace, Activity, Respiration).
was approved by: PER-Jeanette-Stingone

abdominal visceral fat area
type: Class
type: Quantity Variable
subclass of: CMO_0000311
comment: Area of adipose tissue within the muscle wall surrounding the abdominal cavity. (Source: Clinical Measurement Ontology)

Facet Value
type: Node shape
type: Class
subclass of: Class
comment: A class used as a value for a search facet

sequence_variant
type: Class
type: Node shape
subclass of: SIO_000030
comment: This class denotes sequence_variant

Chronic Maternal Hypertension
type: Class
type: Quality Value
type: Node shape
subclass of: hypertension
comment: Hypertension that predates pregnancy. (Source: NCI Thesaurus)
notation: 585

Bisphenol A bis(2,3-dihydroxypropyl) ether
type: Class
type: Node shape
type: Facet Value
subclass of: HHEAR_01385
comment: This class denotes Bisphenol A bis(2,3-dihydroxypropyl) ether
notation: BADGE2H2O

Ferrous sulfate
type: Class
type: Node shape
subclass of: HHEAR 2348
comment: A sulfate salt of mineral iron formulated for oral administration and used as a dietary supplement, ferrous sulfate is absorbed in the stomach and small intestine and combines with apoferritin to form ferritin, which is stored in the liver, spleen, red bone marrow, and intestinal mucosa. Important in transport of oxygen by hemoglobin to the tissues, iron is also found in myoglobin, transferrin, and ferritin, and is a component of many enzymes such as catalase, peroxidase, and cytochromes. (Source: NCI Thesaurus)

Vineland adaptive behavior scales-written communication
type: Class
subclass of: Vineland Communication Domain
comment: This class denotes Vineland adaptive behavior scales-written communication

N-Acetyl-S-(n-propyl)-L-cysteine
type: Class
type: Facet Value
subclass of: Volatile Organic Compound
comment: This class denotes N-Acetyl-S-(n-propyl)-L-cysteine
notation: BPMA
editorial note: To Do: align with CHEBI.

Arsenic Species
type: Class
type: Facet
subclass of: Targeted Analyte
notation: UAS
definition: A molecular entity with arsenic components.

8-isoprostane
type: Class
subclass of: HHEAR_00034
subclass of: Biomolecule
comment: This class denotes 8-isoprostane

Annual Income $45,000 to $49,999
type: Class
type: Quality Value
type: Node shape
subclass of: Annual Income $45,000 to $54,999
subclass of: Annual Income $40,000 to $49,999
subclass of:
  on property: SIO_000900
  has value: year
subclass of:
  on property: minValue
  has value: 45000
comment: This class denotes Annual Income $45,000 to $49,999
notation: 730

rs10517086
type: Class
type: Node shape
subclass of: SNP
comment: This class denotes rs10517086

Age From 00 to 01 Years Old
type: Class
type: Quality Value
type: Node shape
type: Facet Value
subclass of: age
comment: The age range of a subject starting at birth and ending at the end of the subject's first year.
notation: 1046

FEF 25-75 Best Value
type: Class
type: Quantity Variable
subclass of: Forced Expiratory Flow at 25-75 Percent
subclass of: Restriction
  on property: hasUnit
  has value: liter
definition: The best FEF 25-75 value achieved by a subject during a series of FEF 25-75 measurements.

Vineland adaptive behavior scales-maladaptive behavior
type: Class
subclass of: Vineland Socialization Domain
comment: This class denotes Vineland adaptive behavior scales-maladaptive behavior

Pregnancy Followup 3
type: Class
type: Node shape
subclass of: Study Followup 3
subclass of:
  intersection of: Restriction
    some values from: Pregnancy Followup 2
    on property: intervalAfter
  intersection of: Restriction
    some values from: Pregnancy
    on property: intervalDuring
comment: This class denotes Pregnancy Followup 3

N-Acetyl-S-(N-methylcarbamoyl)-L-cysteine
type: Class
type: Facet Value
subclass of: Volatile Organic Compound
comment: This class denotes N-Acetyl-S-(N-methylcarbamoyl)-L-cysteine
notation: AMCC
editorial note: To Do: align with CHEBI.

Shop
type: Class
type: Quality Value
type: Node shape
subclass of: Workplace
comment: A building in which a business presents a selection of goods and offers to trade or sell them to customers for money or other goods. (Source: Environment Ontology)
notation: 981

Uses Pesticide On Lawn Or Garden
type: Class
type: Quality Value
type: Node shape
subclass of: Uses Pesticide
subclass of: Outdoor Pesticide Usage Exposure
comment: uses pesticides on a home lawn or garden
notation: 1028

Facet Category
type: Node shape
type: Class
subclass of: Class
comment: A class used as the top-level category for a search facet

Nitric Oxide
type: Class
subclass of: Air Pollutant
comment: This class denotes Nitric Oxide

Pregnancy Followup 4
type: Node shape
type: Class
subclass of: Study Followup 4
subclass of:
  intersection of: Restriction
    some values from: Pregnancy Followup 3
    on property: intervalAfter

N-Acetyl-S-(benzyl)-L-cysteine
type: Class
type: Facet Value
subclass of: Volatile Organic Compound
comment: This class denotes N-Acetyl-S-(benzyl)-L-cysteine
notation: BMA
editorial note: To Do: align with CHEBI.

Vineland adaptive behavior scales-daily living - community
type: Class
subclass of: Vineland Daily Living Skills Domain
comment: This class denotes Vineland adaptive behavior scales-daily living - community

Dialkyl Phosphate Pesticide Metabolite
type: Class
type: Facet
subclass of: Targeted Analyte
comment: This class denotes Dialkyl Phosphate Pesticide Metabolite
notation: UPEST

Carbon Tetrachloride
type: Class
type: Facet Value
subclass of: Volatile Organic Compound
notation: CTET
definition: CARBON TETRACHLORIDE is a solvent for oils, fats, lacquers, varnishes, rubber waxes, and resins, and a starting material in the manufacturing of organic compounds. Poisoning by inhalation, ingestion or skin absorption is possible and may be fatal. (Merck Index, 11th ed)

Facet
type: Node shape
type: Class
subclass of: Class
comment: A class used as a search facet

Associate's Degree or Technical Degree
type: Class
type: Quality Value
type: Node shape
subclass of: Some College or Technical School
comment: Completed either an associate's degree or a technical degree
notation: 591
equivalent class: Class
  equivalent class: Associate's Degree or Technical Degree

Pre-Menarche
type: Class
type: Quality Value
type: Node shape
subclass of: Life Stage
subclass of: Restriction
  some values from: Menarche
  on property: intervalMeets
comment: The time period for a child that ends at the onset of menarche.
notation: 676

urban area
type: Class
type: Node shape
subclass of: geographic region
comment: large area with high population density and infrastructure of built environment (Source: wikidata.org)

Vineland adaptive behavior scales-expressive communication
type: Class
subclass of: Vineland Communication Domain
comment: This class denotes Vineland adaptive behavior scales-expressive communication

Phenanthrene tetrol
type: Class
type: Facet Value
subclass of: polycyclic hydrocarbon
comment: This class denotes Phenanthrene tetrol
notation: PHET

Screening
type: Class
subclass of: time interval
definition: The time period during which a screening process is used to determine the inclusion of a subject in a study.
was approved by: PER-Jeanette-Stingone

SIO_000982
type: Quality Value
notation: 106

Post-Menarche
type: Class
type: Quality Value
type: Node shape
subclass of: Life Stage
subclass of: Restriction
  some values from: Menarche
  on property: intervalMetBy
comment: The time period for a child that begins at the ending of menarche.
notation: 675

Recruited At Case Western Reserve University
type: Class
type: Quality Value
type: Node shape
subclass of: Population Group by Recruitment Location
subclass of: Restriction
  on property: SIO_000668
  has value: Q1047060
comment: A population group of study participants that were recruited at Case Western Reserve University
notation: 570

pulse wave velocity
type: Class
subclass of: Physical And Mental Assessment
subclass of: SIO_001369
comment: This class denotes pulse wave velocity

plaque forming unit
type: unit of measurement
notation: pfu

Prenatal Period
type: Class
type: Node shape
subclass of: time interval
comment: The time period prior to birth.

Mono-2-ethyl-5-oxohexylterephthalate
type: Class
type: Facet Value
subclass of: Phthalate
comment: This class denotes Mono-2-ethyl-5-oxohexylterephthalate
notation: MEOHTP

Samples Arrived Thawed and Analyzed
type: Class
subclass of: comment
comment: This class denotes Samples Arrived Thawed and Analyzed

Terrace House
type: Class
type: Quality Value
type: Node shape
subclass of: Multi Residence Building
comment: form of medium-density housing (Source: Wikidata)
notation: 786
alternative label: Row House

Has Used Illegal Drugs or Non-Prescribed Pharmaceutical Drugs
type: Class
type: Quality Value
type: Node shape
subclass of: Drug History
subclass of: Consumption of an Addictive Substance
comment: Has used illegal drugs, or non-prescribed pharmaceutical drugs, either currently or in the past
notation: 610

Tanner Scale For Female Pubic Hair Development (Assigned By Child)
type: Class
type: Quality Variable
type: Node shape
subclass of: Tanner Scale For Female Pubic Hair Development
comment: A rating of the Tanner Scale for Female Pubic Hair Development as assigned by the child

Study Followup Day 2
type: Class
type: Node shape
subclass of: Study Activity
subclass of: Restriction
  some values from: HHEAR_00554
  on property: intervalDuring
subclass of: Restriction
  some values from: Study Followup Day 1
  on property: intervalAfter
comment: The second day of a study followup activity

plaque forming unit per milliliter
type: unit of measurement
notation: pfu/ml

Vineland adaptive behavior scales-daily living - personal
type: Class
subclass of: Vineland Daily Living Skills Domain
comment: This class denotes Vineland adaptive behavior scales-daily living - personal

international units per litre
type: unit of measurement
notation: IU/L

Tanner Scale For Male Pubic Hair Development (Assigned By Child)
type: Class
type: Quality Variable
type: Node shape
subclass of: Tanner Scale For Male Pubic Hair Development
comment: A rating of the Tanner Scale for Male Pubic Hair Development as assigned by the child

Associate's Degree
type: Class
type: Quality Value
type: Node shape
subclass of: HHEAR_00043
subclass of: Associate's Degree or Technical Degree
comment: Completed an associate's degree
notation: 681

colony forming unit per milliliter
type: unit of measurement
notation: cfu/ml

billion parts per microgram
type: unit of measurement
notation: x109 µL

Vineland adaptive behavior scales-receptive communication
type: Class
subclass of: Vineland Communication Domain
comment: This class denotes Vineland adaptive behavior scales-receptive communication

max exclusive: 18.5

Bisphenol S
type: Class
type: Facet Value
subclass of: CHEBI_33853
comment: This class denotes Bisphenol S
notation: BPS

Zika fever
type: Class
type: Quality Value
subclass of: DOID 934
comment: This class denotes Zika fever
notation: 1065

tributyl phosphate
type: Class
type: Node shape
subclass of: HHEAR_01372
comment: A trialkyl phosphate that is the tributyl ester of phosphoric acid. (Source: ChEBI)
notation: TNBP

cortisone
type: Class
type: Node shape
type: Facet Value
subclass of: HHEAR_01392
comment: This class denotes cortisone
notation: CORTE

leiomyoma
type: Class
subclass of: phenotype
subclass of: cell type benign neoplasm
comment: This class denotes leiomyoma

Gestational Age From 32 to 34 Weeks
type: Class
type: Quality Value
type: Node shape
subclass of: Gestational Age
comment: The gestational age range of a fetus beginning at the start of week 32 and ending immediately before the beginning of week 34
notation: 589

Tanner Scale For Breast Development (Assigned By Child)
type: Class
type: Quality Variable
type: Node shape
subclass of: Tanner Scale For Breast Development
comment: A rating of the Tanner Scale for Breast Development as assigned by the child

Study Followup Day 1
type: Class
type: Node shape
subclass of: Study Activity
subclass of: Restriction
  some values from: HHEAR_00554
  on property: intervalDuring
comment: The first day of a study followup activity

Cement Floor
type: Class
type: Quality Value
subclass of: Floor Covering By Type
notation: 10
definition: Cement Floor Type
was approved by: PER-Jeanette-Stingone

Algeria
type: geographic region
comment: The country of Algeria
SIO_000313: Outside United States

Sample frozen
type: Class
subclass of: comment
comment: This class denotes Sample frozen

obsolete anterior cell
type: Class
subclass of: Cell
comment: This class denotes obsolete anterior cell

Tanner Scale For Genital Development (Assigned By Child)
type: Class
type: Quality Variable
type: Node shape
subclass of: Tanner Scale For Genital Development
comment: A rating of the Tanner Scale for Genital Development as assigned by the child

Gestational Age From 34 to 36 Weeks
type: Class
type: Quality Value
type: Node shape
subclass of: Gestational Age
comment: The gestational age range of a fetus beginning at the start of week 34 and ending immediately before the beginning of week 36
notation: 590

Childhood Followup Day 1
type: Class
type: Node shape
subclass of: Study Followup Day 1
subclass of: Restriction
  some values from: HHEAR_00553
  on property: intervalDuring
comment: The first day of a study followup activity that occurs during a subject's childhood period

disintegrations per second
type: unit of measurement
notation: dps

2-hydroxyphenanthrene + 3-hydroxyphenanthrene
type: Class
type: Facet Value
subclass of: polycyclic hydrocarbon
subclass of: Restriction
  some values from: 3-hydroxyphenanthrene
  on property: SIO_000369
subclass of: Restriction
  some values from: 2-hydroxyphenanthrene
  on property: SIO_000369
comment: This class denotes 2-hydroxyphenanthrene + 3-hydroxyphenanthrene
notation: PHEN2PHEN3

Run out-of-contol; insufficient sample for repeat analysis
type: Class
subclass of: comment
comment: This class denotes Run out-of-contol; insufficient sample for repeat analysis

concentration
type: Class
type: Quantity Variable
subclass of: Laboratory Result
comment: This class denotes concentration

Received Special Education
type: Class
type: Quality Value
type: Node shape
subclass of: Education
comment: Indicates that a subject received special education.
notation: 649

Number of Puffs of Albuterol Since Peak Flow in AM
type: Class
type: Quantity Variable
type: Node shape
subclass of: Number of Puffs of Albuterol
subclass of: Number of Nights of Albuterol Use
comment: This class denotes Number of Puffs of Albuterol Since Peak Flow in AM

Pregnancy Month 2
type: Class
subclass of: time interval
definition: The second month of pregnancy

Mouse Stool
type: Class
type: Node shape
subclass of: biological fluid
comment: This class denotes Mouse Stool

Caesarian Section
type: Class
type: Quality Value
subclass of: Pregnancy Characteristic
subclass of: Route Of Delivery
notation: 20
definition: Caesarian Section Medical Procedure. One-third of pregnancies in the US end in C-Sections.

Datatype
with restrictions:
  min exclusive: 25.0
on datatype: float

milligrams-microunits per deciliter-milliliter
type: unit of measurement
notation: (mg/dL)*(µU/mL)

Sample older than 2 weeks
type: Class
subclass of: comment
comment: This class denotes Sample older than 2 weeks

Budesonide DPI (Pulmicort)
type: Class
subclass of: Asthma Controller Medication
comment: This class denotes Budesonide DPI (Pulmicort)

Total Cholesterol
type: Class
type: Node shape
subclass of: cholesterol
comment: The mereological sum of all three cholesterols, VLDL, LDL, and HDL
notation: CHOL

Gestational Age From 28 to 32 Weeks
type: Class
type: Quality Value
type: Node shape
subclass of: Gestational Age
comment: The gestational age range of a fetus beginning at the start of week 28 and ending immediately before the beginning of week 32
notation: 588

Study Activity
type: Class
type: Node shape
subclass of: time interval
comment: An event or activity that occurs as part of a scientific study. Such events may include interviewing subjects, administering tests to subjects, or collecting biological samples or environmental samples.

Pregnancy Month 3
type: Class
subclass of: time interval
definition: The third month of pregnancy

Canned Food Consumption Frequency
type: Class
type: Quantity Variable
subclass of: Diet Quantity
subclass of: SIO_001367
subclass of: Restriction
  some values from: Eats Canned Food
  on property: SIO_000215
definition: Frequency of Canned Food Consumption.
was approved by: PER-Jeanette-Stingone
editorial note: Also want to list this under Environmental Exposures (b/c canned food has chemicals in the lining so sometimes it is used as a proxy)

Cadmium
type: Class
type: Facet Value
subclass of: Metal
subclass of: HHEAR_01387
notation: Cd
definition: An element with atomic symbol Cd, atomic number 48, and atomic weight 114. It is a metal and ingestion will lead to CADMIUM POISONING.

volt
type: unit of measurement
notation: Volt

Partner
type: Class
type: Node shape
subclass of: SIO_000016
comment: A person that is associated with another person in some manner or action. (Source: NCI Thesaurus)

Sample integrity/quality compromised preventing analysis
type: Class
subclass of: comment
comment: This class denotes Sample integrity/quality compromised preventing analysis

umbilical cord blood
type: Class
type: Facet
subclass of: Pregnancy Sample
subclass of: Whole Blood
definition: Blood that remains in the placenta and in the attached umbilical cord after childbirth[WP]. [database_cross_reference: http://en.wikipedia.org/wiki/Cord_blood]

Scoliosis or Spinal Surgery
type: Class
type: Quality Value
subclass of: Thing
comment: This class denotes Scoliosis or Spinal Surgery
notation: 443
equivalent class: Class
  union of: scoliosis
  union of: Spinal Surgery
  equivalent class: Scoliosis or Spinal Surgery

Overweight (BMI 25-29.9) and no hypertensive disorder and no diabetes
type: Class
type: Quality Value
subclass of: Overweight BMI
subclass of: Class
  intersection of: Overweight BMI
  intersection of: Class
    complement of: Any hypertensive disorder or any diabetes, any BMI
comment: This class denotes Overweight (BMI 25-29.9) and no hypertensive disorder and no diabetes
notation: 328

Fluticasone furoate DPI (Arnuity Ellipta)
type: Class
subclass of: Asthma Controller Medication
comment: This class denotes Fluticasone furoate DPI (Arnuity Ellipta)

Autism
type: Class
type: Node shape
type: Facet
subclass of: HP_0000118
comment: Autism is a neurodevelopmental disorder characterized by impaired social interaction and communication, and by restricted and repetitive behavior. Autism begins in childhood. It is marked by the presence of markedly abnormal or impaired development in social interaction and communication and a markedly restricted repertoire of activity and interest. Manifestations of the disorder vary greatly depending on the developmental level and chronological age of the individual (DSM-IV).

Household Does Not Have a Personal Computer
type: Class
type: Quality Value
type: Node shape
subclass of: Personal Computer Count
comment: Indicates that a household does not have a personal computer.
notation: 1133

chromosomal disease
type: Class
subclass of: Comorbidity Disease
comment: This class denotes chromosomal disease

meconium
type: Class
type: Facet
subclass of: feces
subclass of: Pregnancy Sample
definition: A dark greenish mass that accumulates in the bowel during fetal life and is discharged shortly after birth. [database_cross_reference: BTO:0000838]

Multidimensional Anxiety Scale for Children
type: Class
type: Node shape
subclass of: Anxiety Scale
comment: This class denotes Multidimensional Anxiety Scale for Children

Obese (BMI >30) and no hypertensive disorder and no diabetes
type: Class
type: Quality Value
subclass of: Obese BMI
subclass of: Class
  intersection of: Obese BMI
comment: This class denotes Obese (BMI >30) and no hypertensive disorder and no diabetes
notation: 329

Pacific Islander or Native Hawaiian, non-Hispanic
type: Class
type: Quality Value
subclass of: Non-Hispanic Ethnicity
subclass of: NCIT C41219
comment: This class denotes Pacific Islander or Native Hawaiian, non-Hispanic
notation: 242

Three Months Prior to Pregnancy
type: Class
type: Node shape
subclass of: time interval
comment: A subclass of Pre-pregnancy; the three months immediately prior to conception.

Home Treated For Insects
type: Class
type: Quality Value
type: Node shape
subclass of: Pest Control Treatment
comment: Denotes that a subject's home (interior and/or exterior) has been treated to control insects
notation: 1087

Household Has a Boiler
type: Class
type: Quality Value
type: Node shape
subclass of: Boiler Count
comment: Indicates that a household has at least one boiler device for heating water.
notation: 1134

identifier
type: Class
subclass of: Demographic
comment: This class denotes identifier

Confidence Interval Maximum Value
type: Class
type: Node shape
subclass of: STATO_0000151
subclass of: Restriction
  some values from: confidence interval
  on property: SIO_000215
comment: The upper bound of some confidence interval

PCB52
type: Class
type: Facet Value
subclass of: Polychlorobiphenyl
comment: This class denotes PCB52
notation: PCB52

Turkmenistan
type: geographic region
comment: The country of Turkmenistan
SIO_000313: Outside United States

Household Does Not Have a Toaster
type: Class
type: Quality Value
type: Node shape
subclass of: Toaster Count
comment: Indicates that a household does not have a toaster.
notation: 1131

Stroke, Cerebral Ischemia, or Cerebral infarction
type: Class
type: Quality Value
subclass of: phenotype
comment: This class denotes Stroke, Cerebral Ischemia, or Cerebral infarction
notation: 400
equivalent class: Class
  union of: stroke
  union of: brain ischemia
  union of: DOID 3526
  equivalent class: Stroke, Cerebral Ischemia, or Cerebral infarction

Any hypertensive disorder or any diabetes, any BMI
type: Class
type: Quality Value
subclass of: HHEAR_00549
comment: This class denotes Any hypertensive disorder or any diabetes, any BMI
notation: 330
union of: hypertension
union of: diabetes mellitus

change in body weight
type: Class
subclass of: CMO_0001196
comment: This class denotes change in body weight

kilovolt-hour
type: unit of measurement
notation: kVh

Aguascalientes, Mexico
type: geographic region
comment: The state, province, or territory of Aguascalientes, Mexico
SIO_000313: Q96

exposure
type: Class
type: Node shape
subclass of: Medical History
subclass of: process
comment: The act of subjecting someone or something to an influencing experience. E.g. exposure to cigarette smoke

Spinal Surgery
type: Class
type: Quality Variable
subclass of: surgical procedure
subclass of: Scoliosis or Spinal Surgery
subclass of: Restriction
  some values from: UBERON_0002240
  on property: SIO_000230
comment: This class denotes Spinal Surgery

Household Has a Personal Computer
type: Class
type: Quality Value
type: Node shape
subclass of: Personal Computer Count
comment: Indicates that a household has at least one personal computer.
notation: 1132

Healthy (BMI <25) weight and no hypertensive disorder and no diabetes
type: Class
type: Quality Value
subclass of: Healthy BMI
subclass of: Class
comment: This class denotes Healthy (BMI <25) weight and no hypertensive disorder and no diabetes
notation: 327

food calorie intake rate
type: Class
subclass of: Thing
comment: This class denotes food calorie intake rate

Abnormality of the spinal cord
type: Class
type: Node shape
subclass of: Neurological Issues with Spinal Cord
comment: An abnormality of the spinal cord (myelon).

Kingman Reef, United States of America
type: geographic region
comment: The state, province, or territory of Kingman Reef, United States of America
SIO_000313: United States of America

Rheumatology disorder (SLE, Wegeners, JRA)
type: Class
type: Quality Value
subclass of: Disease
comment: This class denotes Rheumatology disorder (SLE, Wegeners, JRA)
notation: 398
equivalent class: Class
  equivalent class: Rheumatology disorder (SLE, Wegeners, JRA)

Disease
type: Class
subclass of: disease
subclass of: HHEAR_00549
comment: A disease is a disposition (i) to undergo pathological processes that (ii) exists in an organism because of one or more disorders in that organism. (Source: Disease Ontology)

flame retardant
type: Class
type: Node shape
subclass of: Targeted Analyte
comment: Any compound that is added to manufactured materials to inhibit, suppress, or delay the production of flames and so prevent the spread of fire. (Source: CHEBI)

3-phenoxybenzoic acid
type: Class
subclass of: HHEAR_00548
definition: A phenoxybenzoic acid in which the phenoxy group is meta to the carboxy group. It is a metabolite of pyrethroid insecticides.

rs3184504
type: Class
type: Node shape
subclass of: SNP
comment: This class denotes rs3184504

Sepsis, Septic Shock, or SIRS
type: Class
type: Quality Value
subclass of: phenotype
comment: This class denotes Sepsis, Septic Shock, or SIRS
notation: 399
equivalent class: Class
  union of: Sepsis
  union of: SYMP_0000451
  union of: Systemic Inflammatory Response Syndrome
  equivalent class: Sepsis, Septic Shock, or SIRS

Five Months Prior to Followup 4
type: Class
type: Node shape
subclass of: time interval
subclass of: Restriction
  some values from: Study Followup 4
  on property: intervalMeets
comment: A time interval that begins five months prior to a study's fourth follow-up and ends at the beginning of the study's fourth follow-up.

United Arab Emirates
type: geographic region
comment: The country of United Arab Emirates
SIO_000313: Outside United States

kilobyte
type: unit of measurement
notation: kB

microliter
type: unit of measurement
notation: µl

Six Months Prior to Followup 4
type: Class
type: Node shape
subclass of: time interval
subclass of: Restriction
  some values from: Five Months Prior to Followup 4
  on property: intervalContains
comment: A time interval that begins six months prior to a study's fourth follow-up and ends at the beginning of the study's fourth follow-up.

C-C motif chemokine 20
type: Class
type: Facet Value
subclass of: Protein
subclass of: HHEAR_01389
comment: This class denotes C-C motif chemokine 20
notation: MIP3A

Non-infectious Respiratory Distress
type: Class
type: Quality Value
subclass of: Respiratory distress
comment: This class denotes Non-infectious Respiratory Distress
notation: 397
equivalent class: Class
  intersection of: Respiratory distress
  intersection of: Class
    complement of: Restriction
      some values from: Infectious Disorder
      on property: SIO_001157
  equivalent class: Non-infectious Respiratory Distress

byte
type: unit of measurement
notation: Byte

cubic decimeter
type: unit of measurement
notation: dm3

Immunoassay
type: Class
subclass of: Thing
comment: This class denotes Immunoassay

FEV1 Best Value
type: Class
type: Quality Variable
subclass of: forced expiratory volume
subclass of: Restriction
  on property: hasUnit
  has value: liter
definition: The best FEV1 value achieved by a subject during a series of FEV1 measurements

mono (3-carboxypropyl) phthalate (multiple)
type: Class
type: Facet Value
subclass of: Phthalate
comment: This class denotes mono (3-carboxypropyl) phthalate (multiple)
notation: MCPP

on property: currency
has value: USD

Pest Control Treatment Provided By Private Entity
type: Class
type: Quality Value
type: Node shape
subclass of: Pest Control Treatment By Provider
comment: This class denotes pest control treatment provided by private entity
notation: 1027

Pregnancy Followup
type: Class
type: Node shape
subclass of: HHEAR_00554
subclass of:
  intersection of: Restriction
    some values from: Pregnancy Baseline
    on property: intervalAfter
comment: A point in a study that occurs after the initial baseline of the study and occurs during the study subject's pregnancy.

Percentile Rank Between 51% and 75%
type: Class
type: Quality Value
type: Node shape
subclass of: Percentile Rank
comment: This class denotes Percentile between 51% and 75%
notation: 951

N-Acetyl-S-(3-hydroxypropyl-1-methyl)-L-cysteine
type: Class
type: Facet Value
subclass of: Volatile Organic Compound
comment: This class denotes N-Acetyl-S-(3-hydroxypropyl-1-methyl)-L-cysteine
notation: HPMMA
editorial note: To Do: align with CHEBI.

naphthalene
type: Class
type: Node shape
subclass of: polycyclic hydrocarbon
comment: An aromatic hydrocarbon comprising two fused benzene rings. It occurs in the essential oils of numerous plant species e.g. magnolia. (Source: ChEBI Ontology)
notation: NAP

FEV1 Predicted Value
type: Class
type: Quality Variable
subclass of: forced expiratory volume
subclass of: Restriction
  on property: hasUnit
  has value: liter
definition: The expected or predicted FEV1 value for a patient based on their demographics (typically age, height, sex, and race) and comparison with a population control group.

Rhinorrhea
type: Class
type: Node shape
subclass of: HHEAR_00904
comment: Increased discharge of mucus from the nose.

Percentile Rank Greater Than 75%
type: Class
type: Quality Value
type: Node shape
subclass of: Percentile Rank
comment: This class denotes Percentile greater than 75%
notation: 953

anatomical entity
type: Class
subclass of: Thing
comment: A part of a cellular organism that is either an immaterial entity or a material entity with granularity above the level of a protein complex. Or, a substance produced by a cellular organism with granularity above the level of a protein complex. [database_cross_reference: CAROC:Brownsville2014]

Pregnancy Followup 2
type: Class
type: Node shape
subclass of: Study Followup 2
subclass of: Class
comment: A point in a study that occurs after the initial follow-up point in the study and occurs during the study subject's pregnancy.

N-Acetyl-S-(4-hydroxy-2-buten-1-yl)-L-cysteine
type: Class
type: Facet Value
subclass of: Volatile Organic Compound
comment: This class denotes N-Acetyl-S-(4-hydroxy-2-buten-1-yl)-L-cysteine
notation: MHBMA3
editorial note: To Do: align with CHEBI.

Date of Last Pest Control Treatment
type: Class
type: Node shape
subclass of: time interval
subclass of: HHEAR_00062
comment: This class denotes date of last pest control treatment

on property: currency
has value: USD

FVC Best Value
type: Class
type: Quality Variable
subclass of: forced vital capacity (FVC)
subclass of: Restriction
  on property: hasUnit
  has value: liter
definition: The best FVC value achieved by a subject during a series of FVC measurements.

Pre-Pregnancy and Pregnancy Month 1
type: Class
subclass of: time interval
subclass of: Restriction
  some values from: HHEAR_00415
  on property: intervalStartedBy
subclass of: Restriction
  some values from: Pregnancy Month 1
  on property: intervalFinishedBy
definition: The time period that begins three months prior to conception and ends at the end of the first month of pregnancy.

Pest Control Treatment By Provider
type: Class
type: Node shape
subclass of: Pest Control Treatment
comment: differentiates pest control by the entity providing the treatment

No Parent Employed
type: Class
type: Quality Value
type: Node shape
subclass of: Employment Status
comment: Indicates that no parent or caregiver is employed.
notation: 1138
disjoint with: Some Parent Employed

lupus erythematosus
type: Class
subclass of: Disease
comment: An autoimmune disease that is characterized by a constellation of findings that include elevated antibodies to nuclear antigens, antiphospholipids, low complement levels, ulcers, non-scarring alopecia, renal or neurologic damage, and low white blood cell and platelet counts, has_symptom rashes, fatigue, arthritis, hair loss, seizures, and symptoms related to affected organs.

Human Dwelling With Scatter Rug and Tile/Linoleum and Hardwood Floor Coverings
type: Class
type: Node shape
subclass of: Human Dwelling By Floor Covering Type
comment: This class denotes Human Dwelling With Scatter Rug and Tile/Linoleum and Hardwood Floor Coverings
notation: 900

Percentile Rank Between 11% and 25%
type: Class
type: Quality Value
type: Node shape
subclass of: Percentile Rank
comment: This class denotes Percentile between 11% and 25%
notation: 948

Smoking Status
type: Class
type: Quality Value
type: Quality Variable
subclass of: OBA_2050116
notation: 197
definition: An indication of a person's current tobacco and nicotine consumption as well as some indication of smoking history
editorial note: We need to discuss this entire hierarchy.

respirable suspended particulate matter
type: Class
subclass of: Air Pollutant
comment: A portion of respirable suspended particulate matter is a form of particulate matter composed primarily of solid particles each with a diameter of 10 micrometers or less. [database_cross_reference: https://en.wikipedia.org/wiki/Particulates]

environmental tobacco smoke exposure measurement
type: Class
type: Quality Value
subclass of: Tobacco Smoke Exposure
subclass of: Alcohol, Tobacco, and Illicit Drug Use
subclass of: environmental exposure measurement
comment: This class denotes environmental tobacco smoke exposure measurement
notation: 153

FVC Predicted Value
type: Class
type: Quality Variable
subclass of: forced vital capacity (FVC)
subclass of: Restriction
  on property: hasUnit
  has value: liter
definition: The expected or predicted FVC value for a patient based on their demographics (typically age, height, sex, and race) and comparison with a population control group.

Development Quotient
type: Class
type: Quantity Variable
subclass of: Physical And Mental Assessment
subclass of: Quotient
definition: A development quotient is a numerical indicator of a (infant to preschool age) child's growth to maturity across a range of psychosocial competencies.

maxValue
type: Property
comment: The upper value of some characteristic or property.

Pest Control Treatment Provided By Government Entity
type: Class
type: Quality Value
type: Node shape
subclass of: Pest Control Treatment By Provider
comment: This class denotes pest control treatment provided by government entity
notation: 1026

on property: currency
has value: ZAR

Percentile Rank Between 26% and 50%
type: Class
type: Quality Value
type: Node shape
subclass of: Percentile Rank Between 26% and 75%
comment: This class denotes Percentile between 26% and 50%
notation: 949

Birth Weight Z-Score
type: Class
type: Node shape
subclass of: Z-Score
subclass of: Restriction
  some values from: Birth Weight
  on property: wasDerivedFrom
comment: The Z score of a subject's birth weight

Pregnancy Baseline
type: Class
type: Node shape
subclass of: Study Baseline
subclass of: Restriction
  some values from: Pregnancy
  on property: intervalDuring
comment: A point in a study set to the initial point which occurs during the study subject's pregnancy.

mono (2-ethyl-5-hydroxyhexyl) phthalate
type: Class
type: Facet Value
subclass of: Phthalate
comment: This class denotes mono (2-ethyl-5-hydroxyhexyl) phthalate
notation: MEHHP

food transformation process
type: Class
type: Node shape
subclass of: process
comment: A process involving the physical transformation of a food source or food product into some derived organic material or food product

Number of Smokers in Household
type: Class
type: Quantity Variable
type: Node shape
subclass of: SIO_000794
subclass of: Alcohol, Tobacco, and Illicit Drug Use
subclass of: Restriction
  some values from: Household
  on property: SIO_000215
comment: The number of smokers who live in a household

Childhood Year 1
type: Class
subclass of: time interval
definition: The time period of a child that begins at birth and ends after one year

Outside Home Treated For Insects
type: Class
type: Quality Value
type: Node shape
subclass of: Home Treated For Insects
subclass of: Pest Control Treatment By Location
comment: Exterior of home treated for insects
notation: 1025

environmental e-cigarette smoke exposure measurement
type: Class
type: Quality Variable
subclass of: Tobacco Smoke Exposure
subclass of: Alcohol, Tobacco, and Illicit Drug Use
subclass of: environmental exposure measurement
definition: Exposure to secondhand smoke via e-cigarettes

Birth Outcome By Gestational Age
type: Class
type: Node shape
subclass of: HHEAR_00036
comment: The outcome of a birth faceted by the gestational age of the fetus, either Pre-term Birth or Full-term Birth.

calculated weight of islet beta cells in duodenal region of pancreas
type: Class
subclass of: Clinical Measurement
comment: This class denotes calculated weight of islet beta cells in duodenal region of pancreas

Human Dwelling With Wall to Wall Carpet or Large Rug Floor Coverings and Tile/Linoleum and Hardwood
type: Class
type: Quality Value
type: Node shape
subclass of: Human Dwelling By Floor Covering Type
comment: This class denotes Human Dwelling With Wall to Wall Carpet or Large Rug Floor Coverings and Tile/Linoleum and Hardwood
notation: 933

Percentile Rank Between 3% and 5%
type: Class
type: Quality Value
type: Node shape
subclass of: Percentile Rank Between 3% and 10%
comment: This class denotes Percentile between 3% and 5%
notation: 950

pyrene
type: Class
type: Node shape
subclass of: polycyclic hydrocarbon
comment: An ortho- and peri-fused polycyclic arene consisting of four fused benzene rings, resulting in a flat aromatic system. (Source: ChEBI Ontology)
notation: PYRENE

Factory
type: Class
type: Quality Value
type: Node shape
subclass of: Workplace
comment: A factory (previously manufactory) or manufacturing plant is an industrial site, usually consisting of buildings and machinery, or more commonly a complex having several buildings, where workers manufacture goods or operate machines processing one product into another. (Source: Environment Ontology)
notation: 969

Childhood Year 2 and Later
type: Class
subclass of: time interval
definition: The time period that begins at the beginning of a child's second year and ends at the end of childhood.

Asthma Severity Index Composite Score (CASI)
type: Class
type: Quality Variable
subclass of: Questionnaire
subclass of: Asthma Severity
definition: The Composite Asthma Severity Index (CASI) is a comprehensive severity scale combining multiple facets of asthma severity: impairment, risk, and treatment The CASI score, which was developed as a research tool for intervention studies, ranges from 0 to 20 points, with higher scores indicating higher levels of severity, and includes 5 domains: day symptoms and albuterol use, night symptoms and albuterol use, controller treatment, lung function measures, and exacerbations. (Source: Minimally Important Differences and Risk Levels for the Composite Asthma Severity Index Rebecca Z. Krouse, et al.)

Interleukin-23 subunit alpha
type: Class
type: Facet Value
subclass of: Protein
subclass of: HHEAR_01389
comment: This class denotes Interleukin-23 subunit alpha
notation: IL23

Inside And Outside Home Treated For Insects
type: Class
type: Quality Value
type: Node shape
subclass of: Inside Home Treated For Insects
subclass of: Outside Home Treated For Insects
comment: Interior and Exterior of home treated for insects
notation: 1098

Some Parent Employed
type: Class
type: Quality Value
type: Node shape
subclass of: Employment Status
comment: Indicates that at least one parent or caregiver is employed.
notation: 1137
disjoint with: No Parent Employed

calculated weight of islet beta cells in splenic region of pancreas
type: Class
subclass of: Clinical Measurement
comment: This class denotes calculated weight of islet beta cells in splenic region of pancreas

Percentile Rank Between 6% and 10%
type: Class
type: Quality Value
type: Node shape
subclass of: Percentile Rank
comment: This class denotes Percentile between 6% and 10%
notation: 952

Human Dwelling With Tile/Linoleum and Hardwood Floor Coverings
type: Class
type: Quality Value
type: Node shape
subclass of: Human Dwelling By Floor Covering Type
comment: This class denotes Human Dwelling With Tile/Linoleum and Hardwood Floor Coverings
notation: 932
intersection of: Human Dwelling
intersection of: Restriction
  some values from: Hardwood Flooring
  on property: SIO_000053
intersection of: Restriction
  some values from: Tile
  on property: SIO_000053

Second Hand Smoke Exposure by Frequency
type: Class
type: Quality Variable
type: Node shape
subclass of: environmental tobacco smoke exposure measurement
comment: This class denotes second hand smoke exposure by frequency
notation: 408

cigarettes per day
type: unit of measurement
notation: cigs / day

Uses Cannabinoids
type: Class
type: Quality Value
subclass of: Cannabis Consumption
subclass of: Restriction
  some values from: cannabinoid
  on property: SIO_000230
comment: This class denotes Uses Cannabinoids
notation: 692

Pest Control Treatment By Location
type: Class
type: Node shape
subclass of: Pest Control Treatment
comment: differentiates pest control by the location of the treatments

Household Does Not Have a Boiler
type: Class
type: Quality Value
type: Node shape
subclass of: Boiler Count
comment: Indicates that a household does not have a boiler device for heating water.
notation: 1135

Confidence Interval Minimum Value
type: Class
type: Node shape
subclass of: STATO_0000150
subclass of: Restriction
  some values from: confidence interval
  on property: SIO_000215
comment: The lower bound of some confidence interval

Frequently exposed to second hand smoke
type: Class
type: Quality Value
type: Node shape
subclass of: Second Hand Smoke Exposure by Frequency
subclass of: HHEAR_01125
comment: This class denotes Frequently exposed to second hand smoke
notation: 407

Received Some Post High School Education
type: Class
type: Quality Value
type: Node shape
subclass of: Graduated From High School
comment: Indicates that a subject has completed high school and has received some post high school education.
notation: 1136

on property: minValue
has value: 120000

Pre-Pregnancy and Pregnancy
type: Class
subclass of: time interval
subclass of: Restriction
  some values from: HHEAR_00415
  on property: intervalStartedBy
subclass of: Restriction
  some values from: Pregnancy
  on property: intervalFinishedBy
definition: The time period that begins three months prior to conception and ends at the birth of a child.
equivalent class: Class
  equivalent class: Pre-Pregnancy and Pregnancy

Inside Home Treated For Insects
type: Class
type: Quality Value
type: Node shape
subclass of: Home Treated For Insects
subclass of: Pest Control Treatment By Location
comment: Interior of home treated for insects
notation: 1024

Percentile Rank Less Than 2%
type: Class
type: Quality Value
type: Node shape
subclass of: Percentile Rank Less Than Or Equal To 2%
comment: Percentile rank of less than 2%
notation: 954

Human Dwelling With Wall to Wall Carpet or Large Rug Floor Coverings and Tile/Linoleum
type: Class
type: Quality Value
type: Node shape
subclass of: Human Dwelling By Floor Covering Type
comment: This class denotes Human Dwelling With Wall to Wall Carpet or Large Rug Floor Coverings and Tile/Linoleum
notation: 899
intersection of: Human Dwelling
intersection of: Human Dwelling With Wall to Wall Carpet or Large Rug Floor Coverings

active eosinophilic esophagitis
type: Class
subclass of: eosinophilic esophagitis
comment: Eosinophilic esophagitis is active when a biopsy of the esophagus reveals a count of more than 25 eosinophils per high-power field area, or 0.158 mm^2 (400x).
equivalent class: Restriction
  on property: SIO_001280
  equivalent class: active eosinophilic esophagitis
  all values from: Class
    intersection of: UBERON_0001043

Zone 3 and Periportal: Any Combination
type: Class
type: Quality Value
type: Node shape
subclass of: Pathology Result
comment: This class denotes Zone 3 and Periportal: Any Combination
notation: 750

Rug
type: Class
type: Node shape
subclass of: Carpet
comment: A rug or carpet that is not wall-to-wall

Hardwood Flooring
type: Class
type: Node shape
subclass of: Floor Covering
comment: This class denotes Hardwood Flooring

Interleukin-8
type: Class
type: Facet Value
subclass of: HHEAR_00034
subclass of: HHEAR_01389
comment: This class denotes Interleukin-8
notation: IL8

N-Acetyl-S-(2-cyanoethyl)-L-cysteine
type: Class
type: Facet Value
subclass of: Volatile Organic Compound
comment: This class denotes N-Acetyl-S-(2-cyanoethyl)-L-cysteine
notation: CYMA
editorial note: To Do: align with CHEBI.

Uruguay
type: geographic region
comment: The country of Uruguay
SIO_000313: Outside United States

eosinophilic esophagitis in remission
type: Class
subclass of: eosinophilic esophagitis
comment: Eosinophilic esophagitis is active when a biopsy of the esophagus reveals a count of less than 15 eosinophils per high-power field area, or 0.158 mm^2 (400x).
equivalent class: Restriction
  on property: SIO_001280
  equivalent class: eosinophilic esophagitis in remission
  all values from: Class
    intersection of: UBERON_0001043

Anatalline
type: Class
type: Node shape
type: Facet Value
subclass of: Tobacco Metabolite
comment: This class denotes Anatalline
notation: ATL

microunits per liter
type: Class
type: Node shape
subclass of: unit per volume unit
comment: This class denotes microunits per liter

Indonesia
type: geographic region
comment: The country of Indonesia
SIO_000313: Outside United States

Preschool Child Behavior Checklist
type: Class
subclass of: HHEAR_00198
definition: Child Behavior Checklist for ages 1 ½ through 5

Human Dwelling With Wall to Wall Carpet or Large Rug Floor Coverings and Scatter Rug and Tile/Linoleum
type: Class
type: Quality Value
type: Node shape
subclass of: Human Dwelling By Floor Covering Type
comment: This class denotes Human Dwelling With Wall to Wall Carpet or Large Rug Floor Coverings and Scatter Rug and Tile/Linoleum
notation: 898

N-Acetyl-S-(2-Carbxyethyl)-L-Cys(ng/mL)
type: Class
subclass of: Volatile Organic Compound
comment: This class denotes N-Acetyl-S-(2-Carbxyethyl)-L-Cys(ng/mL)
notation: VOCCEM
editorial note: To Do: align with CHEBI.

Targeted Sequencing
type: Class
subclass of: Nucleic Acid Sequencing
definition: Nucleic acid sequencing that limits the scope of sequencing by filtering out portions of the nucleic acids that do not meet some criteria.

umbilical cord
type: Class
subclass of: anatomical entity
comment: This class denotes umbilical cord

Human Dwelling With Some Evidence of Moisture Damage
type: Class
type: Quality Value
type: Node shape
subclass of: Human Dwelling By Evidence of Moisture Damage
comment: This class denotes Human Dwelling With Some Evidence of Moisture Damage
notation: 796

Egypt
type: geographic region
comment: The country of Egypt
SIO_000313: Outside United States

Pregnancy Cohort Study
type: Class
subclass of: cohort study
comment: This class denotes Pregnancy Cohort Study

N-Acetyl-S-(2-carbamoyl-2-hydroxyethyl)-L-cysteine
type: Class
type: Facet Value
subclass of: Volatile Organic Compound
comment: This class denotes N-Acetyl-S-(2-carbamoyl-2-hydroxyethyl)-L-cysteine
notation: GAMA
editorial note: To Do: align with CHEBI.

Triple Quadrupole Inductively Coupled Plasma Mass Spectrometer
type: Class
subclass of: HHEAR_00191
definition: A tandem mass spectrometer consisting of two quadrupole mass analyzers in series, with a (non-mass-resolving) radio frequency (RF)–only quadrupole between them to act as a cell for collision-induced dissociation.
was approved by: PER-Jim-McCusker

Benzene
type: Class
type: Facet Value
subclass of: Volatile Organic Compound
notation: BZ
definition: Toxic, volatile, flammable liquid hydrocarbon byproduct of coal distillation. It is used as an industrial solvent in paints, varnishes, lacquer thinners, gasoline, etc. Benzene causes central nervous system damage acutely and bone marrow damage chronically and is carcinogenic. It was formerly used as parasiticide.

Silver
type: Class
type: Facet Value
subclass of: Metal
subclass of: HHEAR_01387
notation: Ag
definition: Silver. An element with the atomic symbol Ag, atomic number 47, and atomic weight 107.87. It is a soft metal that is used medically in surgical instruments, dental prostheses, and alloys. Long-continued use of silver salts can lead to a form of poisoning known as ARGYRIA.

Zone 3: Moderate Perisinusoidal
type: Class
type: Quality Value
type: Node shape
subclass of: Pathology Result
comment: This class denotes Zone 3: Moderate Perisinusoidal
notation: 752

Human Dwelling With Much Evidence of Moisture Damage
type: Class
type: Quality Value
type: Node shape
subclass of: Human Dwelling By Evidence of Moisture Damage
comment: This class denotes Human Dwelling With Much Evidence of Moisture Damage
notation: 797

on property: minValue
has value: 417

Race or Ethnicity Combined
type: Class
type: Quality Variable
subclass of: Demographic
definition: Race or ethinicity as a combined concept.
equivalent class:
  union of: ethnicity
  union of: race
  equivalent class: Race or Ethnicity Combined

Dietary Calories Measurement
type: Class
type: Node shape
subclass of: Physical And Mental Assessment
comment: This class denotes Dietary Calories Measurement

environmental exposure measurement
type: Class
type: Quality Variable
subclass of: HHEAR_00062
comment: This class denotes environmental exposure measurement

Metoclopramide
type: Class
type: Quality Value
type: Node shape
subclass of: pharmaceutical drug
comment: A substituted benzamide and a derivative of para-aminobenzoic acid (PABA) that is structurally related to procainamide, with gastroprokinetic and antiemetic effects. Metoclopramide exerts its prokinetic effect by antagonizing dopamine mediated relaxation effect on gastrointestinal smooth muscle. This enhances the response of the gastrointestinal smooth muscle to cholinergic stimulation, thereby leading to an increase of gastric emptying into the intestines. Metoclopramide may also strengthen the lower esophagus sphincter, thereby preventing acid reflux. This agent antagonizes D2 dopamine receptors in chemoreceptive trigger zone (CTZ) of the medulla, thereby preventing nausea and vomiting. (Source: NCI Thesaurus)
notation: 1216

South Africa
type: geographic region
comment: The country of South Africa
SIO_000313: Outside United States

Human Dwelling With Wall to Wall Carpet or Large Rug Floor Coverings and Scatter Rug
type: Class
type: Node shape
subclass of: Human Dwelling By Floor Covering Type
comment: This class denotes Human Dwelling With Wall to Wall Carpet or Large Rug Floor Coverings and Scatter Rug
notation: 896
intersection of: Human Dwelling

N-Acetyl-S-(2, 2-dichlorovinyl)-L-cysteine
type: Class
type: Facet Value
subclass of: Volatile Organic Compound
comment: This class denotes N-Acetyl-S-(2, 2-dichlorovinyl)-L-cysteine
notation: DCVMA22
editorial note: To Do: align with CHEBI.

Antimony
type: Class
type: Facet Value
subclass of: Metal
subclass of: HHEAR_01387
notation: Sb
definition: ANTIMONY is a metallic element that has the atomic symbol Sb, atomic number 51, and atomic weight 121.75. It is used as a metal alloy and as medicinal and poisonous salts. It is toxic and an irritant to the skin and the mucous membranes.

Pest Control Treatment
type: Class
type: Node shape
subclass of: HHEAR_00062
comment: Treating a place (home, office, etc.) to kill or prevent the infestation of pests

Human Dwelling By Evidence of Moisture Damage
type: Class
type: Node shape
subclass of: Human Dwelling
comment: This class denotes Human Dwelling By Evidence of Moisture Damage

Tetrachlorobisphenol A
type: Class
type: Node shape
type: Facet Value
subclass of: HHEAR_01385
comment: This class denotes Tetrachlorobisphenol A
notation: TECBPA2266

Human Dwelling With Wall to Wall Carpet or Large Rug Floor Coverings and Scatter Rug and Hardwood
type: Class
type: Quality Value
type: Node shape
subclass of: Human Dwelling By Floor Covering Type
comment: This class denotes Human Dwelling With Wall to Wall Carpet or Large Rug Floor Coverings and Scatter Rug and Hardwood
notation: 897
intersection of: Human Dwelling
intersection of: Human Dwelling With Wall to Wall Carpet or Large Rug Floor Coverings
intersection of: Restriction
  some values from: Hardwood Flooring
  on property: SIO_000053

N-Acetyl-S-(2, 4-dimethylphenyl)-L-cysteine + N-Acetyl-S-(2, 5-dimethylphenyl)-L-cysteine + N-Acetyl-S-(3, 4-dimethylphenyl)-L-cysteine
type: Class
type: Facet Value
subclass of: Volatile Organic Compound
comment: This class denotes N-Acetyl-S-(2, 4-dimethylphenyl)-L-cysteine + N-Acetyl-S-(2, 5-dimethylphenyl)-L-cysteine + N-Acetyl-S-(3, 4-dimethylphenyl)-L-cysteine
notation: DPMA
editorial note: To Do: align with CHEBI.

Targeted Analyte
type: Class
type: Facet Category
subclass of: Study Indicator
subclass of: Analyte
definition: A targeted analyte is one that has been selected by the CHEAR program as a prioritized analyte for CHEAR lab hubs to measure and has been carried over to HHEAR.
was approved by: PER-Jeanette-Stingone

Cesium
type: Class
type: Facet Value
subclass of: Metal
subclass of: HHEAR_01387
notation: Cs
definition: A member of the alkali metals. It has an atomic symbol Cs, atomic number 50, and atomic weight 132.91. Cesium has many industrial applications, including the construction of atomic clocks based on its atomic vibrational frequency.

Human Dwelling With No Evidence of Moisture Damage
type: Class
type: Quality Value
type: Node shape
subclass of: Human Dwelling By Evidence of Moisture Damage
comment: This class denotes Human Dwelling With No Evidence of Moisture Damage
notation: 795

Restriction
on property: SIO_000300
has value: 500.0

Born Sixth Or Later
type: Class
type: Quality Value
subclass of: Sixth
notation: 241
definition: The sixth or later born child

respiratory system
type: Class
type: Facet
subclass of: HHEAR_00549
comment: This class denotes respiratory system

Behavior Assessment System for Children Hyperactivity Subscale
type: Class
type: Node shape
subclass of: Behavior Assessment System for Children, Third Edition
comment: This class denotes Behavior Assessment System for Children Hyperactivity Subscale

Retinopathy
type: Class
type: Quality Value
subclass of: phenotype
subclass of: HP_0000001
notation: 129
definition: Any noninflammatory disease of the retina. This nonspecific term is retained here because of its wide use in the literature, but if possible new annotations should indicate the precise type of retinal abnormality.

Human Dwelling With Wall to Wall Carpet or Large Rug Floor Coverings
type: Class
type: Quality Value
type: Node shape
subclass of: Human Dwelling By Floor Covering Type
comment: This class denotes Human Dwelling With Wall to Wall Carpet or Large Rug Floor Coverings
notation: 894
intersection of: Human Dwelling
intersection of: unionOf

N-Acetyl-S-(1-hydroxymethyl-2-propenyl)-L-cysteine
type: Class
type: Facet Value
subclass of: Volatile Organic Compound
comment: This class denotes N-Acetyl-S-(1-hydroxymethyl-2-propenyl)-L-cysteine
notation: MHBMA1
editorial note: To Do: align with CHEBI.

Pest Infestation
type: Class
type: Node shape
subclass of: HHEAR_00062
comment: The state or level of pest infestation of a subject's environment

forced expiratory volume
type: Class
type: Quality Variable
subclass of: CMO_0000094
comment: This class denotes forced expiratory volume

First or Second Trimester
type: Class
subclass of: time interval
subclass of: From Conception
subclass of: Restriction
  on property: SIO_000668
definition: The time period from pregnancy week 1 through 28 and includes conception.

score
type: Class
subclass of: mathematical entity
comment: This class denotes score

on property: minValue
has value: 15001

Human Dwelling With Wall to Wall Carpet or Large Rug Floor Coverings and Hardwood
type: Class
type: Quality Value
type: Node shape
subclass of: Human Dwelling By Floor Covering Type
comment: This class denotes Human Dwelling With Wall to Wall Carpet or Large Rug Floor Coverings and Hardwood
notation: 895
intersection of: Human Dwelling

Behavior Assessment System for Children Locus of Control Subscale
type: Class
type: Node shape
subclass of: Behavior Assessment System for Children, Third Edition
comment: This class denotes Behavior Assessment System for Children Locus of Control Subscale

N-Acetyl-S-(1-phenyl-2-hydroxyethyl-L-cysteine + N-Acetyl-S-(2-phenyl-2-hydroxyethyl)-L-cysteine
type: Class
type: Facet Value
subclass of: Volatile Organic Compound
comment: This class denotes N-Acetyl-S-(1-phenyl-2-hydroxyethyl-L-cysteine + N-Acetyl-S-(2-phenyl-2-hydroxyethyl)-L-cysteine
notation: PHEMA
editorial note: To Do: align with CHEBI.

Insects Are A Nuisance In The Home
type: Class
type: Quality Value
type: Node shape
subclass of: Pest Infestation
comment: Insects (roaches, ants, and other bugs) are a nuisance in the home
notation: 1086

Trimethylarsine oxide
type: Class
type: Facet Value
subclass of: Arsenic Species
comment: This class denotes Trimethylarsine oxide
notation: TMAO

Catheterization
type: Class
subclass of: medical procedure
comment: This class denotes Catheterization

Tetrabromobisphenol A
type: Class
type: Node shape
type: Facet Value
subclass of: HHEAR_01385
comment: This class denotes Tetrabromobisphenol A
notation: TBBPA3355

Biospecimen Collection
type: Class
type: Quality Variable
type: Node shape
subclass of: Physical And Mental Assessment
subclass of: HHEAR_00042
subclass of: Restriction
  some values from: HHEAR_00177
  on property: RO_0004009
comment: An event in which a biospecimen is collected in order to be measured or analyzed

Annual Income $40,000 to $44,999
type: Class
type: Quality Value
type: Node shape
subclass of: Annual Income $35,000 to $44,999
subclass of: Annual Income $40,000 to $49,999
subclass of:
  on property: SIO_000900
  has value: year
subclass of:
  on property: minValue
  has value: 40000
subclass of:
  on property: maxValue
  has value: 44999
subclass of:
  on property: currency
  has value: USD
comment: This class denotes Annual Income $40,000 to $44,999
notation: 729

Interleukin-10
type: Class
type: Facet Value
subclass of: Protein
subclass of: HHEAR_01389
notation: IL10
definition: Inhibits the synthesis of a number of cytokines, including IFN-gamma, IL-2, IL-3, TNF and GM-CSF produced by activated macrophages and by helper T-cells.

Leukocyte
type: Class
subclass of: Blood Component
definition: An achromatic cell of the myeloid or lymphoid lineages capable of ameboid movement, found in blood or other tissue.

Refractometer
type: Class
subclass of: PhysicalInstrument
definition: A laboratory or field device for the measurement of an index of refraction (refractometry). The index of refraction is calculated from Snell's law while for mixtures, the index of refraction can be calculated from the composition of the material using several mixing rules such as the Gladstone–Dale relation and Lorentz–Lorenz equation.
was approved by: PER-Jim-McCusker

Gestational Age
type: Class
type: Quantity Variable
subclass of: HHEAR_00036
subclass of: age
definition: The age of the conceptus, beginning from the time of FERTILIZATION. In clinical obstetrics, the gestational age is often estimated as the time from the last day of the last MENSTRUATION which is about 2 weeks before OVULATION and fertilization
was approved by: PER-Jeanette-Stingone

Stool Sample Collection
type: Class
type: Node shape
subclass of: Biospecimen Collection
subclass of: Restriction
  some values from: NCIT C189125
  on property: RO_0004009
comment: An event in which a stool sample is collected in order to be measured or analyzed

watt-hour
type: unit of measurement
notation: Wh

Oaxaca State, Mexico
type: geographic region
comment: The state, province, or territory of Oaxaca State, Mexico
SIO_000313: Q96

Red blood cells present
type: Class
subclass of: comment
comment: This class denotes Red blood cells present

rest:
  rest: nil
  first: Restriction
    on property: SIO_000300
    has value: 4
first: SIO_001114

NIH Toolbox
type: Class
type: Node shape
subclass of: Research or Clinical Assessment Tool
comment: A comprehensive set of neuro-behavioral measures that assess cognitive, emotional, sensory, and motor functions, designed to be run on an iPad. (Source: NCI Thesaurus)

Colombia
type: geographic region
comment: The country of Colombia
SIO_000313: Outside United States

Z-Score For Fixed Age and Sex
type: Class
type: Quantity Variable
type: Node shape
subclass of: Z-Score
comment: A Z-score computation from a population which all share the same age range and sex assignment

Annual Income $30,000 to $34,999
type: Class
type: Quality Value
type: Node shape
subclass of: Annual Income $25,000 to $34,999
subclass of: Annual Income $30,000 to $39,999
subclass of:
  on property: maxValue
  has value: 34999
comment: This class denotes Annual Income $30,000 to $34,999
notation: 727

Aligent 8800 Triple Quadrupole ICP-MS
type: Class
subclass of: Triple Quadrupole Inductively Coupled Plasma Mass Spectrometer
comment: This class denotes Aligent 8800 Triple Quadrupole ICP-MS
was approved by: PER-Jim-McCusker

magnetic flux density unit
type: unit of measurement
notation: MFDU

Benzophenone
type: Class
subclass of: HHEAR_01385
comment: This class denotes Benzophenone

Reproductive Health
type: Class
subclass of: Study Indicator
definition: Reproductive Health Indicator Class
was approved by: PER-Jeanette-Stingone

Thailand
type: geographic region
comment: The country of Thailand
SIO_000313: Outside United States

Z-Score For Fixed Height and Sex
type: Class
type: Quantity Variable
type: Node shape
subclass of: Z-Score
subclass of: Restriction
  some values from: biological sex
  on property: RO_0000079
subclass of: Restriction
  some values from: SIO_000040
  on property: RO_0000079
comment: A Z-score computation from a population which all share the same height range and sex assignment

Ecuador
type: geographic region
comment: The country of Ecuador
SIO_000313: Outside United States

Annual Income $35,000 to $39,999
type: Class
type: Quality Value
type: Node shape
subclass of: Annual Income $35,000 to $44,999
subclass of: Annual Income $30,000 to $39,999
subclass of:
  on property: maxValue
  has value: 39999
subclass of:
  on property: SIO_000900
  has value: year
subclass of:
  on property: currency
  has value: USD
comment: This class denotes Annual Income $35,000 to $39,999
notation: 728

Microgram per Deciliter
type: Class
type: unit of measurement
type: Node shape
subclass of: mass density unit
comment: A mass unit density which is equal to mass of an object in micrograms divided by the volume in deciliters. (Source: Units Ontology)
notation: µg/dl

weber
type: unit of measurement
notation: Wb

chikungunya
type: Class
type: Quality Value
subclass of: DOID 934
comment: This class denotes chikungunya
notation: 1067

Replicate Number
type: Class
subclass of: Sample Indicator
definition: Replicate Number

antihypertensive agent
type: Class
type: Quality Value
type: Node shape
subclass of: pharmaceutical drug
comment: Any drug used in the treatment of acute or chronic vascular hypertension regardless of pharmacological mechanism. (Source: ChEBI Ontology)
notation: 1217

One Month Prior to Baseline
type: Class
type: Node shape
subclass of: time interval
subclass of: Restriction
  some values from: HHEAR_01887
  on property: intervalContains
comment: A time interval that begins one month prior to a study baseline and ends at the beginning of the study baseline.

procedure
type: Class
subclass of: Thing
comment: This class denotes procedure

Uses Other Asthma Medication
type: Class
type: Quality Value
type: Node shape
subclass of: Other Asthma Medication Use
comment: Uses some other asthma medication besides Albuterol or an inhaled corticosteroid (ex. Cromolyn and Nedocromil, Oral Leukotriene Modifiers, Oral Theophylline, Oral Corticosteroids).
notation: 724
disjoint with: Does Not Use Other Asthma Medication

Human Dwelling By Floor Covering Type
type: Class
type: Quality Variable
type: Node shape
subclass of: Human Dwelling
comment: This class denotes Human Dwelling By Floor Covering Type

milligram per deciliter
type: Class
type: unit of measurement
type: Node shape
subclass of: mass density unit
comment: This class denotes milligram per deciliter
notation: mg/dl
equivalent class: milligram per deciliter

Adult
type: Class
type: Quality Value
type: Facet
subclass of: Demographic
subclass of: Developmental Quality
subclass of: Life Stage
subclass of: Study Population
notation: 3
definition: Refers to a person above a threshold age.
was approved by: PER-Jeanette-Stingone

volt-hour
type: unit of measurement
notation: Vh

Preschool Child Behavior Checklist Externalizing Subscale
type: Class
subclass of: HHEAR_00198
definition: Subscale of preschool CBCL that assesses externalizing behaviors

Tin
type: Class
type: Facet Value
subclass of: Metal
subclass of: HHEAR_01387
notation: Sn
definition: TIN is a trace element that is required in bone formation. It has the atomic symbol Sn, atomic number 50, and atomic weight 118.71.

cloxacillin
type: Class
type: Node shape
subclass of: chemical entity
comment: A semisynthetic penicillin antibiotic carrying a 3-(2-chlorophenyl)-5-methylisoxazole-4-carboxamido group at position 6.

Exposed to Probiotics
type: Class
type: Quality Value
type: Node shape
subclass of: exposure
subclass of: Restriction
  some values from: Probiotic
  on property: SIO_000139
comment: Exposure to probiotics, either through directly ingesting them or through other means
notation: 642

Completed Eighth Grade But Not A High School Graduate
type: Class
type: Quality Value
type: Node shape
subclass of: Some Middle School
comment: This class denotes Completed Eighth Grade But Not A High School Graduate
notation: 726
disjoint with: Less Than Grade 8

Human Dwelling With Wall to Wall Carpet
type: Class
type: Quality Value
type: Node shape
subclass of: Human Dwelling By Floor Covering Type
comment: This class denotes a human dwelling with wall-to-wall carpet.
notation: 876
intersection of: Human Dwelling
intersection of: Restriction
  some values from: Fitted Carpet
  on property: SIO_000053

Agilent 1100 HPLC
type: Class
subclass of: High-Performance Liquid Chromatography
comment: This class denotes Agilent 1100 HPLC
was approved by: PER-Jim-McCusker

tesla
type: unit of measurement
notation: Tesla

Preschool Child Behavior Checklist Internalizing Subscale
type: Class
subclass of: HHEAR_00198
definition: Subscale of preschool CBCL that assesses internalizing behaviors

Uses Albuterol Inhaler
type: Class
type: Quality Value
subclass of: Albuterol Inhaler Use
subclass of: Restriction
  some values from: albuterol
  on property: SIO_000139
comment: Indicates that a subject uses an Albuterol inhaler to control acute asthma symptoms.
notation: 723
disjoint with: Does Not Use Albuterol Inhaler

Large Rug
type: Class
type: Quality Value
type: Node shape
subclass of: Rug
comment: A large rug
notation: 940

N-Acetyl-S-(2-hydroxy-3-butenyl)-L-cysteine
type: Class
type: Facet Value
subclass of: Volatile Organic Compound
comment: This class denotes N-Acetyl-S-(2-hydroxy-3-butenyl)-L-cysteine
notation: MHBMA2
editorial note: To Do: align with CHEBI.

mild eosinophilic esophagitis
type: Class
subclass of: eosinophilic esophagitis
comment: Eosinophilic esophagitis is mild when a biopsy of the esophagus reveals a count of 15-25 eosinophils per high-power field area, or 0.158 mm^2 (400x).

Perfluorodecanoic acid
type: Class
type: Facet Value
subclass of: Perfluoroakyl and Polyfluoroalkyl Substance
comment: This class denotes Perfluorodecanoic acid
notation: PFDA

Quantity of sample insufficient for repeat analysis
type: Class
subclass of: comment
comment: This class denotes Quantity of sample insufficient for repeat analysis

Texas, United States of America
type: geographic region
comment: The state, province, or territory of Texas, United States of America
SIO_000313: Southwestern United States

Direct Measurement
type: Class
type: Node shape
subclass of: Measurement
comment: A direct measurement is taken when one explicitly measures the desired characteristic or quantity of the object in question. This in comparison to an imputed, or indirect measurement where the measurement value is determined by measuring some other characteristic or quantity and applying a scale or algorithm to infer an estimated value of the desired quantity.
disjoint with: Imputed Measurement

Hepatic bridging fibrosis
type: Class
type: Quality Value
type: Node shape
subclass of: Hepatic fibrosis
comment: Hepatic fibrosis that reaches from a portal area to another portal area. (Source: Human Phenotype Ontology)
notation: 755

One Month Prior to Followup 2
type: Class
type: Node shape
subclass of: time interval
comment: A time interval that begins one month prior to a study's second follow-up and ends at the beginning of the study's second follow-up.

Uses Corticosteroid Inhaler
type: Class
type: Quality Value
subclass of: Corticosteroid Inhaler Use
subclass of: Restriction
  some values from: corticosteroid
  on property: SIO_000139
comment: Indicates that a subject uses a corticosteroid inhaler to control asthma symptoms.
notation: 725
disjoint with: Does Not Use Corticosteroid Inhaler

Scatter Rug
type: Class
type: Node shape
subclass of: Rug
comment: A scatter rug

monoethyl phthalate (DEP)
type: Class
type: Facet Value
subclass of: Phthalate
comment: This class denotes monoethyl phthalate (DEP)
notation: MEP

N-Acetyl-S-(2-hydroxypropyl)-L-cysteine
type: Class
type: Facet Value
subclass of: Volatile Organic Compound
comment: This class denotes N-Acetyl-S-(2-hydroxypropyl)-L-cysteine
notation: HPMA2
editorial note: To Do: align with CHEBI.

Active Smoker
type: Class
type: Quality Value
subclass of: Smoker
notation: 2
definition: The quality of actively smoking.
editorial note: How is this different from "smoker'?

Prescription Medication and Dietary Supplements
type: Class
subclass of: Study Indicator
definition: Prescription Medication and Dietary Supplements are forms of medical treatment.
was approved by: PER-Jeanette-Stingone

Baker Island, United States of America
type: geographic region
comment: The state, province, or territory of Baker Island, United States of America
SIO_000313: United States of America

Bis(2-ethylhexyl) terephthalate
type: Class
type: Node shape
subclass of: Targeted Analyte
comment: CAS: 6422-86-2
notation: DEHT

Class
intersection of: Body Mass Index
intersection of: Restriction
  some values from: Datatype
    intersection of: Datatype
      with restrictions:
        min exclusive: 18.5
      on datatype: float
  on property: STATO_0000129

Connecticut, United States of America
type: geographic region
comment: The state, province, or territory of Connecticut, United States of America
SIO_000313: Q24460

South Central Clinic
type: Class
type: Quality Value
subclass of: Population Group
comment: This class denotes South Central Clinic
notation: 273

Expressive Language Developmental Quotient
type: Class
type: Quantity Variable
subclass of: Development Quotient
comment: This class denotes Expressive Language Developmental Quotient

gestational diabetes
type: Class
type: Quality Value
subclass of: diabetes
comment: This class denotes gestational diabetes
notation: 179

Inhibition Inhibition Percentile Rank Total Errors
type: Class
type: Node shape
subclass of: Inhibition Inhibition Subscale
subclass of: Percentile Rank Total Errors
comment: This class denotes Inhibition Inhibition Percentile Rank Total Errors

Loading Dock
type: Class
type: Quality Value
type: Node shape
subclass of: Workplace
comment: A platform for loading or unloading trucks or freight trains
notation: 976

First Pregnancy
type: Class
type: Quality Value
type: Node shape
subclass of: Pregnancy
comment: This class denotes First Pregnancy
notation: 1077

Bayley Scales of Infant and Toddler Development
type: Class
type: Node shape
subclass of: Research or Clinical Assessment Tool
comment: A protocol published by psychologist Nancy Bayley to evaluate the developmental maturation of human beings within 1-42 months of age
note: The Bayley Scales is in practice for several decades as a useful tool for detecting early developmental delay in clinical and research settings.[5] In 1969, Nancy Bayley published the first BSID. The first BSID assessed motor and mental domains in the age group from 3 to 28 months. BSID 2nd edition published in 1993 added behavior rating scale and widened the age group from 1 to 42 months. BSID -III published in 2006 assessed development from 1 to 42 months in 5 domains - cognition, motor, language, socio-emotional, and adaptive behavior. BSID 4 was published in 2019 and is in current use. BSID 4 retained the five domains from BSID III. [https://www.ncbi.nlm.nih.gov/books/NBK567715/]

Anemia
type: Class
type: Quality Value
subclass of: phenotype
subclass of: HP_0000001
notation: 128
definition: A reduction in erythrocytes volume or hemoglobin concentration.

UBERON_0036255
deprecated: true

Visual Reception Developmental Quotient
type: Class
type: Quantity Variable
subclass of: Development Quotient
subclass of: Restriction
  some values from: CAO_03171
  on property: wasDerivedFrom
comment: This class denotes Visual Reception Developmental Quotient

The Bahamas
type: geographic region
comment: The country of The Bahamas
SIO_000313: Outside United States

Southwestern United States
type: Node shape
type: Facet
type: geographic region
comment: This resource denotes the Southwestern United States
SIO_000313: United States of America

White Hispanic
type: Class
type: Quality Value
subclass of: White
notation: 145
definition: White and Hispanic

Inhibition Switching Percentile Rank Total Self Corrected Errors
type: Class
type: Node shape
subclass of: Inhibition Switching Subscale
subclass of: Percentile Rank Total Self-Corrected Errors
comment: This class denotes Inhibition Switching Percentile Rank Total Self Corrected Errors

Mean Body Weight
type: Class
type: Quantity Variable
subclass of: Physical And Mental Assessment
subclass of: SIO_001109
subclass of: Body Weight Quality
comment: This class denotes Mean Body Weight

Public Assistance
type: Class
type: Node shape
subclass of: Socioeconomic Status
subclass of: Activity
comment: Financial assistance to impoverished persons for the essentials of living through federal, state or local government programs. (Source: MESH Ontology)

Guam, United States of America
type: geographic region
comment: The state, province, or territory of Guam, United States of America
SIO_000313: United States of America

Placental hypoxia
type: Class
type: Quality Value
type: Node shape
subclass of: placenta disease
subclass of: Restriction
  some values from: NCIT C3890
  on property: SIO_000217
comment: This class denotes Placental hypoxia
notation: 928

Construction Site
type: Class
type: Quality Value
type: Node shape
subclass of: Workplace
comment: A construction site is a location where all physical construction activities related to a proposed structure take place
notation: 968

Bayley III
type: Class
type: Node shape
subclass of: Bayley Scales of Infant and Toddler Development
comment: This class denotes Bayley III
note: BSID -III published in 2006 assessed development from 1 to 42 months in 5 domains - cognition, motor, language, socio-emotional, and adaptive behavior. [https://www.ncbi.nlm.nih.gov/books/NBK567715/]

Communication Developmental Quotient
type: Class
type: Quantity Variable
subclass of: Development Quotient
subclass of: Restriction
  some values from: Vineland Communication Domain
  on property: wasDerivedFrom
comment: This class denotes Communication Developmental Quotient

USC Obstetrics-Gynecology
type: Class
type: Quality Value
subclass of: Population Group
comment: This class denotes USC Obstetrics-Gynecology
notation: 271

Interstitial collagenase
type: Class
type: Facet Value
subclass of: Protein
subclass of: HHEAR_01389
comment: This class denotes Interstitial collagenase
notation: MMP1

Quality Control
type: Class
subclass of: Analyte
definition: The value contains quality control data

Inhibition Inhibition Percentile Rank Total Self-Corrected Errors
type: Class
type: Node shape
subclass of: Inhibition Inhibition Subscale
subclass of: Percentile Rank Total Self-Corrected Errors
comment: This class denotes Inhibition Inhibition Percentile Rank Total Self-Corrected Errors

Manitoba, Canada
type: geographic region
comment: The state, province, or territory of Manitoba, Canada
SIO_000313: Canada

on property: currency
has value: USD

Workplace
type: Class
type: Node shape
subclass of: Socioeconomic Status
subclass of: Location
subclass of: Restriction
  some values from: Performing an Occupational Activity
  on property: SIO_000145
comment: A location where an occupation is performed

Indicator
type: Class
subclass of: Thing
comment: This class denotes Indicator

Retired
type: Class
type: Quality Value
type: Node shape
subclass of: ExO_0000034
comment: This class denotes Retired
notation: 927

status descriptor
type: Class
subclass of: Thing
comment: This class denotes status descriptor

Replicate
type: Class
subclass of: Analyte
definition: The value contains data for a repeat of the study sample

Community Recruit
type: Class
type: Quality Value
subclass of: Population Group
comment: This class denotes Community Recruit
notation: 272

Receptive Language Developmental Quotient
type: Class
type: Quantity Variable
subclass of: Development Quotient
comment: This class denotes Receptive Language Developmental Quotient

bronchial disease
type: Class
subclass of: Disease
comment: This class denotes bronchial disease

5-Hydroxyimidacloprid
type: Class
type: Node shape
subclass of: HHEAR_01374
comment: CAS #: 155802-61-2
notation: IMI5OH

food product
type: Class
type: Node shape
subclass of: SIO_010363
comment: This class denotes food product

Inhibition Inhibition Percentile Rank Total Uncorrected Errors
type: Class
type: Node shape
subclass of: Inhibition Inhibition Subscale
subclass of: Percentile Rank Total Uncorrected Errors
comment: This class denotes Inhibition Inhibition Percentile Rank Total Uncorrected Errors

confidence interval
type: Class
subclass of: data item
comment: This class denotes confidence interval

Aspergillus
type: Class
subclass of: Fungus
comment: This class denotes Aspergillus

lung disease
type: Class
subclass of: Disease
comment: This class denotes lung disease

Intended Conception
type: Class
type: Quality Value
type: Node shape
subclass of: Conceiving Activity
comment: A conception that was intended
notation: 1085

Hair Salon
type: Class
type: Quality Value
type: Node shape
subclass of: Workplace
comment: A workplace where people go to have their hair cut and put into a particular style
notation: 972

Inhibition Naming Percentile Rank Total Self-Corrected Errors
type: Class
type: Node shape
subclass of: Inhibition Naming Subscale
subclass of: Percentile Rank Total Self-Corrected Errors
comment: This class denotes Inhibition Naming Percentile Rank Total Self-Corrected Errors

Lithium
type: Class
type: Facet Value
subclass of: Metal
subclass of: HHEAR_01387
notation: Li
definition: An element in the alkali metals family. It has the atomic symbol Li, atomic number 3, and atomic weight [6.938; 6.997]. Salts of lithium are used in treating BIPOLAR DISORDER.

LAC + USC Med Center
type: Class
type: Quality Value
subclass of: Population Group
comment: This class denotes LAC + USC Med Center
notation: 269

Socialization Developmental Quotient
type: Class
type: Quantity Variable
subclass of: Development Quotient
subclass of: Restriction
  some values from: Vineland Socialization Domain
  on property: wasDerivedFrom
comment: This class denotes Socialization Developmental Quotient

Performing an Occupational Activity
type: Class
type: Node shape
subclass of: Activity
comment: The act of performing an activity that is in fulfillment of one's occupation

Motor Skills Developmental Quotient
type: Class
type: Quantity Variable
subclass of: Development Quotient
subclass of: Restriction
  some values from: Vineland Motor Skills Domain
  on property: wasDerivedFrom
comment: This class denotes Motor Skills Developmental Quotient

Inhibition Naming Total Uncorrected Errors
type: Class
type: Node shape
subclass of: Inhibition Naming Subscale
subclass of: Percentile Rank Total Uncorrected Errors
comment: This class denotes Inhibition Naming Total Uncorrected Errors

Eisner Health
type: Class
type: Quality Value
subclass of: Population Group
comment: This class denotes Eisner Health
notation: 270

air cooling equipment
type: Class
type: Node shape
subclass of: device
comment: cooling of air; includes air conditioning as well as electronic fans and other similar devices (Source: Wikidata)

Low Birth Weight
type: Class
type: Quality Value
type: Node shape
subclass of: Birth Weight
comment: This class denotes Low Birth Weight
notation: 926

Duration of Occupational Activity
type: Class
type: Node shape
subclass of: Socioeconomic Status
subclass of: duration
subclass of: Restriction
  some values from: Performing an Occupational Activity
  on property: SIO_000215
comment: The amount of time spent performing an occupational activity

very-low-density lipoprotein cholesterol
type: Class
type: Node shape
subclass of: cholesterol
comment: Cholesterol esters and free cholesterol which are contained in or bound to very low density lipoproteins (VLDL).

All Los Angeles RCs plus Orange, San Diego, Tri-counties, and Inland
type: Class
type: Quality Value
subclass of: Population Group
comment: This class denotes All Los Angeles RCs plus Orange, San Diego, Tri-counties, and Inland
notation: 340

gigabyte
type: unit of measurement
notation: GB

Sixth Child
type: Class
type: Node shape
subclass of: Child
subclass of: Sixth
comment: The sixth live born child

Inhibition Naming Percentile Rank Total Errors
type: Class
type: Node shape
subclass of: Inhibition Naming Subscale
subclass of: Percentile Rank Total Errors
comment: This class denotes Inhibition Naming Percentile Rank Total Errors

wheezing or tightness in the chest or cough
type: Class
type: Quantity Variable
subclass of: Physical And Mental Assessment
subclass of: HP_0000118
comment: This class denotes wheezing or tightness in the chest or cough

Daily Living Skills Developmental Quotient
type: Class
type: Quantity Variable
subclass of: Development Quotient
subclass of: Restriction
  some values from: Vineland Daily Living Skills Domain
  on property: wasDerivedFrom
comment: This class denotes Daily Living Skills Developmental Quotient

Eczema
type: Class
type: Quality Value
subclass of: HP_0011123
comment: Eczema has several forms including atopic dermatitis, contact dermatitis, dyshidrotic eczema, nummular eczema, seborrheic dermatitis, and stasis dermatitis. Eczema is a form of dermatitis. The term eczema is broadly applied to a range of persistent skin conditions and can be related to a number of underlying conditions. Manifestations of eczema can include dryness and recurring skin rashes with redness, skin edema, itching and dryness, crusting, flaking, blistering, cracking, oozing, or bleeding.
notation: 425

Reactive Airway Disease
type: Class
type: Quality Value
subclass of: Non-Neoplastic Lung Disorder
notation: 186
definition: Coughing, wheezing, or shortness of breath that is triggered by allergens, infection, or other irritants. [def-source: NCI]

gigabasepair
type: unit of measurement
notation: Gb

Nicotine
type: Class
type: Facet Value
subclass of: Tobacco Metabolite
notation: NIC
definition: Nicotine is highly toxic alkaloid. It is the prototypical agonist at nicotinic cholinergic receptors where it dramatically stimulates neurons and ultimately blocks synaptic transmission. Nicotine is also important medically because of its presence in tobacco smoke.

Flunisolide HFA (Aerospan)
type: Class
subclass of: Asthma Controller Medication
comment: This class denotes Flunisolide HFA (Aerospan)

Seventh Child
type: Class
type: Node shape
subclass of: Child
subclass of: NCIT C133531
comment: The seventh live born child

high-density lipoprotein cholesterol
type: Class
type: Node shape
subclass of: cholesterol
comment: Cholesterol esters and free cholesterol which are contained in or bound to high-density lipoproteins (HDL).

Massachusetts, United States of America
type: geographic region
comment: The state, province, or territory of Massachusetts, United States of America
SIO_000313: Q24460

Perceived Stress Scale - Moderate Stress
type: Class
type: Quality Value
type: Node shape
subclass of: HHEAR_01721
comment: This class denotes Perceived Stress Scale - Moderate Stress
notation: 838
note: This category reflects a score of 14-26. The test is Cohen's Perceived Stress Scale.

Perfluoroakyl and Polyfluoroalkyl Substance
type: Class
type: Facet
subclass of: Targeted Analyte
comment: This class denotes Perfluoroakyl and Polyfluoroalkyl Substance
notation: SPFAS

NINR
type: Class
type: Node shape
subclass of: Funding Institute
comment: The National Institute of Nursing Research

Study Followup 4 Day 1
type: Class
type: Node shape
subclass of: Study Activity
subclass of: Restriction
  some values from: Study Followup 4
  on property: intervalDuring
comment: The first day of the fourth study followup activity for a study

low-density lipoprotein cholesterol
type: Class
type: Node shape
subclass of: cholesterol
comment: Cholesterol esters and free cholesterol which are contained in or bound to low-density lipoproteins (LDL).

mono-isobutyl phthalate (DiBP)
type: Class
type: Facet Value
subclass of: Phthalate
comment: This class denotes mono-isobutyl phthalate (DiBP)
notation: MiBP

Perceived Stress Scale - High Stress
type: Class
type: Quality Value
type: Node shape
subclass of: HHEAR_01721
comment: This class denotes Perceived Stress Scale - High Stress
notation: 839
note: This category reflects a score of 27-40. The test is Cohen's Perceived Stress Scale.

Parous
type: Class
type: Quality Value
subclass of: Parity
comment: The state of having produced live offspring
notation: 73

NIDDK
type: Class
type: Facet
subclass of: Funding Institute
comment: This class denotes NIDDK

4-nitrophenol
type: Class
type: Facet Value
subclass of: HHEAR_01374
comment: This class denotes 4-nitrophenol
notation: PNP

Childhood Followup 4 Day 1
type: Class
type: Node shape
subclass of: Study Followup 4 Day 1
subclass of: Restriction
  some values from: Childhood Followup 4
  on property: intervalDuring
comment: The first day of the fourth study followup activity for a study that occurs during a subject's childhood period

Very turbid
type: Class
subclass of: comment
comment: This class denotes Very turbid

Fitted Carpet
type: Class
type: Node shape
subclass of: Carpet
comment: carpet intended to completely cover a floor (Source: Wikidata)

Composite score for motor composing of the fine motor and gross motor subscales
type: Class
type: Node shape
subclass of: Composite Score
subclass of: locomotion
subclass of: Bayley (III) Neurodevelopment
comment: This class denotes Composite score for motor composing of the fine motor and gross motor subscales
notation: 836

heating equipment
type: Class
type: Node shape
subclass of: device
comment: heating of air in buildings or vehicles (Source: Wikidata.org)

NIMHD
type: Class
type: Node shape
subclass of: Funding Institute
comment: The National Institute on Minority Health and Health Disparities

Interleukin-33
type: Class
type: Facet Value
subclass of: Protein
subclass of: HHEAR_01389
comment: This class denotes Interleukin-33
notation: IL33

diazole
type: Class
subclass of: Thing
comment: This class denotes diazole

Owns Home
type: Class
type: Quality Value
subclass of: HHEAR_00520
notation: 147
definition: This person owns the home they live in.

Value less than LOD
type: Class
subclass of: comment
comment: This class denotes Value less than LOD

Perceived Stress Scale - Low Stress
type: Class
type: Quality Value
type: Node shape
subclass of: HHEAR_01721
comment: This class denotes Perceived Stress Scale - Low Stress
notation: 837
note: This category reflects a score of 0-13. The test is Cohen's Perceived Stress Scale.

Other Material Finish
type: Class
type: Quality Value
subclass of: Floor Covering By Type
notation: 70
definition: Flooring is made from another unspecified material.
was approved by: PER-Jeanette-Stingone

2,3,4,3',4'-Pentachlorobiphenyl
type: Class
type: Node shape
type: Facet Value
subclass of: Polychlorobiphenyl
comment: This class denotes 2,3,4,3',4'-Pentachlorobiphenyl
notation: PCB105

Metalloproteinase inhibitor 2
type: Class
type: Facet Value
subclass of: Protein
subclass of: HHEAR_01389
comment: This class denotes Metalloproteinase inhibitor 2
notation: TIMP2

Childhood Followup 3 Day 4
type: Class
type: Node shape
subclass of: Study Followup 3 Day 4
subclass of: Restriction
  some values from: Childhood Followup 3 Day 3
  on property: intervalAfter
subclass of: Restriction
  some values from: Childhood Followup 3
  on property: intervalDuring
comment: The fourth day of the third study followup activity for a study that occurs during a subject's childhood period

Asthma Controller Use
type: Class
type: Quality Variable
subclass of: medical intervention
subclass of: Pharmacotherapy
subclass of: HHEAR_00671
subclass of: Restriction
  some values from: SIO_000393
  on property: SIO_000291
definition: A subclass of medical intervention that characterizes a patient's experience with using an asthma controller medication. Subclasses detail the level to which a patient has used such a medication to control their asthma symptoms, from never used to always uses.

asphyxia
type: Class
subclass of: HP_0000118
subclass of: Drowning or Asphyxia or Hanging
comment: This class denotes asphyxia

Auditory Attention Percentile Rank Total Correct
type: Class
type: Node shape
subclass of: Auditory Attention and Response Set Subtest
subclass of: Percentile Rank Total Correct
comment: This class denotes Auditory Attention Percentile Rank Total Correct

Interleukin-31
type: Class
type: Facet Value
subclass of: Protein
subclass of: HHEAR_01389
comment: This class denotes Interleukin-31
notation: IL31

composite score of the socio-emotional subscale
type: Class
type: Node shape
subclass of: Composite Score
subclass of: Bayley (III) Neurodevelopment
subclass of: social domain measurement
comment: This class denotes composite score of the socio-emotional subscale
notation: 834

Guatemala
type: geographic region
comment: The country of Guatemala
SIO_000313: Outside United States

Restriction
on property: SIO_000300
has value: 30.0

Upper Respiratory Tract Infection
type: Class
type: Quality Variable
subclass of: infection
comment: This class denotes Upper Respiratory Tract Infection

coccidiosis
type: Class
subclass of: Thing
comment: This class denotes coccidiosis

composite score for language composing of the receptive communication and expressive communication subscales
type: Class
type: Node shape
subclass of: Composite Score
subclass of: communicating
subclass of: Bayley (III) Neurodevelopment
comment: This class denotes composite score for language composing of the receptive communication and expressive communication subscales
notation: 835

Non-smoker
type: Class
type: Quality Value
subclass of: Smoking Status
notation: 59
definition: Doesn't smoke cigarettes.

Mean Height
type: Class
type: Quantity Variable
subclass of: SIO_000040
subclass of: SIO_001109
comment: This class denotes Mean Height

Non-White Hispanic
type: Class
type: Quality Value
subclass of: HHEAR_00522
subclass of: NCIT C17459
notation: 146
definition: Non-White and Hispanic

Inhibition Switching Percentile Rank Total Uncorrected Errors
type: Class
type: Node shape
subclass of: Inhibition Switching Subscale
subclass of: Percentile Rank Total Uncorrected Errors
comment: This class denotes Inhibition Switching Percentile Rank Total Uncorrected Errors

cortisol
type: Class
type: Node shape
type: Facet Value
subclass of: HHEAR_01392
comment: This class denotes cortisol
notation: CORTL

Employment Status
type: Class
type: Node shape
subclass of: Socioeconomic Status
subclass of: Activity
comment: The status of a person's employment

Bayley (III) Neurodevelopment
type: Class
type: Node shape
subclass of: Bayley III
comment: This class denotes Bayley (III) Neurodevelopment

dimensionless quantity
type: Class
subclass of: SIO_000052
comment: A dimensionless quantity is a quantity that has no associated unit. (Source: SIO Ontology)

Allergen
type: Class
subclass of: HHEAR_00062
subclass of: Drug, Food, Chemical or Biomedical Material
comment: A substance that elicits an allergic reaction. (Source: NCI Thesaurus)

vasopressor agent therapy
type: Class
type: Quality Variable
subclass of: Pharmacotherapy
comment: This class denotes vasopressor agent therapy

Asthma Controller Medication
type: Class
subclass of: pharmaceutical drug
definition: A class of pharmeceutical drugs that are used to prevent or manage the onset of acute asthma before an attack occurs.

diet measurement
type: Class
type: Node shape
subclass of: HHEAR_00053
comment: quantification of some aspect of diet, including diet patterns, balance of nutrient consumption and glycemic load (Source: Experimental Factors Ontology)

Inhibition Switching Percentile Rank Total Errors
type: Class
type: Node shape
subclass of: Inhibition Switching Subscale
subclass of: Percentile Rank Total Errors
comment: This class denotes Inhibition Switching Percentile Rank Total Errors

Retained Employment
type: Class
type: Quality Value
type: Node shape
subclass of: Employment Status
comment: The state of having retained the same employment status for a determined length of time
notation: 1081

dimensional quantity
type: Class
subclass of: SIO_000052
comment: A dimensional quantity is a quantity that has an associated unit. (Source: NCI Thesaurus)

composite score of the cognitive subscale
type: Class
type: Node shape
subclass of: Composite Score
subclass of: Bayley (III) Neurodevelopment
subclass of: cognitive domain measurement
comment: This class denotes composite score of the cognitive subscale
notation: 833

Gold
type: Class
subclass of: Metal
notation: Au
definition: GOLD is a yellow metallic element with the atomic symbol Au, atomic number 79, and atomic weight 197. It is used in jewelry, goldplating of other metals, as currency, and in dental restoration. Many of its clinical applications, such as ANTIRHEUMATIC AGENTS, are in the form of its salts.

collection
type: Class
subclass of: Thing
comment: This class denotes collection

Kaiser Permanente Insurance
type: Class
type: Quality Value
type: Node shape
subclass of: HHEAR_00418
comment: This class denotes Kaiser Permanente Insurance
notation: 668
disjoint with: Private Insurance Other Than Kaiser Permanente

Study Followup 3 Day 3
type: Class
type: Node shape
subclass of: Study Activity
subclass of: Restriction
  some values from: Study Followup 3
  on property: intervalDuring
subclass of: Restriction
  some values from: Study Followup 3 Day 2
  on property: intervalAfter
comment: The third day of the third study followup activity for a study

Austria
type: geographic region
comment: The country of Austria
SIO_000313: Outside United States

4-Hydroxybenzoic acid
type: Class
type: Facet Value
subclass of: CHEBI_33853
comment: This class denotes 4-Hydroxybenzoic acid
notation: HB4

Non-Hispanic Ethnicity
type: Class
type: Quality Value
type: Facet Value
subclass of: ethnicity
notation: 58
definition: Non-Hispanic Ethnicity
was approved by: PER-Jeanette-Stingone

A Sample has a Pairing
type: Class
subclass of: sampling
definition: Refers to having paired samples.
was approved by: PER-Jeanette-Stingone
editorial note: This actually should be a process. What should we do?

Urine grossly hematuric
type: Class
subclass of: comment
comment: This class denotes Urine grossly hematuric

Northwestern University
type: Quality Value
type: NamedIndividual
type: SIO_000290
comment: private university in Evanston, Illinois, U.S.
notation: 1194

body region fat morphological measurement
type: Class
subclass of: body fat morphological measurement
comment: A measurement on the adipose tissue in a portion of the body. (Source: Clinical Measurement Ontology)

North Dakota, United States of America
type: geographic region
comment: The state, province, or territory of North Dakota, United States of America
SIO_000313: Q186545

Childhood Followup 8
type: Class
subclass of: Study Followup 8
subclass of: Restriction
  on property: SIO_000668
  all values from: Childhood Period
subclass of: Restriction
  some values from: Childhood Period
  on property: intervalDuring
definition: A point in a study that occurs after the seventh follow-up point in the study and occurs during the study subject's childhood period.

Duration of Domicile in United States
type: Class
type: Quantity Variable
type: Node shape
subclass of: Demographic
subclass of: duration
comment: The length of time a person has lived in the United States

Islet Autoimmunity
type: Class
type: Quality Value
type: Node shape
subclass of: autoimmune disease of endocrine system
comment: Persistent Islet Autoimmunity (or any IA) was defined as confirmed positive insulin autoantibodies (IAAs), GAD antibody (GADA), specifically to isoform GAD65, or insulinoma antigen-2 autoantibody, which were analyzed by radiobinding assays (25,26) on at least two consecutive study visits.
notation: 643

Childhood Followup 3 Day 3
type: Class
type: Node shape
subclass of: Study Followup 3 Day 3
subclass of: Restriction
  some values from: Childhood Followup 3 Day 2
  on property: intervalAfter
subclass of: Restriction
  some values from: Childhood Followup 3
  on property: intervalDuring
comment: The third day of the third study followup activity for a study that occurs during a subject's childhood period

Greece
type: geographic region
comment: The country of Greece
SIO_000313: Outside United States

megabasepair
type: unit of measurement
notation: Mb

imidacloprid
type: Class
type: Node shape
type: Facet Value
subclass of: HHEAR_01374
comment: An imidazolidine that is N-nitroimidazolidin-2-imine bearing a (6-chloro-3-pyridinyl)methyl substituent at position 1. Source: ChEBI
notation: IMI

thousand parts per microgram
type: unit of measurement
notation: x103 µL

Unusually high
type: Class
subclass of: comment
comment: This class denotes Unusually high

agonist
type: Class
subclass of: Thing
comment: This class denotes agonist

Illinois, United States of America
type: geographic region
comment: The state, province, or territory of Illinois, United States of America
SIO_000313: Q186545

Propyl paraben
type: Class
type: Facet Value
subclass of: CHEBI_85122
notation: PrPB
definition: Propylparaben is a Standardized Chemical Allergen. The physiologic effect of propylparaben is by means of Increased Histamine Release, and Cell-mediated Immunity. The chemical classification of propylparaben is Allergens.

Brazil
type: geographic region
comment: The country of Brazil
SIO_000313: Outside United States

Microwave Oven Count
type: Class
type: Quantity Variable
subclass of: Household Appliance Count
definition: Number of machines in the home used to heat up food using microwaves.
was approved by: PER-Jeanette-Stingone
editorial note: Putting a note here, but it applies to all of the appliances. These are used to calculate the SES Index that was reported within one of the pilots. So, there needs to be some connection between these terms.

chronic obstructive pulmonary disease
type: Class
type: Quality Value
subclass of: Comorbidity Disease
comment: This class denotes chronic obstructive pulmonary disease
notation: 382

Acculturation
type: Class
subclass of: Study Indicator
definition: Acculturation explains the process of cultural change and psychological change that results following meeting between cultures. This metaclass contains all classes that measure this process.
was approved by: PER-Jeanette-Stingone

Value above LOD but below LLOQ
type: Class
subclass of: comment
comment: This class denotes Value above LOD but below LLOQ

Probiotic
type: Class
type: Node shape
subclass of: Dietary Supplement
comment: A live microorganism used as a dietary supplement to help with digestion and normal bowel function. It may also help keep the gastrointestinal (GI) tract healthy. A bacterium found in yogurt called Lactobacillus acidophilus, is the most common probiotic. (Source: NCI Thesaurus)

wasDerivedFrom
type: ObjectProperty
comment: The more specific subproperties of prov:wasDerivedFrom (i.e., prov:wasQuotedFrom, prov:wasRevisionOf, prov:hadPrimarySource) should be used when applicable.
range: Entity
domain: Entity

Number of Adults in Household
type: Class
type: Quantity Variable
type: Node shape
subclass of: Number of Members in Household
comment: This class denotes Number of Adults in Household

Study Followup 3 Day 2
type: Class
type: Node shape
subclass of: Study Activity
subclass of: Restriction
  some values from: Study Followup 3
  on property: intervalDuring
subclass of: Restriction
  some values from: Study Followup 3 Day 1
  on property: intervalAfter
comment: The second day of the third study followup activity for a study

Childhood Followup 3 Day 2
type: Class
type: Node shape
subclass of: Study Followup 3 Day 2
subclass of: Restriction
  some values from: Childhood Followup 3 Day 1
  on property: intervalAfter
subclass of: Restriction
  some values from: Childhood Followup 3
  on property: intervalDuring
comment: The second day of the third study followup activity for a study that occurs during a subject's childhood period

Turkey
type: geographic region
comment: The country of Turkey
SIO_000313: Outside United States

Abdomen
type: Class
subclass of: biological entity
comment: This class denotes Abdomen

Neighbor
type: Class
type: Quality Value
subclass of: SIO_000016
subclass of: SIO_000287
subclass of: Restriction
  on property: SIO_000668
  all values from: Class
    intersection of: SIO_000485
notation: 355
definition: A person living near or next door to another person.

Abnormal hemoglobin variant observed
type: Class
subclass of: comment
comment: This class denotes Abnormal hemoglobin variant observed

Valid measurement, results repeated and confirmed (0, 33)
type: Class
subclass of: comment
comment: This class denotes Valid measurement, results repeated and confirmed (0, 33)

spinal injury
type: Class
type: Node shape
subclass of: Neurological Issues with Spinal Cord
comment: This class denotes spinal injury

time measurement
type: Class
subclass of: Thing
comment: This class denotes time measurement

Number of Children in Household
type: Class
type: Quantity Variable
type: Node shape
subclass of: Number of Members in Household
comment: This class denotes Number of Children in Household

on property: minValue
has value: 1251

Childhood Followup 7
type: Class
subclass of: Study Followup 7
subclass of: Restriction
  on property: SIO_000668
  all values from: Childhood Period
subclass of: Restriction
  some values from: Childhood Period
  on property: intervalDuring
definition: A point in a study that occurs after the sixth follow-up point in the study and occurs during the study subject's childhood period.

Torn, perforated screen
type: Class
subclass of: comment
comment: This class denotes Torn, perforated screen

Volatile Organic Compound
type: Class
type: Facet
subclass of: Targeted Analyte
comment: This class denotes Volatile Organic Compound
notation: VOCs

Malarial Retinopathy
type: Class
type: Quality Value
subclass of: Retinopathy
notation: 130
definition: Retinopathy due to malaria.

dehydroepiandrosterone sulfate
type: Class
subclass of: HHEAR_00034
subclass of: HHEAR_00548
definition: A steroid sulfate that is the 3-sulfooxy derivative of dehydroepiandrosterone.

Advance Directive
type: Class
type: Quality Variable
subclass of: Medical History
subclass of: SIO_000148
comment: A legal document that states the treatment or care a person wishes to receive or not receive if he or she becomes unable to make medical decisions (for example, due to being unconscious or in a coma). Some types of advance directives are living wills and do-not-resuscitate (DNR) orders. (Source: NCI Thesaurus)

Beryllium
type: Class
type: Facet Value
subclass of: Metal
subclass of: HHEAR_01387
notation: Be
definition: Beryllium. An element with the atomic symbol Be, atomic number 4, and atomic weight 9.01218. Short exposure to this element can lead to a type of poisoning known as BERYLLIOSIS.

Annual Income $35,000 to $49,999
type: Class
type: Quality Value
type: Node shape
subclass of: Annual Income $30,000 to $49,999
subclass of: HHEAR_00541
subclass of:
  on property: currency
  has value: USD
subclass of:
  on property: minValue
  has value: 35000
comment: This class denotes Annual Income $35,000 to $49,999
notation: 666

Study Followup 3 Day 1
type: Class
type: Node shape
subclass of: Study Activity
subclass of: Restriction
  some values from: Study Followup 3
  on property: intervalDuring
comment: The first day of the third study followup activity for a study

Copper
type: Class
type: Facet Value
subclass of: Metal
subclass of: HHEAR_01387
notation: Cu
definition: COPPER is a heavy metal trace element with the atomic symbol Cu, atomic number 29, and atomic weight 63.55.

Torn bag (Mitest intact, capped)
type: Class
subclass of: comment
comment: This class denotes Torn bag (Mitest intact, capped)

Portugal
type: geographic region
comment: The country of Portugal
SIO_000313: Outside United States

Mercury Species
type: Class
subclass of: Targeted Analyte
comment: This class denotes Mercury Species

Zinc
type: Class
type: Facet Value
subclass of: Metal
subclass of: HHEAR_01387
notation: Zn
definition: A metallic element of atomic number 30 and atomic weight 65.38. It is a necessary trace element in the diet, forming an essential part of many enzymes, and playing an important role in protein synthesis and in cell division. Zinc deficiency is associated with ANEMIA, short stature, HYPOGONADISM, impaired WOUND HEALING, and geophagia. It is known by the symbol Zn.

Annual Income $75,000 to $149,999
type: Class
type: Quality Value
type: Node shape
subclass of: Annual Income More Than $70,001
subclass of:
  on property: minValue
  has value: 75000
subclass of:
  on property: SIO_000900
  has value: year
subclass of:
  on property: maxValue
  has value: 149999
comment: This class denotes Annual Income $75,000 to $149,999
notation: 667

Childhood Followup 3 Day 1
type: Class
type: Node shape
subclass of: Study Followup 3 Day 1
subclass of: Restriction
  some values from: Childhood Followup 3
  on property: intervalDuring
comment: The first day of the third study followup activity for a study that occurs during a subject's childhood period

Nervous System
type: Class
subclass of: organ
definition: The nervous system is an organ system containing predominantly neuron and glial cells. In bilaterally symmetrical organism, it is arranged in a network of tree-like structures connected to a central body. The main functions of the nervous system are to regulate and control body functions, and to receive sensory input, process this information, and generate behavior

Cognitive Entity
type: Class
subclass of: HHEAR_00198
comment: This class denotes Cognitive Entity

Methyl Paraben
type: Class
type: Facet Value
subclass of: CHEBI_85122
notation: MePB
definition: Methylparaben is a Standardized Chemical Allergen. The physiologic effect of methylparaben is by means of Increased Histamine Release, and Cell-mediated Immunity. The chemical classification of methylparaben is Allergens.

Diet
type: Class
type: Quality Variable
subclass of: HHEAR_00053
definition: The customary allowance of food and drink taken by a person or an animal from day to day, particularly one especially planned to meet specific requirements of the individual, including or excluding certain items of food; a prescribed course of eating and drinking in which the amount and kind of food, as well as the times at which it is to be taken, are regulated for therapeutic purposes or selected with reference to a particular state of health.

Russia
type: geographic region
comment: The country of Russia
SIO_000313: Outside United States

picomoles per milliliter
type: unit of measurement
notation: pmol/ml

Unusual color
type: Class
subclass of: comment
comment: This class denotes Unusual color

2,3,3,3-Tetrafluoro-2-(heptafluoropropoxy)propanoic acid
type: Class
type: Node shape
type: Facet Value
subclass of: Perfluoroakyl and Polyfluoroalkyl Substance
comment: 2,3,3,3-tetrafluoro-2-(heptafluoropropoxy)propanoic acid is a perfluorinated compound that is 2-propoxypentanoic acid in which all 11 of the hydrogens attached to carbon atoms have been replaced by fluorine atoms. Used as an alternative to perfluorooctanoic acid in the fluoropolymer industry for years, its widespread environmental distribution, high bioaccumulation capability, and human exposure have caused great concern, particularly as its potential toxicity and health risk is still largely unknown. It is a monocarboxylic acid, a perfluorinated compound and an ether. (Source: Pubchem)
notation: GENX

Married or living together with partner
type: Class
type: Quality Value
type: Node shape
subclass of: SIO_000287
subclass of: Class
  union of: Domestic Partnership
  union of: NCIT C51773
comment: This class denotes Married or living together with partner
notation: 1104

Liquid Chromatography–Mass Spectrometer
type: Class
subclass of: HHEAR_00193
subclass of: Mass Spectrometer
definition: An analytical chemistry technique that combines the physical separation capabilities of liquid chromatography (or HPLC) with the mass analysis capabilities of mass spectrometry (MS). Coupled chromatography - MS systems are popular in chemical analysis because the individual capabilities of each technique are enhanced synergistically. While liquid chromatography separates mixtures with multiple components, mass spectrometry provides structural identity of the individual components with high molecular specificity and detection sensitivity. This tandem technique can be used to analyze biochemical, organic, and inorganic compounds commonly found in complex samples of environmental and biological origin.
was approved by: PER-Jim-McCusker

rest: nil
first:
  min inclusive: 2

Study Followup 2 Day 4
type: Class
type: Node shape
subclass of: Study Activity
subclass of: Restriction
  some values from: Study Followup 2
  on property: intervalDuring
comment: The fourth day of the second study followup activity for a study

Turbid
type: Class
subclass of: comment
comment: This class denotes Turbid

Single/widow or living separated
type: Class
type: Quality Value
type: Node shape
subclass of: SIO_000287
subclass of: Class
  union of: NCIT C51777
comment: This class denotes Single/widow or living separated
notation: 1105

Macromolecule
type: Class
subclass of: Biomolecule
definition: A very large molecule, such as protein, commonly created by polymerization of smaller subunits (monomers). They are typically composed of thousands of atoms or more. The most common macromolecules in biochemistry are biopolymers (nucleic acids, proteins, carbohydrates and polyphenols) and large non-polymeric molecules (such as lipids and macrocycles).

Childhood Followup 2 Day 4
type: Class
type: Node shape
subclass of: Study Followup 2 Day 4
subclass of: Restriction
  some values from: Childhood Followup 2 Day 3
  on property: intervalAfter
comment: The fourth day of the second study followup activity for a study that occurs during a subject's childhood period

Recruited In Sweden
type: Class
type: Quality Value
type: Node shape
subclass of: Population Group by Recruitment Location
subclass of: Restriction
  on property: SIO_000668
  has value: Sweden
comment: A population group of study participants that were recruited in Sweden
notation: 602

Neonatal Death
type: Class
type: Quality Value
type: Node shape
subclass of: HHEAR_00036
subclass of: Pregnancy Outcome By Fetal Status
comment: Death of a live newborn during the first 28 days of life. (Source: NCI Thesaurus)
notation: 1064

microcurie per milliliter
type: unit of measurement
notation: µcurie/ml

East Bay, San Andreas, and Golden Gate
type: Class
type: Quality Value
subclass of: Population Group
comment: This class denotes East Bay, San Andreas, and Golden Gate
notation: 338

Black or African American
type: Class
type: Quality Value
type: Facet Value
subclass of: race
subclass of: HHEAR_00522
notation: 8
definition: A person having origins in any of the Black racial groups of Africa. Terms such as "Haitian" or "Negro" can be used in addition to "Black or African American".
was approved by: PER-Jeanette-Stingone

Valley Mt, Central Valley, and Kern
type: Class
type: Quality Value
subclass of: Population Group
comment: This class denotes Valley Mt, Central Valley, and Kern
notation: 339

Anthropometry
type: Class
subclass of: Study Indicator
definition: Attributes pertaining to the scientific study of the measurements and proportions of the human body.
was approved by: PER-Jeanette-Stingone

curie per liter
type: unit of measurement
notation: curie/l

tebuconazole
type: Class
type: Node shape
type: Facet Value
subclass of: HHEAR_01374
comment: A racemate composed of equimolar amounts of (R)- and (S)-tebuconazole. A fungicide effective against various smut and bunt diseases in cereals and other field crops. Source:ChEBI
notation: TBZ

Recruited In Finland
type: Class
type: Quality Value
type: Node shape
subclass of: Population Group by Recruitment Location
subclass of: Restriction
  on property: SIO_000668
  has value: Finland
comment: A population group of study participants that were recruited in Finland
notation: 600

Alberta, Canada
type: geographic region
comment: The state, province, or territory of Alberta, Canada
SIO_000313: Canada

bacterial infectious disease
type: Class
subclass of: Thing
comment: This class denotes bacterial infectious disease

on property: maxValue
has value: 1250

Recruited In Germany
type: Class
type: Quality Value
type: Node shape
subclass of: Population Group by Recruitment Location
comment: A population group of study participants that were recruited in Germany
notation: 601

Nova Scotia, Canada
type: geographic region
comment: The state, province, or territory of Nova Scotia, Canada
SIO_000313: Canada

2,4-Dichlorophenoxyacetic acid
type: Class
type: Node shape
type: Facet Value
subclass of: HHEAR_01374
comment: 2,4-dichlorophenoxyacetic acid is an odorless white to tan solid. Sinks in water. (USCG, 1999) 2,4-Dichlorophenoxyacetic acid (2,4-D) does not occur naturally in the environment. 2,4-D is the active ingredient in many products used in the United States and throughout the world as an herbicide to kill weeds on land and in the water. There are nine forms of 2,4-D that can be used as an herbicide and it is typically sold as a powder or in a liquid form. 2,4-D is a chlorophenoxyacetic acid that is phenoxyacetic acid in which the ring hydrogens at postions 2 and 4 are substituted by chlorines. It has a role as a synthetic auxin, a defoliant, an agrochemical, an EC 1.1.1.25 (shikimate dehydrogenase) inhibitor, an environmental contaminant and a phenoxy herbicide. It is a chlorophenoxyacetic acid and a dichlorobenzene. It is a conjugate acid of a (2,4-dichlorophenoxy)acetate. Source: Pubchem
notation: D24

Cough
type: Class
subclass of: wheezing or tightness in the chest or cough
comment: This class denotes Cough

on property: maxValue
has value: 14999

Emergency Medical Services Facility
type: Class
subclass of: NCIT C21541
comment: This class denotes Emergency Medical Services Facility

Recruited In Georgia or Florida
type: Class
type: Quality Value
type: Node shape
subclass of: Population Group by Recruitment Location
subclass of: Class
  union of: Restriction
    on property: SIO_000668
    has value: Florida, United States of America
comment: A population group of study participants that were recruited in either Georgia or Florida
notation: 598

Z-Score For Fixed Gestational Age and Sex
type: Class
type: Quantity Variable
type: Node shape
subclass of: Z-Score
subclass of: Restriction
  some values from: Gestational Age
  on property: RO_0000079
subclass of: Restriction
  some values from: biological sex
  on property: RO_0000079
comment: A Z-score computation from a population which all share the same gestational age range and sex assignment

centiMorgan
type: unit of measurement
notation: cM

Analysis Mode
type: Class
type: Quality Variable
subclass of: Sample Indicator
definition: Analysis Mode

Value greater than ULOQ
type: Class
subclass of: comment
comment: This class denotes Value greater than ULOQ

beta-cryptoxanthin
type: Class
type: Node shape
type: Facet Value
subclass of: HHEAR_01390
comment: A carotenol that exhibits antioxidant activity. It has been isolated from fruits such as papaya and oranges. (Source: ChEBI)
notation: CRYP

Observational Cohort Study
type: Class
subclass of: study
comment: This class denotes Observational Cohort Study

on property: minValue
has value: 50001

Recruited In Washington State
type: Class
type: Quality Value
type: Node shape
subclass of: Population Group by Recruitment Location
subclass of: Restriction
  on property: SIO_000668
  has value: Washington, United States of America
comment: A population group of study participants that were recruited in Washington State
notation: 599

Tris(2-chloroethyl) phosphate
type: Class
type: Node shape
type: Facet Value
subclass of: HHEAR_01372
comment: This class denotes Tris(2-chloroethyl) phosphate
notation: TCEP

Alcohol, Tobacco, and Illicit Drug Use
type: Class
subclass of: Study Indicator
definition: Alcohol, Tobacco, and Illicit Drug Use Indicator Class
was approved by: PER-Jeanette-Stingone

Value below LLOQ, no LOD provided
type: Class
subclass of: comment
comment: This class denotes Value below LLOQ, no LOD provided

Fluticasone propionate DPI (Flovent Diskus)
type: Class
subclass of: Asthma Controller Medication
comment: This class denotes Fluticasone propionate DPI (Flovent Diskus)

2,4,5-Trichlorophenoxyacetic acid
type: Class
type: Node shape
type: Facet Value
subclass of: HHEAR_01374
comment: 2,4,5-trichlorophenoxyacetic acid is a light tan solid (melting point 153 °C). Insoluble in water. Contact may irritate the skin. (2,4,5-trichlorophenoxy)acetic acid is a chlorophenoxyacetic acid that is phenoxyacetic acid in which the ring hydrogens at postions 2, 4 and 5 are substituted by chlorines. It has a role as a defoliant, a synthetic auxin and a phenoxy herbicide. It is a chlorophenoxyacetic acid and a trichlorobenzene. It is a conjugate acid of a (2,4,5-trichlorophenoxy)acetate. An herbicide with strong irritant properties. Use of this compound on rice fields, orchards, sugarcane, rangeland, and other noncrop sites was terminated by the EPA in 1985. (From Merck Index, 11th ed) Source: Pubchem
notation: T245

influenza
type: Class
type: Quality Value
subclass of: DOID 934
subclass of: respiratory system disease
comment: This class denotes influenza
notation: 1070

Type 1 Diabetes and Islet Autoimmunity
type: Class
type: Quality Value
type: Node shape
subclass of: type 1 diabetes mellitus
subclass of: Islet Autoimmunity
subclass of: Class
  intersection of: type 1 diabetes mellitus
  intersection of: Islet Autoimmunity
comment: The condition of having both Type 1 Diabetes Mellitus and Islet Autoimmunity disease
notation: 644

Private Insurance Other Than Kaiser Permanente
type: Class
type: Quality Value
type: Node shape
subclass of: HHEAR_00418
comment: This class denotes Private Insurance Other Than Kaiser Permanente
notation: 669
equivalent class: Class
  intersection of: HHEAR_00418
  intersection of: Class
    complement of: Kaiser Permanente Insurance
  equivalent class: Private Insurance Other Than Kaiser Permanente
disjoint with: Kaiser Permanente Insurance

Study Followup 3 Day 4
type: Class
type: Node shape
subclass of: Study Activity
subclass of: Restriction
  some values from: Study Followup 3
  on property: intervalDuring
subclass of: Restriction
  some values from: Study Followup 3 Day 3
  on property: intervalAfter
comment: The fourth day of the third study followup activity for a study

Attribute
type: Class
subclass of: Science Indicator
comment: This class denotes Attribute

Increased Body Weight
type: Class
type: Quality Value
subclass of: Body Weight Quality
subclass of: Restriction
  some values from: Restriction
    some values from: Class
      intersection of: Body Mass Index
    on property: SIO_000008
  on property: SIO_000011
notation: 72
definition: BMI > 25

kilobasepair
type: unit of measurement
notation: kbp

Analyzed at a later date than rest of samples on worksheet (not a repeat)
type: Class
subclass of: comment
comment: This class denotes Analyzed at a later date than rest of samples on worksheet (not a repeat)

Children's Depression Inventory
type: Class
type: Node shape
subclass of: Research or Clinical Assessment Tool
comment: This class denotes Children's Depression Inventory

Recruited In Colorado
type: Class
type: Quality Value
type: Node shape
subclass of: Population Group by Recruitment Location
subclass of: Restriction
  on property: SIO_000668
  has value: Colorado, United States of America
comment: A population group of study participants that were recruited in Colorado
notation: 695

centiRay
type: unit of measurement
notation: cR

Analyte
type: Class
subclass of: chemical entity
comment: This class denotes Analyte

American Samoa, United States of America
type: geographic region
comment: The state, province, or territory of American Samoa, United States of America
SIO_000313: United States of America

cell measurement
type: Class
subclass of: Thing
comment: This class denotes cell measurement

on property: maxValue
has value: 3333

PCB118
type: Class
type: Facet Value
subclass of: Polychlorobiphenyl
comment: This class denotes PCB118
notation: PCB118

Intensive Care Unit
type: Class
type: Quality Value
subclass of: Destination
subclass of: NCIT C21541
notation: 168
definition: A health care facility unit that provides intensive care to critically ill patients and patients with complex medical problems who require constant monitoring or special therapy.

Triclocarban
type: Class
type: Facet Value
subclass of: CHEBI_33853
notation: TCC
definition: Triclocarban is a triclosan analogue with an antibacterial property. Triclocarban exerts its effect by inhibiting the activity of enoyl-(acyl-carrier protein) (ACP) reductase, widely distributed in bacteria, fungi and plants. ACP reductase catalyses the last step in each cycle of fatty acid elongation in the type II fatty acid synthase systems. As a result, this agent interrupts cell membrane synthesis and leads to bacterial growth inhibition.

Daughter
type: Class
subclass of: Child
definition: The female offspring in relation to her parents.

Annual Income $75,000 to $99,999
type: Class
type: Quality Value
subclass of: Annual Income $50,000 to $99,999
subclass of: Annual Income $75,000 to $149,999
subclass of: Annual Income $60,000 to $100,000
subclass of:
  on property: currency
  has value: USD
subclass of:
  on property: SIO_000900
  has value: year
subclass of:
  on property: maxValue
  has value: 99999
comment: This class denotes Annual Income $75,000 to $99,999
notation: 421

Pregnancy Month 6
type: Class
subclass of: time interval
definition: The sixth month of pregnancy

Annual Income $75,000 to $84,999
type: Class
type: Quality Value
subclass of: Annual Income $75,000 to $99,999
subclass of:
  on property: SIO_000900
  has value: year
subclass of:
  on property: minValue
  has value: 75000
subclass of:
  on property: maxValue
  has value: 84999
subclass of:
  on property: currency
  has value: USD
comment: This class denotes Annual Income $75,000 to $84,999
notation: 262

Percentile Rank Of 9%
type: Class
type: Quality Value
type: Node shape
subclass of: Percentile Rank Between 3% and 10%
comment: A percentile rank value of 9%
notation: 1036

Low Socioeconomic Status
type: Class
type: Quality Value
type: Node shape
subclass of: AMAI Socioeconomic Levels Index
comment: This class denotes Low Socioeconomic Status
notation: 1140

Location
type: Class
subclass of: Entity
comment: This class denotes Location

quality
type: Class
subclass of: Thing
comment: This class denotes quality

Recruited In Brazil-Salvador
type: Class
type: Quality Value
type: Node shape
subclass of: Population Group by Recruitment Location
comment: A population group of study participants that were recruited in Brazil-Salvador
notation: 908

Conceiving Activity
type: Class
type: Node shape
subclass of: HHEAR_00549
subclass of: Activity
comment: Any activity related to conceiving an offspring

Jamaica
type: geographic region
comment: The country of Jamaica
SIO_000313: Outside United States

Annual Income $65,000 to $74,999
type: Class
type: Quality Value
subclass of: Annual Income $50,000 to $99,999
subclass of: HHEAR_01116
subclass of: Annual Income $60,000 to $74,999
subclass of:
  on property: currency
  has value: USD
subclass of:
  on property: minValue
  has value: 65000
subclass of:
  on property: SIO_000900
  has value: year
subclass of:
  on property: maxValue
  has value: 74999
comment: This class denotes Annual Income $65,000 to $74,999
notation: 263

Time Since Last Visit
type: Class
type: Node shape
subclass of: duration
comment: The elapsed time since the last study visit for a subject

Public or No Insurance
type: Class
type: Quality Value
subclass of: Insurance
comment: This class denotes Public or No Insurance
notation: 335
equivalent class: Class
  union of: HHEAR_00299
  union of: HHEAR_00408
  equivalent class: Public or No Insurance

Father
type: Class
type: Quality Value
subclass of: Parent
subclass of: Restriction
  on property: SIO_000227
notation: 188
definition: The male parent of a child. Besides the paternal bonds of a father to his children, the father may have a parental legal and social relationship with the child that carries with it certain rights and obligations. An adoptive father is a male who has become the child's parent through the legal process of adoption. A biological father is the male genetic contributor to the creation of the baby, through sexual intercourse or sperm donation. A biological father may have legal obligations to a child not raised by him, such as an obligation of monetary support. A putative father is a man whose biological relationship to a child is alleged but has not been established. A stepfather is a male who is the husband of a child's mother and they may form a family unit, but who generally does not have the legal rights and responsibilities of a parent in relation to the child.
was approved by: PER-Jeanette-Stingone

Percentile Rank Of 16%
type: Class
type: Quality Value
type: Node shape
subclass of: Percentile Rank Between 11% and 25%
comment: A percentile rank value of 16%
notation: 1037

3-hydroxyfluorene
type: Class
type: Facet Value
subclass of: polycyclic hydrocarbon
comment: This class denotes 3-hydroxyfluorene
notation: FLUO3

process
type: Class
subclass of: Science Indicator
comment: This class denotes process

First Child
type: Class
type: Node shape
subclass of: Child
subclass of: First
comment: The first live born child

Recruited In Guatemala
type: Class
type: Quality Value
type: Node shape
subclass of: Population Group by Recruitment Location
subclass of: Restriction
  on property: SIO_000668
  has value: Guatemala
comment: A population group of study participants that were recruited in Guatemala
notation: 909

Annual Income $40,000 to $49,999
type: Class
type: Quality Value
subclass of: Annual Income $35,000 to $49,999
subclass of: Annual Income $40,000 to $60,000
subclass of:
  on property: SIO_000900
  has value: year
subclass of:
  on property: minValue
  has value: 40000
subclass of:
  on property: maxValue
  has value: 49999
comment: This class denotes Annual Income $40,000 to $49,999
notation: 419

Average Folic Acid Supplement Intake
type: Class
type: Quantity Variable
subclass of: SIO_001109
subclass of: Uses Folic Acid Supplement
comment: This class denotes Average Folic Acid Supplement Intake

Percentile Rank Of 2%
type: Class
type: Quality Value
type: Node shape
subclass of: Percentile Rank Less Than Or Equal To 2%
comment: A percentile rank value of 2%
notation: 1034

Annual Income More Than $95,000
type: Class
type: Quality Value
subclass of: Annual Income More Than $70,001
subclass of:
  on property: minValue
  has value: 95000
subclass of:
  on property: SIO_000900
  has value: year
subclass of:
  on property: maxValue
comment: This class denotes Annual Income More Than $95,000
notation: 260

High Socioeconomic Status
type: Class
type: Quality Value
type: Node shape
subclass of: AMAI Socioeconomic Levels Index
comment: This class denotes High Socioeconomic Status
notation: 1139

Tungsten
type: Class
type: Facet Value
subclass of: Metal
subclass of: HHEAR_01387
notation: W
definition: Tungsten. A metallic element with the atomic symbol W, atomic number 74, and atomic weight 183.85. TUNGSTEN is used in many manufacturing applications, including increasing the hardness, toughness, and tensile strength of steel; manufacture of filaments for incandescent light bulbs; and in contact points for automotive and electrical apparatus.

Post-Bronchodilator Spirometry Testing
type: Class
type: Node shape
subclass of: Spirometry Testing
subclass of: Restriction
  some values from: Pre-Bronchodilator Spirometry Testing
  on property: intervalAfter
comment: The stage of a spirometry test during which measurements of the subject are taken after the admission of a bronchodilator

Average B6 Supplement Intake
type: Class
type: Quantity Variable
subclass of: SIO_001109
subclass of: Uses B6 Supplement
comment: This class denotes Average B6 Supplement Intake

Annual Income $85,000 to $94,999
type: Class
type: Quality Value
subclass of: Annual Income $75,000 to $99,999
subclass of:
  on property: SIO_000900
  has value: year
subclass of:
  on property: maxValue
  has value: 94999
subclass of:
  on property: minValue
  has value: 85000
comment: This class denotes Annual Income $85,000 to $94,999
notation: 261

Annual Income $50,000 to $74,999
type: Class
type: Quality Value
subclass of: Annual Income $50,000 to $99,999
subclass of: HHEAR_02320
subclass of:
  on property: SIO_000900
  has value: year
subclass of:
  on property: minValue
  has value: 50000
subclass of:
  on property: currency
  has value: USD
comment: This class denotes Annual Income $50,000 to $74,999
notation: 420

disease by infectious agent
type: Class
subclass of: Thing
comment: This class denotes disease by infectious agent

Percentile Rank Of 5%
type: Class
type: Quality Value
type: Node shape
subclass of: Percentile Rank Between 3% and 5%
comment: A percentile rank value of 5%
notation: 1035

Medium Socioeconomic Status
type: Class
type: Quality Value
type: Node shape
subclass of: AMAI Socioeconomic Levels Index
comment: This class denotes Medium Socioeconomic Status
notation: 1141

Dollars Per Month
type: Class
type: Node shape
subclass of: rate unit
comment: A unit of measure for dollars per month

Afrodeciente
type: Class
type: Node shape
subclass of: Black Non-Hispanic
comment: Of Black African descent
notation: 907
alternative label: Afrodecendente

cardiovascular disease biomarker measurement
type: Class
type: Node shape
subclass of: Physical And Mental Assessment
comment: cardiovascular disease biomarkers, such as ST2 cardiac biomarker and C-reactive protein, are used as indicators for cardiovascular disease and as predictors for therapeutic responses

AMAI Socioeconomic Status Level D
type: Class
type: Node shape
subclass of: Low Socioeconomic Status
comment: This class denotes AMAI Socioeconomic Status Level D

Annual Income $20,000 to $29,999
type: Class
type: Quality Value
subclass of: Annual Income $15,000 to $29,999
subclass of: HHEAR_00540
subclass of: Annual Income $20,000 to $50,000
subclass of:
  on property: SIO_000900
  has value: year
subclass of:
  on property: minValue
  has value: 20000
subclass of:
  on property: currency
  has value: USD
comment: This class denotes Annual Income $20,000 to $29,999
notation: 417

Uses B6 Supplement
type: Class
type: Quality Value
subclass of: nutrition intake
subclass of: Restriction
  some values from: B6 Vitamin Supplement
  on property: SIO_000139
comment: This class denotes Uses B6 Supplement
notation: 334

behavioral phenotype
type: Class
subclass of: phenotype
comment: This class denotes behavioral phenotype

Spirometry Testing
type: Class
type: Node shape
subclass of: Study Activity
comment: An event during which a spirometry test occurs

Percentile Rank Of 1%
type: Class
type: Quality Value
type: Node shape
subclass of: Percentile Rank Less Than 2%
comment: A percentile rank value of 1%
notation: 1033

Annual Income $30,000 to $39,999
type: Class
type: Quality Value
subclass of: Annual Income $30,000 to $49,999
subclass of: Annual Income $20,001 to $40,000
subclass of: HHEAR_02319
subclass of:
  on property: maxValue
  has value: 39999
subclass of:
  on property: currency
  has value: USD
subclass of:
  on property: minValue
  has value: 30000
subclass of:
  on property: SIO_000900
  has value: year
comment: This class denotes Annual Income $30,000 to $39,999
notation: 418

Never exposed to second hand smoke from E-cigarettes
type: Class
type: Quality Value
subclass of: environmental e-cigarette smoke exposure measurement
comment: This class denotes Never exposed to second hand smoke from E-cigarettes
notation: 259

AMAI Socioeconomic Status Level E
type: Class
type: Node shape
subclass of: Low Socioeconomic Status
comment: This class denotes AMAI Socioeconomic Status Level E

Average Iron Supplement Intake
type: Class
type: Quantity Variable
subclass of: SIO_001109
subclass of: Uses Iron Supplement
comment: This class denotes Average Iron Supplement Intake

Pre-Bronchodilator Spirometry Testing
type: Class
type: Node shape
subclass of: Spirometry Testing
comment: The stage of a spirometry test during which measurements of the subject are taken before the admission of a bronchodilator

AMAI Socioeconomic Status Level C-
type: Class
type: Node shape
subclass of: Medium Socioeconomic Status
comment: This class denotes AMAI Socioeconomic Status Level C-

Shannon diversity index
type: Class
type: Quantity Variable
subclass of: Physical And Mental Assessment
subclass of: HHEAR_00549
subclass of: community species diversity
comment: This class denotes Shannon diversity index

Grenada
type: geographic region
comment: The country of Grenada
SIO_000313: Outside United States

Childhood Followup 6
type: Class
subclass of: Study Followup 6
subclass of: Restriction
  some values from: Childhood Period
  on property: intervalDuring
definition: A point in a study that occurs after the fifth follow-up point in the study and occurs during the study subject's childhood period.

Annual Income $5,000 to $9,999
type: Class
type: Quality Value
type: Node shape
subclass of: Annual Income $10,000 or Less
subclass of:
  on property: currency
  has value: USD
subclass of:
  on property: SIO_000900
  has value: year
comment: This class denotes Annual Income $5,000 to $9,999
notation: 415

Uses Folic Acid Supplement
type: Class
type: Quality Value
subclass of: nutrition intake
subclass of: Restriction
  some values from: Folic Acid Vitamin Supplement
  on property: SIO_000139
comment: This class denotes Uses Folic Acid Supplement
notation: 333

colony forming unit
type: unit of measurement
notation: cfu

AMAI Socioeconomic Status Level D+
type: Class
type: Node shape
subclass of: Medium Socioeconomic Status
comment: This class denotes AMAI Socioeconomic Status Level D+

Home
type: Class
type: Quality Value
subclass of: Destination
notation: 167
definition: A person's place of residence.

2-[(2-Hydroxy-2-methylpropoxy)carbonyl]benzoate
type: Class
type: Node shape
subclass of: Phthalate
comment: This class denotes 2-[(2-Hydroxy-2-methylpropoxy)carbonyl]benzoate
notation: MHIBP

serum cholesterol level
type: Class
subclass of: CMO_0002049
subclass of: CMO_0002280
comment: The amount of cholesterol, a eukaryotic sterol that in higher animals is the precursor of bile acids and steroid hormones and a key constituent of cell membranes, in a specified sample of serum, the clear liquid that separates from blood after it has clotted completely, i.e. blood plasma from which fibrinogen has been removed. Cholesterol in the serum is associated with various lipoproteins. (Source: Clinical Measurements Ontology)

B6 Vitamin Supplement
type: Class
type: Quality Value
subclass of: Vitamin B6 or Vitamin B7 or B Complex Vitamin Supplement
comment: This class denotes B6 Vitamin Supplement
notation: 1209

1-hydroxypyrene
type: Class
type: Facet Value
subclass of: polycyclic hydrocarbon
comment: This class denotes 1-hydroxypyrene
notation: PYR1

Annual Income $10,000 to $19,999
type: Class
type: Quality Value
subclass of: Annual Income $20,000 or Less
subclass of:
  on property: minValue
  has value: 10000
subclass of:
  on property: currency
  has value: USD
subclass of:
  on property: SIO_000900
  has value: year
comment: This class denotes Annual Income $10,000 to $19,999
notation: 416

SIO_000751
type: Quality Value
notation: 133

on property: minValue
has value: 0

2, 4'-DDT
type: Class
type: Facet Value
subclass of: HHEAR_01375
comment: This class denotes 2, 4'-DDT
notation: OPDDT

Relative Time
type: Class
subclass of: time measurement
subclass of: Restriction
  on property: SIO_000668
  all values from: Class
    intersection of: process
definition: A time in relation to an event

Step Father
type: Class
type: Quality Value
type: Node shape
subclass of: Father
subclass of: NCIT C166116
comment: A male that is related to a child or children through marriage to their biological parent. (Source: NCI Thesaurus)
notation: 657

Fetal Loss within 20 weeks
type: Class
type: Quality Value
type: Node shape
subclass of: Fetal Loss
subclass of: Pregnancy Outcome By Fetal Status
comment: late fetal death: Death of a fetus at 16 weeks, 0 days to 19 weeks, 6 days of gestation. early fetal death: Death of a fetus at 10 weeks, 0 days to 15 weeks, 6 days of gestation. [https://www.ebi.ac.uk/ols4/search?q=fetal+death ]
notation: 1083
union of: NCIT C112862
union of: NCIT C112863

Mixed Ethnicity
type: Class
type: Quality Value
type: Node shape
subclass of: ethnicity
comment: This class denotes Mixed Ethnicity
notation: 831
alternative label: Mixed (ethnicity)
note: Entity defines mixed ethnicity and was included in the context of a study in Suriname

Infinium Methylation EPIC BeadChip Assay
type: Class
subclass of: HHEAR_00197
subclass of: HHEAR_00195
comment: This class denotes Infinium Methylation EPIC BeadChip Assay

Beats per Minute
type: Class
type: unit of measurement
type: Node shape
subclass of: UO_0000148
comment: The number of heartbeats measured per minute time. [Definition Source: NCI]

Interleukin-1 beta
type: Class
type: Facet Value
subclass of: Protein
subclass of: HHEAR_01389
notation: IL1B
definition: Potent proinflammatory cytokine. Initially discovered as the major endogenous pyrogen, induces prostaglandin synthesis, neutrophil influx and activation, T-cell activation and cytokine production, B-cell activation and antibody production, and fibroblast proliferation and collagen production. Promotes Th17 differentiation of T-cells.

Analysis
type: Class
subclass of: Analyte
definition: The value contains concentrations from the study sample

Restriction
some values from: Datatype
  with restrictions:
    min inclusive: 6.767
  on datatype: float
on property: value

Breast Feeding
type: Class
type: Quality Value
type: Node shape
subclass of: Feeding Method
comment: The nursing of an infant at the mother's breast. [Definition Source: NCI]
notation: 677

Insurance Type
type: Class
type: Quality Variable
subclass of: Insurance
definition: Insurance Type

forced expiratory volume to forced vital capacity ratio
type: Class
type: Quantity Variable
subclass of: Physical And Mental Assessment
comment: This class denotes forced expiratory volume to forced vital capacity ratio
alternative label: FEV1/FVC Ratio

Childhood Followup 2 Day 3
type: Class
type: Node shape
subclass of: Study Followup 2 Day 3
subclass of: Restriction
  some values from: HHEAR_00670
  on property: intervalDuring
subclass of: Restriction
  some values from: Childhood Followup 2 Day 2
  on property: intervalAfter
comment: The third day of the second study followup activity for a study that occurs during a subject's childhood period

hypertension
type: Class
type: Quality Value
subclass of: DOID_0050828
comment: This class denotes hypertension
notation: 178

diagnosis
type: Class
subclass of: time interval
comment: This class denotes diagnosis
note: making diagnosis a subclass of time interval.

From Birth
type: Class
subclass of: Relative Time
subclass of: Restriction
  on property: SIO_000668
definition: A time in relation to a birth

Annual Income $15,000 to $24,999
type: Class
type: Quality Value
subclass of: Annual Income $15,000 to $29,999
subclass of: Annual Income $24,999 or Less
subclass of:
  on property: maxValue
  has value: 24999
subclass of:
  on property: minValue
  has value: 15000
comment: This class denotes Annual Income $15,000 to $24,999
notation: 268

Mobile Home
type: Class
type: Quality Value
subclass of: Human Dwelling
comment: This class denotes Mobile Home
notation: 247

hormone
type: Class
subclass of: molecular messenger
subclass of: agonist
comment: This class denotes hormone

Percentile Rank Of 84%
type: Class
type: Quality Value
type: Node shape
subclass of: Percentile Rank Greater Than 75%
comment: A percentile rank value of 84%
notation: 1042

Parvovirus Infection
type: Class
type: Quality Value
type: Node shape
subclass of: DOID 934
comment: This class denotes Parvovirus Infection
notation: 1091

Javanese
type: Class
type: Node shape
subclass of: Non-White Non-Hispanic
comment: This class denotes Javanese
notation: 830
note: Entity represents Javanese ethnicity. Defined in the context of a study in Suriname.

Fijian Archipelago
type: Quality Value
type: NamedIndividual
type: geographic region
comment: archipelago in the Pacific Ocean
notation: 1191
SIO_000313: Outside United States

From Conception
type: Class
subclass of: Relative Time
subclass of: Restriction
  on property: SIO_000668
definition: A time in relation to a conception

Rented Room
type: Class
type: Quality Value
type: Node shape
subclass of: Living Quarters
comment: A room within a larger dwelling used as an individual living space in exchange for money. (Source: NCI Thesaurus)
notation: 964

ingestion
type: Class
subclass of: biological quality
comment: This class denotes ingestion

Fetal Loss
type: Class
type: Node shape
subclass of: Pregnancy Complication
comment: stillbirth: Death of the fetus in utero after at least 22 weeks of gestation. The age at which fetal demise is legally classified as a miscarriage varies between countries with the US being 20 gestational weeks and the UK being 24 gestational weeks. The HPO chooses the average of these age ranges. late fetal death: Death of a fetus at 16 weeks, 0 days to 19 weeks, 6 days of gestation. early fetal death: Death of a fetus at 10 weeks, 0 days to 15 weeks, 6 days of gestation. [https://www.ebi.ac.uk/ols4/search?q=fetal+death ]
union of: HP_0003826

Maroon
type: Class
type: Quality Value
type: Node shape
subclass of: Black Non-Hispanic
comment: This class denotes Maroon
notation: 931
note: The entity represents the Maroon ethnicity. This was defined in the context of a study in Suriname.

Number of Hospital Admissions
type: Class
subclass of: SIO_000794
subclass of: HHEAR_00188
subclass of: Restriction
  some values from: Hospital Admission By Duration
  on property: SIO_000215
definition: The number of episodes when a patient is admitted to a hospital; typically measured within a specified time interval.

Entity
type: Class
subclass of: Science Indicator
comment: Every thing is an entity. (Source: SIO Ontology)

Missouri, United States of America
type: geographic region
comment: The state, province, or territory of Missouri, United States of America
SIO_000313: Q186545

Saint Kitts and Nevis
type: geographic region
comment: The country of Saint Kitts and Nevis
SIO_000313: Outside United States

Birth Weight
type: Class
type: Quantity Variable
subclass of: Clinical Measurement
comment: This class denotes Birth Weight

Annual Income $35,000 to $44,999
type: Class
type: Quality Value
subclass of: Annual Income $35,000 to $49,999
subclass of:
  on property: minValue
  has value: 35000
subclass of:
  on property: SIO_000900
  has value: year
subclass of:
  on property: currency
  has value: USD
subclass of:
  on property: maxValue
  has value: 44999
comment: This class denotes Annual Income $35,000 to $44,999
notation: 266

Percentile Rank Of 50%
type: Class
type: Quality Value
type: Node shape
subclass of: Percentile Rank Between 26% and 50%
comment: A percentile rank value of 50%
notation: 1040

chlorfenapyr
type: Class
type: Node shape
subclass of: Targeted Analyte
subclass of: CHEBI_68452
comment: A member of the class of pyrroles that is 4-bromo-1H-pyrrole-3-carbonitrile which is substituted at positions 1, 2 and 5 by ethoxymethyl, p-chlorophenyl and trifluoromethyl groups, respectively. A proinsecticide used for termite control and crop protection against several insects and mite pests. (Source: ChEBI Ontology)
notation: CHLFEN

Doctoral Degree
type: Class
type: Node shape
subclass of: HHEAR_00043
comment: Examples include Ph.D. or Ed.D. .
notation: 912

Fourth Child
type: Class
type: Node shape
subclass of: Child
subclass of: Fourth
comment: The fourth live born child

Hindustani
type: Class
type: Node shape
subclass of: Non-White Non-Hispanic
comment: This class denotes Hindustani
notation: 828
note: Entity to represent Hindustani ethnicity in the context of a study based in Suriname

Periportal fibrosis
type: Class
type: Quality Value
type: Node shape
subclass of: Hepatic fibrosis
comment: Liver fibrosis is not only the result of necrosis, collapse and scar formation but also the result of derangements in the synthesis and degradation of matrix by injured mesenchymal cells. The presence of fibrosis affecting the interlobular stroma of liver. (Source: Human Phenotype Ontology)
notation: 754

Annual Income $25,000 to $34,999
type: Class
type: Quality Value
subclass of: Annual Income $20,001 to $40,000
subclass of: Annual Income $25,000 to $49,999
subclass of: Annual Income $25,000 to $50,000
subclass of: HHEAR_02319
subclass of:
  on property: maxValue
  has value: 34999
subclass of:
  on property: SIO_000900
  has value: year
subclass of:
  on property: minValue
  has value: 25000
comment: This class denotes Annual Income $25,000 to $34,999
notation: 267

Experimental Group
type: Class
type: Quality Value
subclass of: Population Group
notation: 201
definition: A study population that receives the intervention that is the focus of the study.

Beginning
type: Class
subclass of: Relative Time
subclass of: Restriction
  on property: SIO_000300
  has value: 1
definition: A time relative to the beginning of an event

Cytomegalovirus retinitis
type: Class
type: Quality Value
subclass of: Disease
comment: This class denotes Cytomegalovirus retinitis
notation: 1102

Percentile Rank Of 75%
type: Class
type: Quality Value
type: Node shape
subclass of: Percentile Rank Between 51% and 75%
comment: A percentile rank value of 75%
notation: 1041

Fifth Child
type: Class
type: Node shape
subclass of: Fifth
subclass of: Child
comment: The fifth live born child

General Educational Development Test (GED)
type: Class
type: Node shape
subclass of: High School or Some College
comment: https://ged.com/blog/what-is-a-ged ] After graduating from high school, you will receive a diploma. A diploma is a document stating you’ve completed all the required courses to graduate. Some students in high school are close to finishing and getting a diploma, but don’t quite get there. In those cases, students can take a series of tests that will indicate whether or not they have a high school level of education. This is known as the GED test.
notation: 914

Indigenous
type: Class
type: Node shape
subclass of: Non-Hispanic Ethnicity
comment: This class denotes Indigenous
notation: 829
note: Entity represents the ethnicity of the indigenous people of Suriname. This was defined in the context of a study in Suriname.
scope note: Indigineous to Suriname

room
type: Class
subclass of: building part
comment: This class denotes room

Alta, Far Northern, and Redwood Coast
type: Class
type: Quality Value
subclass of: Population Group
comment: This class denotes Alta, Far Northern, and Redwood Coast
notation: 336

anthracene
type: Class
type: Node shape
subclass of: Targeted Analyte
comment: An ortho-fused tricyclic hydrocarbon comprising three fused benzene rings.
notation: ANTH

Mother
type: Class
type: Quality Value
type: Facet
subclass of: Parent
subclass of: Study Population
subclass of: Restriction
  on property: SIO_000227
  all values from: Restriction
    some values from: SIO_010052
    on property: SIO_000008
notation: 189
definition: A mother is the female parent of a child. Mothers are women who inhabit or perform the role of bearing some relation to their children, who may or may not be their biological offspring. Thus, dependent on the context, women can be considered mothers by virtue of having given birth, by raising their child(ren), supplying their ovum for fertilisation, or some combination thereof. Such conditions provide a way of delineating the concept of motherhood, or the state of being a mother. Women who meet the third and first categories usually fall under the terms 'birth mother' or 'biological mother', regardless of whether the individual in question goes on to parent their child. Accordingly, a woman who meets only the second condition may be considered an adoptive mother, and those who meet only the third a surrogacy mother. The above concepts defining the role of mother are neither exhaustive nor universal, as any definition of 'mother' may differ based on how social, cultural, and religious roles are defined.
was approved by: PER-Jeanette-Stingone

Percentile Rank Of 25%
type: Class
type: Quality Value
type: Node shape
subclass of: Percentile Rank Between 11% and 25%
comment: A percentile rank value of 25%
notation: 1038

Annual Income $55,000 to $64,999
type: Class
type: Quality Value
subclass of: HHEAR_00542
subclass of: Annual Income $50,000 to $74,999
subclass of: HHEAR_01115
subclass of:
  on property: currency
  has value: USD
subclass of:
  on property: SIO_000900
  has value: year
subclass of:
  on property: maxValue
  has value: 64999
comment: This class denotes Annual Income $55,000 to $64,999
notation: 264

Reactive Hyperemia Percent Change
type: Class
type: Node shape
subclass of: Measurement
subclass of: Restriction
  some values from: SYMP_0000841
  on property: SIO_000215
comment: Reactive Hyperemia Percent Change is a measurement of the severity of reactive hyperemia obtained by noting the percentage increase in blood flow to a tissue or organ after a period of temporary blood flow restriction.

Medical Device
type: Class
type: Node shape
subclass of: PhysicalInstrument
comment: Any physical object that is useful for prevention, diagnosis, monitoring, or treatment of disease or other conditions. [Definition Source: NCI]

Recruited In Puerto Rico-Northern Karst
type: Class
type: Quality Value
type: Node shape
subclass of: Population Group by Recruitment Location
comment: A population group of study participants that were recruited in Puerto Rico-Northern Karst
notation: 911

Second Child
type: Class
type: Node shape
subclass of: Child
subclass of: Second
comment: The second live born child

Chinese
type: Class
type: Node shape
subclass of: Asian Non-Hispanic
comment: This class denotes Chinese
notation: 826
note: This indicates the Chinese ethnicity and was included in the ontology in the context of a study in Suriname

North Bay
type: Class
type: Quality Value
subclass of: Population Group
comment: This class denotes North Bay
notation: 337

Annual Income $45,000 to $54,999
type: Class
type: Quality Value
subclass of: HHEAR_01115
subclass of: Annual Income $40,000 to $60,000
subclass of:
  on property: SIO_000900
  has value: year
subclass of:
  on property: currency
  has value: USD
subclass of:
  on property: minValue
  has value: 45000
comment: This class denotes Annual Income $45,000 to $54,999
notation: 265

Son
type: Class
subclass of: Child
subclass of: Restriction
  on property: isRoleOf
  all values from: Restriction
    some values from: SIO_010048
    on property: SIO_000008
definition: A son is a male offspring; a boy or man in relation to his parents.

Percentile Rank Of 37%
type: Class
type: Quality Value
type: Node shape
subclass of: Percentile Rank Between 26% and 50%
comment: A percentile rank value of 37%
notation: 1039

Forced Vital Capacity (pre-bronchodilator administration)
type: Class
type: Node shape
subclass of: forced vital capacity (FVC)
comment: This class denotes Forced Vital Capacity (pre-bronchodilator administration)

Saint Lucia
type: geographic region
comment: The country of Saint Lucia
SIO_000313: Outside United States

Third Child
type: Class
type: Node shape
subclass of: Child
subclass of: NCIT C25260
comment: The third live born child

Professional School Degree
type: Class
type: Node shape
subclass of: HHEAR_00043
comment: Examples include MD, DDS, DVM, JD
notation: 913

Creole
type: Class
type: Node shape
subclass of: Non-White Non-Hispanic
comment: This class denotes Creole
notation: 827
note: Entity to represent Creole ethnicity in the context of a study based in Suriname

material entity
type: Class
subclass of: SIO_000776
comment: This class denotes material entity

4, 4'-DDE
type: Class
type: Facet Value
subclass of: HHEAR_01375
comment: This class denotes 4, 4'-DDE
notation: PPDDE

Study Followup 2 Day 1
type: Class
type: Node shape
subclass of: Study Activity
subclass of: Restriction
  some values from: Study Followup 2
  on property: intervalDuring
comment: The first day of the second study followup activity for a study

hexadecanoic acid
type: Class
type: Facet Value
subclass of: Fatty Acid
notation: C160
definition: A straight-chain, sixteen-carbon, saturated long-chain fatty acid.

United Kingdom
type: geographic region
comment: The country of United Kingdom
SIO_000313: Outside United States

deciliter
type: unit of measurement
notation: dl

Gas Chromatographer–Mass Spectrometer
type: Class
subclass of: Gas Chromatography Instrument
subclass of: Mass Spectrometer
definition: Gas chromatography–mass spectrometry (GC-MS) is an analytical method that combines the features of gas-chromatography and mass spectrometry to identify different substances within a test sample. Applications of GC-MS include drug detection, fire investigation, environmental analysis, explosives investigation, and identification of unknown samples, including that of material samples obtained from planet Mars during probe missions as early as the 1970s. GC-MS can also be used in airport security to detect substances in luggage or on human beings. Additionally, it can identify trace elements in materials that were previously thought to have disintegrated beyond identification. Like liquid chromatography–mass spectrometry, it allows analysis and detection even of tiny amounts of a substance.
was approved by: PER-Jim-McCusker

Small clot present
type: Class
subclass of: comment
comment: This class denotes Small clot present

Mallory Body Assessment
type: Class
type: Quality Variable
type: Node shape
subclass of: Histopathologic Examination
comment: An evaluation of the presence or degree of mallory bodies in a sample.

blood eosinophil count to total leukocyte count ratio
type: Class
type: Quantity Variable
subclass of: Physical And Mental Assessment
comment: This class denotes blood eosinophil count to total leukocyte count ratio

Consumed beverages containing probiotics 1 or 2 days per week
type: Class
type: Quality Value
type: Node shape
subclass of: Probiotic Beverage Consumption Frequency
subclass of: Restriction
  on property: SIO_000216
subclass of: Restriction
  some values from: Class
    intersection of: SIO_001114
  on property: SIO_000216
subclass of: Restriction
  on property: SIO_000221
  has value: days per week
comment: This class denotes Consumed beverages containing probiotics 1 or 2 days per week
notation: 650

Haptoglobin
type: Class
type: Facet Value
subclass of: Protein
subclass of: HHEAR_01389
comment: This class denotes Haptoglobin
notation: HAPTOGLOBIN

Consumed beverages containing probiotics 3 or 4 days per week
type: Class
type: Quality Value
type: Node shape
subclass of: Probiotic Beverage Consumption Frequency
subclass of: Restriction
  on property: SIO_000221
  has value: days per week
subclass of: Restriction
  on property: SIO_000216
subclass of: Restriction
  on property: SIO_000216
comment: This class denotes Consumed beverages containing probiotics 3 or 4 days per week
notation: 651

Childhood Followup 2 Day 1
type: Class
type: Node shape
subclass of: Study Followup 2 Day 1
subclass of: Restriction
  some values from: HHEAR_00670
  on property: intervalDuring
comment: The first day of the second study followup activity for a study that occurs during a subject's childhood period

Sample Indicator
type: Class
subclass of: Thing
comment: This class denotes Sample Indicator

Living Room
type: Class
type: Node shape
subclass of: room
subclass of: Room
subclass of: Living Room or Child's Bedroom
subclass of: Living Room or Child's Bedroom or Kitchen
comment: This class denotes Living Room

gram per deciliter
type: unit of measurement
notation: g/dl

Allergy
type: Class
type: Quality Value
subclass of: phenotype
comment: This class denotes Allergy
notation: 279

HPLC with Fluorescence Level Detector
type: Class
subclass of: High-Performance Liquid Chromatography
definition: HPLC paired with a Fluorescence Level Detector. Fluorescence spectroscopy (also known as fluorometry or spectrofluorometry) is a type of electromagnetic spectroscopy that analyzes fluorescence from a sample. It involves using a beam of light, usually ultraviolet light, that excites the electrons in molecules of certain compounds and causes them to emit light; typically, but not necessarily, visible light. A complementary technique is absorption spectroscopy. In the special case of single molecule fluorescence spectroscopy, intensity fluctuations from the emitted light are measured from either single fluorophores, or pairs of fluorophores.

Slightly hemolyzed
type: Class
subclass of: comment
comment: This class denotes Slightly hemolyzed

on property: minValue
has value: 40000

rest:
  rest: nil
  first: Restriction
    on property: SIO_000300
    has value: 1
first: SIO_001113

Recruited At Northwestern University
type: Class
type: Quality Value
type: Node shape
subclass of: Population Group by Recruitment Location
comment: A population group of study participants that were recruited at Northwestern University
notation: 573

plastic container
type: Class
type: Node shape
subclass of: container
comment: Corresponds to FSTA Thesaurus Packaging 2.2.1 Plastic container.

Fast Food Consumption Frequency
type: Class
type: Quantity Variable
subclass of: Diet Quantity
subclass of: SIO_001367
subclass of: Restriction
  some values from: Eats Fast Food
  on property: SIO_000215
definition: Frequency of Fast Food Consumption.
was approved by: PER-Jeanette-Stingone

Specimen analyzed in singlicate for an assay that requires duplicates
type: Class
subclass of: comment
comment: This class denotes Specimen analyzed in singlicate for an assay that requires duplicates

Estimated Body Fat Percentage
type: Class
type: Quantity Variable
type: Node shape
subclass of: percentage
subclass of: Imputed Measurement
subclass of: Restriction
  some values from: CMO_0000302
  on property: SIO_000283
comment: An estimated measure of body fat percentage

Study Followup Day 4
type: Class
type: Node shape
subclass of: Study Activity
subclass of: Restriction
  some values from: Study Followup Day 3
  on property: intervalAfter
comment: The fourth day of a study followup activity

indoor kitchen
type: Class
type: Node shape
subclass of: building part
subclass of: Kitchen
comment: This class denotes indoor kitchen

France
type: geographic region
comment: The country of France
SIO_000313: Outside United States

Fresh Vegetable Consumption Frequency
type: Class
type: Quantity Variable
subclass of: Diet Quantity
subclass of: SIO_001367
subclass of: Restriction
  some values from: Eats Fresh Vegetables
  on property: SIO_000215
definition: Frequency of Fresh Vegetable Consumption.
was approved by: PER-Jeanette-Stingone

Socioeconomic Status
type: Class
type: Facet Category
subclass of: Study Indicator
definition: Socioeconomic Status Indicator Class
was approved by: PER-Jeanette-Stingone

English Language
type: Class
type: Quality Value
subclass of: Acculturation
notation: 243
definition: The English Language

Age at Formula Introduction
type: Class
type: Quantity Variable
type: Node shape
subclass of: age
subclass of: HHEAR_00053
comment: The age at which an infant is first given artificial formula instead of breast milk

Childhood Followup Day 4
type: Class
type: Node shape
subclass of: Study Followup Day 4
subclass of: Restriction
  some values from: Childhood Followup Day 3
  on property: intervalAfter
comment: The fourth day of a study followup activity that occurs during a subject's childhood period

South Carolina, United States of America
type: geographic region
comment: The state, province, or territory of South Carolina, United States of America
SIO_000313: Q1139046

Hepatocellular Ballooning Assessment
type: Class
type: Quality Variable
type: Node shape
subclass of: Histopathologic Examination
comment: An evaluation of the presence or degree of hepatocellular ballooning in a sample. (Source: NCI Thesaurus)

Element
type: Class
subclass of: Targeted Analyte
comment: This class denotes Element

Jalisco, Mexico
type: geographic region
comment: The state, province, or territory of Jalisco, Mexico
SIO_000313: Q96

building part
type: Class
type: Node shape
subclass of: ENVO_00000073
comment: This class denotes building part

Study Followup Day 3
type: Class
type: Node shape
subclass of: Study Activity
subclass of: Restriction
  some values from: HHEAR_00554
  on property: intervalDuring
subclass of: Restriction
  some values from: Study Followup Day 2
  on property: intervalAfter
comment: The third day of a study followup activity

on property: minValue
has value: 90001

People's Republic of China
type: geographic region
comment: The country of People's Republic of China
SIO_000313: Outside United States

Portal Inflammation Assessment
type: Class
type: Quality Variable
type: Node shape
subclass of: Histopathologic Examination
comment: An evaluation of the presence or degree of portal inflammation in a sample.

on property: minValue
has value: 65000

Ever Smoked
type: Class
type: Quality Value
subclass of: Smoking Status
notation: 136
definition: The quality of having smoking in the past.
was approved by: PER-Jeanette-Stingone

72 kDa type IV collagenase
type: Class
type: Facet Value
subclass of: Protein
subclass of: HHEAR_01389
comment: This class denotes 72 kDa type IV collagenase
notation: MMP2

Childhood Followup Day 3
type: Class
type: Node shape
subclass of: Study Followup Day 3
subclass of: Restriction
  some values from: Childhood Followup Day 2
  on property: intervalAfter
comment: The third day of a study followup activity that occurs during a subject's childhood period

Microunit per Milliliter
type: Class
type: Node shape
subclass of: unit per volume unit
comment: An arbitrary unit of substance concentration equal to the concentration at which one milliliter of mixture contains one millionth of a unit of a substance. (Source: NCI Thesaurus)

pancreatic cancer
type: Class
type: Quality Value
subclass of: endocrine gland cancer
subclass of: pancreas disease
comment: This class denotes pancreatic cancer
notation: 1146

North Carolina, United States of America
type: geographic region
comment: The state, province, or territory of North Carolina, United States of America
SIO_000313: Q1139046

Tabasco, Mexico
type: geographic region
comment: The state, province, or territory of Tabasco, Mexico
SIO_000313: Q96

Sleep Characterisitic
type: Class
subclass of: Study Indicator
definition: Sleep Characterisitics Indicator Class
was approved by: PER-Jeanette-Stingone

Ladino
type: Class
type: Node shape
subclass of: Mixed Ethnicity
comment: ladino, Westernized Central American person of predominantly mixed Spanish and indigenous descent. In that sense, ladino is synonymous with mestizo. The word ladino is Spanish (meaning “Latin”), and the ladinos of Central America are not to be confused with those Sephardic Jews who speak the Ladino language. [ https://www.britannica.com/topic/Ladino ]
notation: 906

DVD Player Count
type: Class
type: Quantity Variable
subclass of: Household Appliance Count
definition: Number of devices in the home that play DVDs.
was approved by: PER-Jeanette-Stingone

serum total cholesterol level
type: Class
subclass of: blood total cholesterol level
subclass of: serum cholesterol level
comment: Measurement of the entire amount of cholesterol, a eukaryotic sterol that in higher animals is the precursor of bile acids and steroid hormones and a key constituent of cell membranes, without taking into account any association with other molecules such as lipoproteins, in a specified volume of serum, the clear liquid that separates from blood after it has clotted completely, i.e. blood plasma from which fibrinogen has been removed. (Source: Clinical Measurements Ontology)

Ozone
type: Class
subclass of: Air Pollutant
comment: This class denotes Ozone

Louisiana, United States of America
type: geographic region
comment: The state, province, or territory of Louisiana, United States of America
SIO_000313: Southwestern United States

Short sample; sample probe picked up incomplete volume first time
type: Class
subclass of: comment
comment: This class denotes Short sample; sample probe picked up incomplete volume first time

max exclusive: 6.767

Diet Treatment Medical Therapy
type: Class
type: Quality Value
subclass of: Medical Therapy Procedure
notation: 26
definition: Diet Treatment is a form of Medical Therapy.
was approved by: PER-Jeanette-Stingone

Test
type: Class
subclass of: AnalyticalMethod
comment: This class denotes Test

Triphenyl phosphate
type: Class
type: Node shape
type: Facet Value
subclass of: HHEAR_01372
comment: This class denotes Triphenyl phosphate
notation: TPHP

Childhood Followup Day 2
type: Class
type: Node shape
subclass of: Study Followup Day 2
subclass of: Restriction
  some values from: HHEAR_00553
  on property: intervalDuring
subclass of: Restriction
  some values from: Childhood Followup Day 1
  on property: intervalAfter
comment: The second day of a study followup activity that occurs during a subject's childhood period

Pesticide
type: Class
type: Node shape
subclass of: chemical substance
comment: Strictly, a substance intended to kill pests. In common usage, any substance used for controlling, preventing, or destroying animal, microbiological or plant pests. (Source: ChEBI Ontology)

Childhood Followup 4
type: Class
subclass of: Study Followup 4
subclass of: Restriction
  on property: SIO_000668
  all values from: Childhood Period
definition: A point in a study that occurs after the third follow-up point in the study and occurs during the study subject's childhood period.

cell concentration unit
type: Class
subclass of: Thing
comment: "A concentration unit which denotes the average cell number in a given volume." [Bioedonline:Bioedonline]

Diabetic Ketoacidosis
type: Class
type: Quality Value
subclass of: phenotype
comment: This class denotes Diabetic Ketoacidosis
notation: 391

Study Emergency Department
type: Class
type: Node shape
subclass of: Emergency Medical Services Facility
subclass of: Study Location
comment: An emergency department in a hospital at which a study is being conducted

monooxoisononyl phthalate (DiNP)
type: Class
type: Facet Value
subclass of: Phthalate
comment: This class denotes monooxoisononyl phthalate (DiNP)
notation: MONP

rest:
  rest: nil
  first: Restriction
    on property: SIO_000300
    has value: 25.0
first: SIO_001114

Entity
type: Class
subclass of: Entity
comment: An entity is a physical, digital, conceptual, or other kind of thing with some fixed aspects; entities may be real or imaginary. (Source: Provenance Ontology)

Childhood Followup 5
type: Class
subclass of: Study Followup 5
definition: A point in a study that occurs after the fourth follow-up point in the study and occurs during the study subject's childhood period.

Annual Income $4,999 or Less
type: Class
type: Quality Value
type: Node shape
subclass of: HHEAR_00538
subclass of:
  on property: maxValue
  has value: 4999
subclass of:
  on property: minValue
  has value: 0
subclass of:
  on property: SIO_000900
  has value: year
subclass of:
  on property: currency
  has value: USD
comment: This class denotes Annual Income $4,999 or Less
notation: 414

severe pre-eclampsia
type: Class
subclass of: Eclampsia or Severe Pre-eclampsia
comment: This class denotes severe pre-eclampsia

terabyte
type: unit of measurement
notation: TB

Vineland adaptive behavior scales-fine motor
type: Class
subclass of: Vineland Motor Skills Domain
comment: This class denotes Vineland adaptive behavior scales-fine motor

mono-2-ethyl-5-hydroxyhexyl terephthalate (DEHTP)
type: Class
type: Facet Value
subclass of: Phthalate
comment: This class denotes mono-2-ethyl-5-hydroxyhexyl terephthalate (DEHTP)
notation: MEHHTP

collective
type: Class
subclass of: Thing
comment: This class denotes collective

Other Unrelated Female
type: Class
type: Quality Value
type: Node shape
subclass of: SIO_000016
subclass of: Restriction
  on property: SIO_000227
comment: A female that has a role as a caregiver for a subject but is not related to the subject.
notation: 664

Intensity Composite Score
type: Class
type: Quantity Variable
type: Node shape
subclass of: Composite Score
comment: A score that is the composite, summation, or aggregation of multiple measurements of intensity

Yucatán, Mexico
type: geographic region
comment: The state, province, or territory of Yucatán, Mexico
SIO_000313: Q96

muscle relaxant
type: Class
subclass of: CHEBI_23888
comment: This class denotes muscle relaxant

mammary gland fluid/secretion
type: Class
subclass of: Thing
comment: This class denotes mammary gland fluid/secretion

urinary tract infection
type: Class
subclass of: biological quality
comment: This class denotes urinary tract infection

Neptunium
type: Class
subclass of: Metal
notation: Np
definition: Neptunium. A radioactive element of the actinide metals family. NEPTUNIUM has the atomic symbol Np, atomic number 93, and atomic weight 237.

Operating Room
type: Class
type: Quality Value
subclass of: Destination
notation: 171
definition: A room in a health care facility equipped for the performance of surgical operations and procedures.

Childhood Followup 3
type: Class
subclass of: Study Followup 3
subclass of: Restriction
  some values from: Childhood Period
  on property: intervalDuring
subclass of: Restriction
  on property: SIO_000668
  all values from: Class
definition: A point in a study that occurs after the second follow-up point in the study and occurs during the study subject's childhood period.

Other Unrelated Male
type: Class
type: Quality Value
type: Node shape
subclass of: SIO_000016
comment: A male that has a role as a caregiver for a subject but is not related to the subject.
notation: 665

sequence_feature
type: Class
subclass of: SIO_000030
comment: This class denotes sequence_feature

antibody
type: Class
subclass of: Thing
comment: This class denotes antibody

cells per milliliter
type: unit of measurement
notation: cells per ml

Developmental Neuropsychological Assessment
type: Class
type: Node shape
subclass of: Research or Clinical Assessment Tool
comment: A series of neurocognitive tests for children from 3 to 16 years of age. NEPSY can be used for general, diagnostic, selective, or full assessment of neuropsychological development. (Copyright: Pearson Education, Inc; Marit Korkman, Ph.D., Ursula Kirk, Ph.D., and Sally Kemp, Ph.D., authors) (Source: NCI Thesaurus)

Dietary Lipid
type: Class
type: Node shape
subclass of: HHEAR_00053
comment: A class of food constituents, also known as fats and oils, that serve as a source of energy and essential fatty acids in animals. The major components of lipids are fatty acids, triglycerides, phospholipids, glycolipids, sphingolipids, steroids (cholesterol), and lipoproteins. [ NCI ]

Hospital Admission From Study Emergency Department
type: Class
type: Quality Value
type: Node shape
subclass of: Hospital Admission By Admission Source
comment: An admission from an emergency department into a hospital where a clinical study is being conducted, and the subject admitted is participating in the study.
notation: 435
disjoint with: Hospital Admission Not From Study Emergency Department

Plutonium
type: Class
subclass of: Metal
notation: Pu
definition: Plutonium. A naturally radioactive element of the actinide metals series. It has the atomic symbol Pu, atomic number 94, and atomic weight 242. Plutonium is used as a nuclear fuel, to produce radioisotopes for research, in radionuclide batteries for pacemakers, and as the agent of fission in nuclear weapons.

parasites per microgram
type: unit of measurement
notation: parasites/µL

Other Female Relative
type: Class
type: Quality Value
type: Node shape
subclass of: Relative
subclass of: Restriction
  on property: SIO_000227
comment: A female relative that is not a mother, aunt, cousin, or grandmother.
notation: 662

Recruited At University Of Utah
type: Class
type: Quality Value
type: Node shape
subclass of: Population Group by Recruitment Location
subclass of: Restriction
  on property: SIO_000668
  has value: Q168515
comment: A population group of study participants that were recruited at University of Utah
notation: 597

Study Followup 2 Day 3
type: Class
type: Node shape
subclass of: Study Activity
subclass of: Restriction
  some values from: Study Followup 2 Day 2
  on property: intervalAfter
subclass of: Restriction
  some values from: Study Followup 2
  on property: intervalDuring
comment: The third day of the second study followup activity for a study

syphilis
type: Class
type: Quality Value
subclass of: DOID_0050338
comment: This class denotes syphilis
notation: 1068

Vineland adaptive behavior scales-interpersonal relationships
type: Class
subclass of: Vineland Socialization Domain
comment: This class denotes Vineland adaptive behavior scales-interpersonal relationships

millimole per liter
type: unit of measurement
notation: mmol/L

Specimen analyzed with less than usual dilution
type: Class
subclass of: comment
comment: This class denotes Specimen analyzed with less than usual dilution

Polychlorobiphenyl
type: Class
type: Facet
subclass of: Targeted Analyte
comment: This class denotes Polychlorobiphenyl
notation: SPCB

Frequency Composite Score
type: Class
type: Quantity Variable
type: Node shape
subclass of: Composite Score
comment: A score that is the composite, summation, or aggregation of multiple frequency measurements

Other Male Relative
type: Class
type: Quality Value
type: Node shape
subclass of: Relative
subclass of: Restriction
  on property: SIO_000227
comment: A male relative that is not a father, uncle, cousin, or grandfather.
notation: 663

katal per liter
type: unit of measurement
notation: kat/l

milligram per gram
type: unit of measurement
notation: mg/g

Specimen analyzed with less than normal quantity
type: Class
subclass of: comment
comment: This class denotes Specimen analyzed with less than normal quantity

katal per cubic meter
type: unit of measurement
notation: kat/m3

Consumed beverages containing probiotics 5 or 6 days per week
type: Class
type: Quality Value
type: Node shape
subclass of: Probiotic Beverage Consumption Frequency
subclass of: Restriction
  some values from: Class
  on property: SIO_000216
subclass of: Restriction
  some values from: Class
    intersection of: SIO_001113
  on property: SIO_000216
subclass of: Restriction
  on property: SIO_000221
  has value: days per week
comment: This class denotes Consumed beverages containing probiotics 5 or 6 days per week
notation: 652

Recruited At University Of California, Irvine
type: Class
type: Quality Value
type: Node shape
subclass of: Population Group by Recruitment Location
subclass of: Restriction
  on property: SIO_000668
  has value: Q868421
comment: A population group of study participants that were recruited at University of California, Irvine
notation: 697

Study Followup 2 Day 2
type: Class
type: Node shape
subclass of: Study Activity
subclass of: Restriction
  some values from: Study Followup 2
  on property: intervalDuring
subclass of: Restriction
  some values from: Study Followup 2 Day 1
  on property: intervalAfter
comment: The second day of the second study followup activity for a study

Measurement
type: Class
type: Quality Variable
subclass of: Physical And Mental Assessment
comment: This class denotes Measurement

Vineland adaptive behavior scales-coping skills
type: Class
subclass of: Vineland Socialization Domain
comment: This class denotes Vineland adaptive behavior scales-coping skills

Health Maintenance Organization Insurance
type: Class
type: Quality Value
subclass of: Insurance
comment: This class denotes Health Maintenance Organization Insurance
notation: 49

milliliter per liter
type: unit of measurement
notation: ml/l

mono-2-ethyl-5- carboxypentyl terephthalate (DEHTP)
type: Class
type: Facet Value
subclass of: Phthalate
comment: This class denotes mono-2-ethyl-5- carboxypentyl terephthalate (DEHTP)
notation: MECPTP

Vineland adaptive behavior scales-gross motor
type: Class
subclass of: Vineland Motor Skills Domain
comment: This class denotes Vineland adaptive behavior scales-gross motor

Surface-Induced Dissociation (SID)
type: Class
subclass of: Tandem Mass Spectrometry
comment: This class denotes Surface-Induced Dissociation (SID)

Body Mass Index
type: Class
type: Quantity Variable
subclass of: SIO_000052
subclass of: Physical And Mental Assessment
subclass of: Anthropometry
subclass of: Class
definition: A measurement relating body weight to height in an organism; typically calculated as the weight of an individual divided by the height of that individual squared. For quadrupeds, the square of body height is often replaced by the square of body length
was approved by: PER-Jeanette-Stingone
editorial note: Should we note that this is derived from height and weight? JS: I think so

Recruited At University Of Pennsylvania
type: Class
type: Quality Value
type: Node shape
subclass of: Population Group by Recruitment Location
subclass of: Restriction
  on property: SIO_000668
  has value: Q49117
comment: A population group of study participants that were recruited at University of Pennsylvania
notation: 698

on property: minValue
has value: 10000

Consumed beverages containing probiotics all days of the week
type: Class
type: Quality Value
type: Node shape
subclass of: Probiotic Beverage Consumption Frequency
subclass of: Restriction
  some values from: Class
    intersection of: SIO_001113
  on property: SIO_000216
subclass of: Restriction
  some values from: Class
    intersection of: SIO_001114
    intersection of: Restriction
      on property: SIO_000300
      has value: 7
  on property: SIO_000216
subclass of: Restriction
  on property: SIO_000221
  has value: days per week
comment: This class denotes Consumed beverages containing probiotics all days of the week
notation: 653

Childhood Followup 2 Day 2
type: Class
type: Node shape
subclass of: Study Followup 2 Day 2
subclass of: Restriction
  some values from: HHEAR_00670
  on property: intervalDuring
subclass of: Restriction
  some values from: Childhood Followup 2 Day 1
  on property: intervalAfter
comment: The second day of the second study followup activity for a study that occurs during a subject's childhood period

Vineland adaptive behavior scales-play and leisure time
type: Class
subclass of: Vineland Socialization Domain
comment: This class denotes Vineland adaptive behavior scales-play and leisure time

Nornicotine
type: Class
type: Facet Value
subclass of: Tobacco Metabolite
comment: This class denotes Nornicotine
notation: NORN

milliliter per cubic meter
type: unit of measurement
notation: ml/m3

cognitive domain measurement
type: Class
type: Node shape
subclass of: Measurement
comment: A measurement of some aspect of cognitive systems e.g. those responsible for various cognitive processes. Based on the NIH NIMH's research domain criteria (RDoC). https://www.nimh.nih.gov/research-priorities/rdoc/definitions-of-the-rdoc-domains-and-constructs.shtml (Source: EFO Ontology)

million parts per microgram
type: unit of measurement
notation: x106 µL

Study Baseline
type: Class
subclass of: Study Activity
definition: Point in study set to initial point.

Guerrero, Mexico
type: geographic region
comment: The state, province, or territory of Guerrero, Mexico
SIO_000313: Q96

mean corpuscular hemoglobin concentration
type: Class
subclass of: concentration
comment: This class denotes mean corpuscular hemoglobin concentration

Duration of Steroid Treatment
type: Class
type: Quantity Variable
type: Node shape
subclass of: Prescription Medication and Dietary Supplements
subclass of: Duration of Medical Intervention
subclass of: Restriction
  some values from: Uses Steroid Treatment
  on property: SIO_000215
comment: The length of time a patient is receiving steroids as a medical treatment

1-hydroxyphenanthrene
type: Class
type: Facet Value
subclass of: polycyclic hydrocarbon
comment: This class denotes 1-hydroxyphenanthrene
notation: PHEN1

Tanner Scale For Breast Development (Assigned By Child's Mother)
type: Class
type: Quality Variable
type: Node shape
subclass of: Tanner Scale For Breast Development
comment: A rating of the Tanner Scale for Breast Development as assigned by the child's mother

skin disease
type: Class
subclass of: Thing
comment: This class denotes skin disease

Serbia
type: geographic region
comment: The country of Serbia
SIO_000313: Outside United States

Duration of Chest Tube Placement
type: Class
type: Quantity Variable
type: Node shape
subclass of: Duration of Medical Procedure
subclass of: Restriction
  some values from: Chest Tube Placement
  on property: SIO_000215
comment: The length of time a patient has a chest tube placed in their chest cavity as a medical procedure

Menarche At Age 11
type: Class
type: Quality Value
type: Node shape
subclass of: Age at Menarche
comment: Indicates that a subject's first menstruation occurred at age 11 years old.
notation: 1155

Functional Status Score
type: Class
subclass of: score
comment: Functional Status Score (FSS) includes six domains with a scale from 1-5 with one being normal and 5 being very severely dysfunctional. A change would represent a new morbidity for the patient after ICU admission.1 (normal) to 6 (severely dysfunctional). FSS Score Reference: Pollack, M et al. The functional status score (FSS): a new pediatric outcome measure. Pediatrics, 2009. 124(1):18-28.

biological reproduction
type: Class
subclass of: Thing
comment: This class denotes biological reproduction

Tanner Scale For Genital Development (Assigned By Child's Mother)
type: Class
type: Quality Variable
type: Node shape
subclass of: Tanner Scale For Genital Development
comment: A rating of the Tanner Scale for Genital Development as assigned by the child's mother

Triethyl phosphate
type: Class
type: Node shape
type: Facet Value
subclass of: HHEAR_01372
comment: Triethyl phosphate appears as a colorless, corrosive liquid. Combustible. Slowly dissolves in water and sinks in water. Severely irritates skin, eyes and mucous membranes. (Source: Pubchem)
notation: TEP

on property: maxValue
has value: 2083

on property: currency
has value: USD

India
type: Quality Value
type: NamedIndividual
type: geographic region
comment: country in South Asia
comment: The country of India
notation: 1186
SIO_000313: Outside United States

mono-n-butylphthalate (BzBP, DnBP)
type: Class
type: Facet Value
subclass of: Phthalate
comment: This class denotes mono-n-butylphthalate (BzBP, DnBP)
notation: MnBP

Does Not Receive Income Assistance
type: Class
type: Quality Value
type: Node shape
subclass of: Does Not Receive Public Assistance
comment: A class that indicates a person or household does not income housing assistance
notation: 711
disjoint with: Receives Income Assistance

Duration of Invasive Mechanical Ventilation
type: Class
type: Quantity Variable
type: Node shape
subclass of: Medical History
subclass of: Duration of Medical Intervention
subclass of: Restriction
  some values from: invasive mechanical ventilation
  on property: SIO_000215
comment: This class denotes Duration of Invasive Mechanical Ventilation

Class
intersection of: SIO_001114
intersection of: Restriction
  on property: SIO_000300
  has value: 30.0

newborn respiratory distress syndrome
type: Class
type: Quality Value
subclass of: respiratory failure
comment: A respiratory failure that is characterized by deficiency of the surfactant coating the inner surface of the lungs, by failure of the lungs to expand and contract properly during breathing with resulting collapse, and by the accumulation of a protein-containing film lining the alveoli and their ducts. (Source: Disease Ontology)
notation: 1176

Monocyclohexyl phthalate
type: Class
type: Facet Value
subclass of: Phthalate
comment: This class denotes Monocyclohexyl phthalate
notation: MCHP

Duration of Ventilator Free Respiration
type: Class
type: Quantity Variable
type: Node shape
subclass of: Medical History
subclass of: duration
subclass of: Restriction
  some values from: Ventilator Free Respiration
  on property: SIO_000215
comment: The length of time a patient is able to breathe without aid of mechanical ventilation.

mean corpuscular hemoglobin
type: Class
subclass of: Thing
comment: This class denotes mean corpuscular hemoglobin

fipronil
type: Class
type: Node shape
subclass of: Targeted Analyte
subclass of: diazole
comment: A racemate comprising equimolar amounts of (R)- and (S)-fipronil. (Source: ChEBI Ontology)
notation: FIPR

Tanner Breast Development Stage I
type: Class
type: Quality Value
type: Node shape
subclass of: Tanner Scale For Breast Development
comment: no glandular tissue: areola follows the skin contours of the chest (prepubertal) (typically age 10 and younger) Source: Adolescent health care : a practical guide. Neinstein, Lawrence S., Neinstein, Lawrence S. (5th ed.). Philadelphia: Lippincott Williams & Wilkins. 2008. ISBN 9780781792561. OCLC 148727849.
notation: 573

High-Performance Liquid Chromatography
type: Class
subclass of: HHEAR_00193
definition: High-performance liquid chromatography (HPLC; formerly referred to as high-pressure liquid chromatography), is a technique in analytical chemistry used to separate, identify, and quantify each component in a mixture. It relies on pumps to pass a pressurized liquid solvent containing the sample mixture through a column filled with a solid adsorbent material. Each component in the sample interacts slightly differently with the adsorbent material, causing different flow rates for the different components and leading to the separation of the components as they flow out the column.
was approved by: PER-Jim-McCusker

Does Not Receive Food Assistance
type: Class
type: Quality Value
type: Node shape
subclass of: Does Not Receive Public Assistance
comment: A class that indicates a person or household does not receive food assistance
notation: 709
disjoint with: Receives Food Assistance

2,2',3,4',5,5',6-Heptachlorobiphenyl
type: Class
type: Node shape
subclass of: Polychlorobiphenyl
comment: 2,2',3,4',5,5',6-Heptachlorobiphenyl is one of 209 polychlorinated biphenyls (PCBs). PCBs are a group of synthetic organic compounds with 1-10 chlorine atoms attached to biphenyl. They were manufactured as commercial mixtures but banned in the 1970's because they were found to bioaccumulate and cause harmful health effects. However, PCBs do not break down readily and are still found in the environment. (L4) (Source: Pubchem)
notation: PCB187

Interleukin-6
type: Class
type: Facet Value
subclass of: Protein
subclass of: HHEAR_01389
notation: IL6
definition: Cytokine with a wide variety of biological functions. It is a potent inducer of the acute phase response. Plays an essential role in the final differentiation of B-cells into Ig-secreting cells Involved in lymphocyte and monocyte differentiation. Acts on B-cells, T-cells, hepatocytes, hematopoietic progenitor cells and cells of the CNS. Required for the generation of T(H)17 cells. Also acts as a myokine. It is discharged into the bloodstream after muscle contraction and acts to increase the breakdown of fats and to improve insulin resistance. It induces myeloma and plasmacytoma growth and induces nerve cells differentiation.

chronic kidney disease
type: Class
subclass of: Comorbidity Disease
comment: This class denotes chronic kidney disease

Sputum
type: Class
subclass of: HHEAR_00177
definition: Matter ejected from the lungs, bronchi, and trachea, through the mouth. [database_cross_reference: Dorlands_Medical_Dictionary:MerckSource]

Does Not Receive Housing Assistance
type: Class
type: Quality Value
type: Node shape
subclass of: Does Not Receive Public Assistance
comment: A class that indicates a person or household does not receive housing assistance
notation: 710
disjoint with: Receives Housing Assistance

saliva
type: Class
type: Facet
subclass of: UBERON_0006314
definition: A fluid produced in the oral cavity by salivary glands, typically used in predigestion, but also in other functions. [database_cross_reference: http://en.wikipedia.org/wiki/Saliva][database_cross_reference: GO:0046541]

Australia
type: geographic region
comment: The country of Australia
SIO_000313: Outside United States

blood plasma
type: Class
type: Facet
subclass of: Blood Component
subclass of: UBERON_0006314
definition: The liquid component of blood, in which erythrocytes are suspended. [database_cross_reference: http://orcid.org/0000-0002-6601-2165]

Anxiety Scale
type: Class
type: Node shape
subclass of: Research or Clinical Assessment Tool
comment: A rating scale included in the Behavior Assessment System for Children that measures the tendency of the subject to be nervous, fearful, or worried about real or imagined problems. (Source: NCI Thesaurus)

Public Assistance Status
type: Class
type: Node shape
type: Facet
subclass of: Socioeconomic Status
subclass of: Activity
comment: A class that differentiates if someone receives some sort of public assistance or not

Did Not Bother Me Today
type: Class
type: Quality Value
type: Node shape
subclass of: never
subclass of: Asthma Induced Distress Response
comment: This class denotes Did Not Bother Me Today
notation: 772

San Luis Potosí, Mexico
type: geographic region
comment: The state, province, or territory of San Luis Potosí, Mexico
SIO_000313: Q96

Floor Covering By Type
type: Class
type: Quality Variable
subclass of: Floor Covering
definition: Type of material that makes up the floor.
was approved by: PER-Jeanette-Stingone

Water Well
type: Class
type: Node shape
subclass of: Water Source
comment: excavation or structure created in the ground to access groundwater (Source: wikidata.org)

Does Not Receive Public Assistance
type: Class
type: Node shape
subclass of: Public Assistance Status
comment: A class that indicates a person or household does not receive a form of public assistance
disjoint with: Receives Public Assistance

Bothered Me A Little Today
type: Class
type: Quality Value
type: Node shape
subclass of: some of the time
subclass of: Asthma Induced Distress Response
comment: This class denotes Bothered Me A Little Today
notation: 776

Gravida
type: Class
type: Quantity Variable
subclass of: SIO_000794
subclass of: Pregnancy Characteristic
definition: Pregnancy Count, regardless of whether pregnancy was carried to Term.
was approved by: PER-Jeanette-Stingone

on property: currency
has value: USD

Abnormality of the musculoskeletal system
type: Class
type: Quality Value
subclass of: phenotype
comment: This class denotes Abnormality of the musculoskeletal system
notation: 386

1, 2-Dichloroethane
type: Class
type: Facet Value
subclass of: Volatile Organic Compound
notation: DE12
definition: Ethylene Dichloride is a clear, colorless, oily, synthetic, flammable liquid chlorinated hydrocarbon with a pleasant chloroform-like smell that emits toxic fumes of hydrochloric acid when heated to decomposition. Ethylene dichloride is primarily used to produce vinyl chloride. Inhalation exposure to this substance induces respiratory distress, nausea and vomiting and affects the central nervous system, liver and kidneys. It is mutagenic in animals and is reasonably anticipated to be a human carcinogen. (NCI05)

Tanner Genital Development Stage II
type: Class
type: Quality Value
type: Node shape
subclass of: Tanner Scale For Genital Development
comment: testicular volume between 1.6 and 6 ml; skin on scrotum thins, reddens and enlarges; penis length unchanged (9–11) Source: Adolescent health care : a practical guide. Neinstein, Lawrence S., Neinstein, Lawrence S. (5th ed.). Philadelphia: Lippincott Williams & Wilkins. 2008. ISBN 9780781792561. OCLC 148727849.
notation: 581

DERP1 Dust Mite Allergen
type: Class
subclass of: Allergen
comment: This class denotes DERP1 Dust Mite Allergen

Functional Status Total Score
type: Class
subclass of: Physical And Mental Assessment
subclass of: Functional Status Score
comment: This class denotes Functional Status Total Score

Deceased After Birth
type: Class
type: Quality Value
type: Node shape
subclass of: Live Birth
comment: A live birth of a child that died recently after birth
notation: 1008

Blank Corrected Concentration
type: Class
type: Node shape
subclass of: concentration
comment: A concentration measurement of an analyte in an assay that has been blank corrected. According to the ASI Standards, "When a request comes through for a certified reference material that is “ultra-low”, i.e. below 1 ppm, there is a risk of going below the detection limit and limit of quantification of the instrument. A blank solvent is used to minimize this error. "Impurities of the blank are not counted (assumed to be 0 ppb or ppm) into the calculation of the check standard/standards. The analyte is added to the “solvent blank” when preparing the standards. When the analysis is conducted, a correction value must be used to subtract the effect of the blank on the standards. This reduces the impact of the limit of detection and limit of quantification of the instrument on the results of the calibration as well as ensures the linearity and accuracy of the calibration curve." (Source: https://info.asistandards.com/blog/what-is-blank-correction)

Drank Fewer Than 10 Drinks or Did Not Drink Alcohol
type: Class
type: Quality Value
type: Node shape
subclass of: Quantity of Alcohol Consumption
comment: This class denotes Drank Fewer Than 10 Drinks or Did Not Drink Alcohol
notation: 1162

endocrine gland cancer
type: Class
subclass of: Thing
comment: This class denotes endocrine gland cancer

kilogram per square meter
type: unit of measurement
notation: kg/m2

Three Months Prior to Followup 4
type: Class
type: Node shape
subclass of: duration
subclass of: Restriction
  some values from: Study Followup 4
  on property: intervalMeets
comment: This class denotes Three Months Prior to Followup 4

Strongly Disagree
type: Class
type: Node shape
subclass of: Disagree
comment: Intensely at odds. [Definition Source: NCI]

Washington, United States of America
type: geographic region
comment: The state, province, or territory of Washington, United States of America
SIO_000313: Western United States

Functional Status Total Score 3 or Above
type: Class
type: Quality Value
subclass of: Functional Status Total Score
comment: This class denotes Functional Status Total Score 3 or Above
notation: 368

Mexico City, Mexico
type: geographic region
comment: The state, province, or territory of Mexico City, Mexico
SIO_000313: Q96

DERF1 Dust Mite Allergen
type: Class
subclass of: Allergen
comment: This class denotes DERF1 Dust Mite Allergen

Fetal Death Before 20 Weeks
type: Class
type: Quality Value
type: Node shape
subclass of: Pregnancy Outcome By Fetal Status
comment: This class denotes fetal death before 20 weeks
notation: 1009

Asthma Control Test Score for 8 to 18 Years
type: Class
type: Node shape
subclass of: HHEAR_00688
comment: This class denotes Asthma Control Test Score for 8 to 18 Years

Iran
type: geographic region
comment: The country of Iran
SIO_000313: Outside United States

neural cell
type: Class
subclass of: Cell
comment: This class denotes neural cell

Drank Six to Eight Alcoholic Drinks
type: Class
type: Quality Value
type: Node shape
subclass of: Drank Six or More Alcoholic Drinks
comment: This class denotes drank six to eight alcoholic drinks
notation: 1163

Date of Delivery
type: Class
type: Node shape
subclass of: time interval
subclass of: HHEAR_00549
comment: The date at which a pregnancy delivery occurs

candela per square meter
type: unit of measurement
notation: cd/m2

Strongly Agree
type: Class
type: Node shape
subclass of: Agree
comment: Intense concurrence. [Definition Source: NCI]

protein intake measurement
type: Class
type: Node shape
subclass of: diet measurement
comment: Quantification of the protein intake of an individual. (Source: Experimental Factors Ontology)

Functional Status Feeding Score
type: Class
subclass of: Functional Status Score
comment: This class denotes Functional Status Feeding Score

Annual Income $24,999 or Less
type: Class
type: Quality Value
subclass of: HHEAR_02319
subclass of:
  on property: SIO_000900
  has value: year
subclass of:
  on property: currency
  has value: USD
subclass of:
  on property: minValue
  has value: 0
subclass of:
  on property: maxValue
  has value: 24999
comment: This class denotes Annual Income $24,999 or Less
notation: 444

Pre FEV1/FVC Z-Score
type: Class
type: Quantity Variable
type: Node shape
subclass of: FEV1/FVC Z-Score
comment: The Z-Score of a ratio of the spirometry FEV1 to FVC measurement for a subject prior to inhaler administration.

Mouse Allergen
type: Class
subclass of: Allergen
comment: This class denotes Mouse Allergen

Breastfed At Least Six Months
type: Class
type: Quality Value
type: Node shape
subclass of: Duration of Breast Feeding
comment: Indicates that a subject has breastfed their child for at least six months.
notation: 1160

blood monocyte count
type: Class
subclass of: SIO_000794
comment: This class denotes blood monocyte count

gram per mole
type: unit of measurement
notation: g/mol

Three Months Prior to Followup 2
type: Class
type: Node shape
subclass of: duration
comment: This class denotes Three Months Prior to Followup 2

Tanner Breast Development Stage V
type: Class
type: Quality Value
type: Node shape
subclass of: Tanner Scale For Breast Development
comment: breast reaches final adult size; areola returns to contour of the surrounding breast, with a projecting central papilla. (15+) Source: Adolescent health care : a practical guide. Neinstein, Lawrence S., Neinstein, Lawrence S. (5th ed.). Philadelphia: Lippincott Williams & Wilkins. 2008. ISBN 9780781792561. OCLC 148727849.
notation: 569

Idaho, United States of America
type: geographic region
comment: The state, province, or territory of Idaho, United States of America
SIO_000313: Western United States

Functional Status Respiratory Status Score
type: Class
subclass of: Physical And Mental Assessment
subclass of: Functional Status Score
comment: This class denotes Functional Status Respiratory Status Score

Bedroom Dust
type: Class
subclass of: Allergen
comment: This class denotes Bedroom Dust
equivalent class: Class
  intersection of: Dust
  intersection of: Restriction
    some values from: http://snomed.info/id/224700005
    on property: PATO_0002261
  equivalent class: Bedroom Dust

Annual Income $25,000 to $49,999
type: Class
type: Quality Value
type: Node shape
subclass of: Annual Income $25,000 to $50,000
subclass of:
  on property: maxValue
  has value: 49999
subclass of:
  on property: SIO_000900
  has value: year
subclass of:
  on property: minValue
  has value: 25000
comment: This class denotes Annual Income $25,000 to $49,999
notation: 445

Fresh Stillbirth
type: Class
type: Quality Value
type: Node shape
subclass of: Stillbirth
comment: A stillbirth in which the fetus does not show signs of maceration, indicating that fetal death occurred recent to the delivery
notation: 1007

Post FEV1/FVC Z-Score
type: Class
type: Quantity Variable
type: Node shape
subclass of: FEV1/FVC Z-Score
comment: The Z-Score of a ratio of the spirometry FEV1 to FVC measurement for a subject after inhaler administration.

Annual Income $20,000 to $50,000
type: Class
type: Quality Value
type: Node shape
subclass of: NCIT C70811
subclass of:
  on property: minValue
  has value: 20000
subclass of:
  on property: currency
  has value: USD
subclass of:
  on property: SIO_000900
  has value: year
subclass of:
  on property: maxValue
  has value: 50000
comment: Denotes that a subject or subject's household receives between $20,000 and $50,000 as annual income
notation: 1161

El Salvador
type: geographic region
comment: The country of El Salvador
SIO_000313: Outside United States

locomotion
type: Class
subclass of: Thing
comment: This class denotes locomotion

kilogram per mole
type: unit of measurement
notation: kg/mol

9-hydroxyphenanthrene
type: Class
type: Facet Value
subclass of: polycyclic hydrocarbon
comment: This class denotes 9-hydroxyphenanthrene
notation: PHEN9

Blood Eosinophil Count
type: Class
type: Quantity Variable
subclass of: Physical And Mental Assessment
subclass of: SIO_000794
comment: This class denotes Blood Eosinophil Count

Puebla, Mexico
type: geographic region
comment: The state, province, or territory of Puebla, Mexico
SIO_000313: Q96

Three Months Prior to Followup 3
type: Class
type: Node shape
subclass of: duration
subclass of: Restriction
  some values from: Study Followup 3
  on property: intervalMeets
comment: This class denotes Three Months Prior to Followup 3

Tanner Genital Development Stage I
type: Class
type: Quality Value
type: Node shape
subclass of: Tanner Scale For Genital Development
comment: testicular volume less than 1.5 ml; small penis (prepubertal; typically age 9 and younger) Source: Adolescent health care : a practical guide. Neinstein, Lawrence S., Neinstein, Lawrence S. (5th ed.). Philadelphia: Lippincott Williams & Wilkins. 2008. ISBN 9780781792561. OCLC 148727849.
notation: 580

Dog Allergen
type: Class
subclass of: Allergen
comment: This class denotes Dog Allergen

Menarche At or After Age 14
type: Class
type: Quality Value
type: Node shape
subclass of: Age at Menarche
comment: Indicates that a subject's first menstruation occurred at or after age 14 years old.
notation: 1158

Functional Status Communication Score
type: Class
subclass of: Functional Status Score
comment: This class denotes Functional Status Communication Score

Does Not Use Antibiotics During Hospital Admission
type: Class
type: Quality Value
type: Node shape
subclass of: Hospital Admission By Antibiotic Use
subclass of: Class
  complement of: Restriction
    some values from: Uses Antibiotics
    on property: SIO_000325
comment: This class indicates when a patient does not antibiotics during a hospital admission. The patient may have used antibiotics prior to hospital admission or after discharge.
notation: 442
equivalent class: Class
  intersection of: Hospital Admission
  intersection of: Class
    complement of: Restriction
      some values from: Uses Antibiotics
      on property: SIO_000325
  equivalent class: Does Not Use Antibiotics During Hospital Admission
disjoint with: Uses Antibiotics During Hospital Admission

Post FEV1/FVC Ratio
type: Class
type: Quantity Variable
type: Node shape
subclass of: forced expiratory volume to forced vital capacity ratio
comment: This class denotes Post FEV1/FVC Ratio

Nuevo León, Mexico
type: geographic region
comment: The state, province, or territory of Nuevo León, Mexico
SIO_000313: Q96

birthing
type: Class
subclass of: HHEAR_00036
comment: This class denotes birthing

human immunodeficiency virus infectious disease
type: Class
type: Quality Value
subclass of: DOID 934
comment: This class denotes human immunodeficiency virus infectious disease
notation: 1069

Tanner Breast Development Stage III
type: Class
type: Quality Value
type: Node shape
subclass of: Tanner Scale For Breast Development
comment: breast begins to become more elevated, and extends beyond the borders of the areola, which continues to widen but remains in contour with surrounding breast (11.5–13) Source: Adolescent health care : a practical guide. Neinstein, Lawrence S., Neinstein, Lawrence S. (5th ed.). Philadelphia: Lippincott Williams & Wilkins. 2008. ISBN 9780781792561. OCLC 148727849.
notation: 571

Employment not in Medical Field
type: Class
type: Quality Value
type: Node shape
subclass of: Employment
comment: The status of being employed but not in a medical field
notation: 448
disjoint with: Employment in Medical Field

Functional Status Motor Functioning Score
type: Class
subclass of: Functional Status Score
comment: This class denotes Functional Status Motor Functioning Score

Cat Allergen
type: Class
subclass of: Allergen
comment: This class denotes Cat Allergen

rest:
  rest: nil
  first: Restriction
    on property: SIO_000300
    has value: 3
first: SIO_001113

FEV1/FVC Z-Score
type: Class
type: Node shape
subclass of: Z-Score
subclass of: CMO_0000094
comment: The Z-Score of a ratio of the spirometry FEV1 to FVC measurement for a subject

Breastfed Less Than Six Months
type: Class
type: Quality Value
type: Node shape
subclass of: Duration of Breast Feeding
comment: Indicates that a subject has breastfed their child for less than six months.
notation: 1159

blood lymphocyte count
type: Class
subclass of: SIO_000794
comment: This class denotes blood lymphocyte count

cubic meter per mole
type: unit of measurement
notation: m3/mol

Disagree
type: Class
type: Node shape
subclass of: Agreement Answer
comment: To be at odds. [Definition Source: NCI]

Tanner Breast Development Stage IV
type: Class
type: Quality Value
type: Node shape
subclass of: Tanner Scale For Breast Development
comment: increased breast sizing and elevation; areola and papilla form a secondary mound projecting from the contour of the surrounding breast (13–15) Source: Adolescent health care : a practical guide. Neinstein, Lawrence S., Neinstein, Lawrence S. (5th ed.). Philadelphia: Lippincott Williams & Wilkins. 2008. ISBN 9780781792561. OCLC 148727849.
notation: 568

Alaska, United States of America
type: geographic region
comment: The state, province, or territory of Alaska, United States of America
SIO_000313: Western United States

New Zealand
type: geographic region
comment: The country of New Zealand
SIO_000313: Outside United States

Functional Status Mental Status Score
type: Class
subclass of: Functional Status Score
comment: This class denotes Functional Status Mental Status Score

Uses Antibiotics During Hospital Admission
type: Class
type: Quality Value
type: Node shape
subclass of: Hospital Admission By Antibiotic Use
comment: This class indicates when a patient is using antibiotics during a hospital admission. The use of the antibiotics may precede the hospital admission, extend beyond hospital discharge, or occur wholly within the hospital admission.
notation: 441
equivalent class: Class
  intersection of: Hospital Admission
  intersection of: Restriction
    some values from: Uses Antibiotics
    on property: SIO_000325
  equivalent class: Uses Antibiotics During Hospital Admission
disjoint with: Does Not Use Antibiotics During Hospital Admission

Menarche At Age 12
type: Class
type: Quality Value
type: Node shape
subclass of: Age at Menarche
comment: Indicates that a subject's first menstruation occurred at age 12 years old.
notation: 1156

Tanner Scale For Male Pubic Hair Development (Assigned By Child's Mother)
type: Class
type: Quality Variable
type: Node shape
subclass of: Tanner Scale For Male Pubic Hair Development
comment: A rating of the Tanner Scale for Male Pubic Hair Development as assigned by the child's mother

Agree
type: Class
type: Node shape
subclass of: Agreement Answer
comment: To concur. [Definition Source: NCI]

Nayarit, Mexico
type: geographic region
comment: The state, province, or territory of Nayarit, Mexico
SIO_000313: Q96

Iraq
type: geographic region
comment: The country of Iraq
SIO_000313: Outside United States

hospital-acquired infection
type: Class
subclass of: infection
comment: This class denotes hospital-acquired infection

Functional Status Sensory Functioning Score
type: Class
subclass of: Functional Status Score
comment: This class denotes Functional Status Sensory Functioning Score

Menarche At Age 13
type: Class
type: Quality Value
type: Node shape
subclass of: Age at Menarche
comment: Indicates that a subject's first menstruation occurred at age 13 years old.
notation: 1157

Hospital Admission By Antibiotic Use
type: Class
type: Quality Variable
type: Node shape
subclass of: Prescription Medication and Dietary Supplements
subclass of: Hospital Admission
comment: A subclass of Hospital Admission; this class differentiates between when a patient uses antibiotics at any time during a hospital admission versus when they do not.

Other Gender
type: Class
type: Quality Value
subclass of: Gender
comment: This class denotes Other Gender
notation: 325

Tanner Breast Development Stage II
type: Class
type: Quality Value
type: Node shape
subclass of: Tanner Scale For Breast Development
comment: breast bud forms, with small area of surrounding glandular tissue; areola begins to widen (10–11.5) Source: Adolescent health care : a practical guide. Neinstein, Lawrence S., Neinstein, Lawrence S. (5th ed.). Philadelphia: Lippincott Williams & Wilkins. 2008. ISBN 9780781792561. OCLC 148727849.
notation: 570

Birth Order
type: Class
type: Quality Variable
subclass of: HHEAR_00036
comment: This class denotes Birth Order

Campeche, Mexico
type: geographic region
comment: The state, province, or territory of Campeche, Mexico
SIO_000313: Q96

Education Grade 11
type: Class
type: Quality Value
type: Node shape
subclass of: Education By Highest Grade Attained
subclass of: Some High School
comment: This class denotes Education Grade 11
notation: 813

rest:
  rest: nil
  first: Restriction
    some values from: Datatype
      with restrictions:
        min exclusive: 10.0
      on datatype: float
    on property: value
first: mass percentage

Three Months Prior to Followup
type: Class
type: Node shape
subclass of: duration
subclass of: Restriction
  some values from: HHEAR_00554
  on property: intervalMeets
comment: This class denotes Three Months Prior to Followup

2-Chlorophenol
type: Class
type: Facet Value
subclass of: CHEBI_33853
notation: MCP2
definition: 2-chlorophenol is a colorless to amber liquid with an unpleasant, penetrating odor. Density 1.265 g / cm3. Sinks in water and slowly dissolves. Freezing point 7°C (46°F). Boiling point 175°C (347°F).

Education Grade 3
type: Class
type: Quality Value
subclass of: Education By Highest Grade Attained
subclass of: Some Elementary School
notation: 115
definition: Finished grade 3

Birth of Single Child
type: Class
type: Quality Value
type: Node shape
subclass of: Pregnancy Outcome By Birth Count
comment: This class denotes birth of single child
notation: 1004

Three Months Prior to Baseline
type: Class
type: Node shape
subclass of: duration
comment: This class denotes Three Months Prior to Baseline

Education By Highest Grade Attained
type: Class
type: Quality Variable
subclass of: Education
definition: The subclasses of this class are used to denote the highest grade of education achieved for a subject.
was approved by: PER-Jeanette-Stingone

Education Grade 12, No Diploma
type: Class
type: Quality Value
type: Node shape
subclass of: Education By Highest Grade Attained
subclass of: Some High School
comment: This class denotes Education Grade 12, No Diploma
notation: 814

Durango, Mexico
type: geographic region
comment: The state, province, or territory of Durango, Mexico
SIO_000313: Q96

Education Grade 5
type: Class
type: Quality Value
subclass of: Education By Highest Grade Attained
subclass of: Some Middle School
notation: 117
definition: Finished grade 5

Elective Caesarian Section
type: Class
type: Quality Value
subclass of: Caesarian Section
notation: 19
definition: A caesarian section that was chosen by the mother but was not medically necessary.

Birth of Twin Children
type: Class
type: Quality Value
type: Node shape
subclass of: Pregnancy Outcome By Birth Count
comment: This class denotes birth of twin children
notation: 1005

surface wipe
type: Class
type: Node shape
subclass of: Environmental Material
comment: A sample collection device consisting of a thin, less absorbent sheet, used to collect material from surfaces. (Source: Ontology for Biomedical Investigations)

Alternaria Allergen
type: Class
subclass of: Allergen
comment: This class denotes Alternaria Allergen

Electronic Health Records
type: Class
type: Node shape
subclass of: medical health record
comment: Media that facilitate transportability of pertinent information concerning patient's illness across varied providers and geographic locations. Some versions include direct linkages to online CONSUMER HEALTH INFORMATION that is relevant to the health conditions and treatments related to a specific patient. (Source: Medical Subject Headings Ontology)

Master's Degree
type: Class
type: Quality Value
subclass of: HHEAR_01110
notation: 143
definition: The Master's Degree is an award that requires the successful completion of a program of study of at least the full-time equivalent of 1 but not more than two academic years of work beyond the bachelor's degree.

Sneeze
type: Class
type: Node shape
subclass of: HHEAR_00904
comment: A sudden violent, spasmodic, audible expiration of breath through the nose and mouth.

Education Grade 1
type: Class
type: Quality Value
subclass of: Education By Highest Grade Attained
subclass of: Some Elementary School
notation: 113
definition: Finished grade 1

flonicamid
type: Class
type: Node shape
type: Facet Value
subclass of: HHEAR_01374
comment: A pyridinecarboxamide that is nicotinamide substituted by a trifluoromethyl group at position 4 and a cyanomethyl group at the carbamoyl nitrogen atom. Source: ChEBI
notation: FLNC

Two Weeks Prior to Followup 3
type: Class
type: Node shape
subclass of: duration
subclass of: Restriction
  some values from: Study Followup 3
  on property: intervalMeets
comment: This class denotes Two Weeks Prior to Followup 3

Drinks Per Session
type: Class
type: Node shape
subclass of: UO_0000105
comment: the number of alcoholic drinks consumed during a drinking session, broadly defined

Severe Severity Asthma Score
type: Class
type: Quality Value
type: Node shape
subclass of: National Asthma Education and Prevention Program Test Score
comment: A test score for an asthma test based on the National Asthma Education and Prevention Program recommendations that indicates a subject's asthma is highly severe.
notation: 1109

Pathology Result
type: Class
type: Node shape
subclass of: NCIT C36292
comment: The outcome of a pathologic examination. (Source: NCI Thesaurus)

square meter
type: unit of measurement
notation: m2

Cockroach Allergen
type: Class
subclass of: Allergen
comment: This class denotes Cockroach Allergen

Education Grade 10
type: Class
type: Quality Value
type: Node shape
subclass of: Education By Highest Grade Attained
subclass of: Some High School
comment: This class denotes Education Grade 10
notation: 812

Interleukin-13
type: Class
type: Facet Value
subclass of: Protein
subclass of: HHEAR_01389
comment: This class denotes Interleukin-13
notation: IL13

disease
type: Class
subclass of: Thing
comment: This class denotes disease

Two Weeks Prior to Followup 4
type: Class
type: Node shape
subclass of: duration
subclass of: Restriction
  some values from: Study Followup 4
  on property: intervalMeets
comment: This class denotes Two Weeks Prior to Followup 4

Pre FEV1/FVC Ratio
type: Class
type: Quantity Variable
type: Node shape
subclass of: forced expiratory volume to forced vital capacity ratio
comment: This class denotes Pre FEV1/FVC Ratio

on property: currency
has value: USD

Education Grade 2
type: Class
type: Quality Value
subclass of: Education By Highest Grade Attained
subclass of: Some Elementary School
notation: 114
definition: Finished grade 2

One Year Prior to Baseline
type: Class
type: Node shape
subclass of: time interval
subclass of: Restriction
  some values from: One Month Prior to Baseline
  on property: intervalContains
comment: A time interval that begins one year prior to a study baseline and ends at the beginning of the study baseline.

platelet count
type: Class
subclass of: SIO_000794
comment: This class denotes platelet count

Restriction
on property: SIO_000300
has value: 44

ventilator supporting therapy
type: Class
type: Quality Value
subclass of: medical intervention
comment: Medical procedures that support life systems when a patient is receiving invasive ventilation treatments.
notation: 383

Endotoxin Allergen
type: Class
subclass of: Allergen
comment: This class denotes Endotoxin Allergen

Norway
type: geographic region
comment: The country of Norway
SIO_000313: Outside United States

cancer
type: Class
type: Quality Value
subclass of: Comorbidity Disease
comment: A disease of cellular proliferation that is malignant and primary, characterized by uncontrolled cellular proliferation, local cell invasion and metastasis. (Source: Disease Ontology)
notation: 381

Menarche At or Before Age 10
type: Class
type: Quality Value
type: Node shape
subclass of: Age at Menarche
comment: Indicates that a subject's first menstruation occurred at or before age 10.
notation: 1154

Drank Alcohol Prior to Pregnancy
type: Class
type: Quality Value
type: Node shape
subclass of: Consumed Alcohol
comment: This class denotes drank alcohol prior to pregnancy
notation: 1099

Two Weeks Prior to Followup
type: Class
type: Node shape
subclass of: duration
subclass of: Restriction
  some values from: HHEAR_00554
  on property: intervalMeets
comment: This class denotes Two Weeks Prior to Followup

Intermittent Severity Asthma Score
type: Class
type: Quality Value
type: Node shape
subclass of: National Asthma Education and Prevention Program Test Score
comment: A test score for an asthma test based on the National Asthma Education and Prevention Program recommendations that indicates a subject's asthma is intermittently severe.
notation: 1106

Benz(a)anthracene
type: Class
type: Node shape
subclass of: Targeted Analyte
comment: An angular ortho-fused polycyclic arene consisting of four fused benzene rings. It is an ortho-fused polycyclic arene and a member of tetraphenes. (Source: ChEBI Ontology)
notation: BENZAANTH

T-Cell Activation
type: Class
type: Node shape
subclass of: immune response
comment: T-Cell Activation involves stimulation of T lymphocytes by receptor interaction with mitogens or cell surface-displayed antigens resulting in biosynthesis of lymphokines, cell proliferation, cell differentiation, and maturation to support immune activity. (Source: NCI Thesaurus)

square millimeter
type: unit of measurement
notation: mm2

Nevada, United States of America
type: geographic region
comment: The state, province, or territory of Nevada, United States of America
SIO_000313: Western United States

Aspergillus Allergen
type: Class
subclass of: Allergen
comment: This class denotes Aspergillus Allergen

selection criterion
type: Class
subclass of: Thing
comment: This class denotes selection criterion

Hidalgo, Mexico
type: geographic region
comment: The state, province, or territory of Hidalgo, Mexico
SIO_000313: Q96

Haiti
type: geographic region
comment: The country of Haiti
SIO_000313: Outside United States

rest: nil
first: Restriction
  on property: SIO_000300
  has value: 29.0

Nested Case-control Study
type: Class
type: Node shape
subclass of: study
comment: A study in which a group or cohort of individuals is followed for a certain length of time or until a specific outcome is reached. Studies of this type incorporate the strengths of both cohort and case-control studies but eliminates a portion of the methodologic challenges inherent in both types of studies. (Source: NCI Thesaurus)

minor polymorphic allele
type: Class
type: Node shape
subclass of: polymorphic allele
comment: A polymorphic allele that is not present at the highest frequency among all fixed variants at the locus (i.e. not the major polymorphic allele at a given location).

Two Weeks Prior to Followup 2
type: Class
type: Node shape
subclass of: duration
subclass of: Restriction
  some values from: Study Followup 2
  on property: intervalMeets
comment: This class denotes Two Weeks Prior to Followup 2

Conception
type: Class
subclass of: time interval
subclass of: From Conception
subclass of: Beginning
subclass of: Restriction
  on property: SIO_000668
  all values from: Class
    intersection of: HHEAR_00047
definition: When a sperm fertilizes an egg
was approved by: PER-Jeanette-Stingone

Frequency of Alcohol Consumption
type: Class
type: Node shape
subclass of: HHEAR_00172
comment: This class denotes frequency of alcohol consumption

Moderate Severity Asthma Score
type: Class
type: Quality Value
type: Node shape
subclass of: National Asthma Education and Prevention Program Test Score
comment: A test score for an asthma test based on the National Asthma Education and Prevention Program recommendations that indicates a subject's asthma is moderately severe.
notation: 1108

white blood cell count
type: Class
subclass of: SIO_000794
comment: This class denotes white blood cell count

square centimeter
type: unit of measurement
notation: cm2

Mammary Gland Tissue
type: Class
type: Node shape
subclass of: tissue
subclass of: Restriction
  some values from: UBERON_0000310
  on property: SIO_000068
comment: The glandular tissue of the breast. In females, it is composed of numerous lobules with alveolar ducts and alveoli. In males, it is composed of rudimentary glands. (Source: NCI Thesaurus)

Tanner Scale For Pubic Hair Development
type: Class
type: Node shape
subclass of: Tanner Scale
comment: This class denotes Tanner Scale For Pubic Hair Development

Medical Related Hospital Admission
type: Class
type: Quality Value
subclass of: Hospital Admission By Admission Type
comment: This class denotes Medical Related Hospital Admission
notation: 375

Conceptual Entity
type: Class
type: Node shape
subclass of: Activity
comment: An organizational header for concepts representing mostly abstract entities. (Source: NCI Thesaurus)

Blinded Season 4 Group
type: Class
type: Quality Value
subclass of: Seasonal Population Group
comment: This class denotes Blinded Season 4 Group
notation: 301

all-cis-5, 8, 11, 14, 17-icosapentaenoic acid
type: Class
type: Facet Value
subclass of: Fatty Acid
notation: C205N3
definition: An icosapentaenoic acid having five cis-double bonds at positions 5, 8, 11, 14 and 17.

Drank Alcohol More Than A Week Ago
type: Class
type: Quality Value
type: Node shape
subclass of: Consumed Alcohol
comment: This class denotes drank alcohol more than a week ago
notation: 1002

Interleukin-12 subunit alpha
type: Class
type: Facet Value
subclass of: Protein
subclass of: HHEAR_01389
comment: This class denotes Interleukin-12 subunit alpha
notation: IL12P70

National Asthma Education and Prevention Program Test Score
type: Class
type: Node shape
subclass of: Physical And Mental Assessment
subclass of: score
comment: A test score for an asthma test based on the National Asthma Education and Prevention Program recommendations

major polymorphic allele
type: Class
type: Node shape
subclass of: polymorphic allele
comment: A polymorphic allele that is present at the highest frequency relative to other polymorphic variants at the same genomic location.

Has Used DMPA
type: Class
type: Quality Value
type: Node shape
subclass of: DMPA Use
comment: Indicates that a subject has used or continues to use the contraceptive Depot Medroxyprogesterone Acetate (DMPA).
notation: 1152
disjoint with: Has Never Used DMPA

Detached Umbilical Cord Length
type: Class
type: Quantity Variable
type: Node shape
subclass of: Umbilical Cord Measurement
comment: This class denotes Detached Umbilical Cord Length
intersection of: Class
  complement of: Umbilical Cord Measurement

Datatype
with restrictions:
  max inclusive: 35.0
on datatype: float

gram per cubic centimeter
type: unit of measurement
notation: g/cm3

Nitric Oxide Ventilation
type: Class
subclass of: ventilator supporting therapy
subclass of: artificial respiration
subclass of: Restriction
  some values from: Nitric Oxide
  on property: SIO_000139
comment: The administration of nitric oxide gas via artificial ventilation mechanisms.

Drank Alcohol More Than A Month Ago
type: Class
type: Quality Value
type: Node shape
subclass of: Consumed Alcohol
comment: This class denotes drank alcohol more than a month ago
notation: 1003

polymorphic allele
type: Class
type: Node shape
subclass of: allele
comment: An allele that is fixed in a population at some stable level, typically > 1%. Polymorphic alleles reside at loci where more than one version exists at some significant frequency in a population. (source: PMID: 25741868 ACMG Guidelines)

Has Never Used DMPA
type: Class
type: Quality Value
type: Node shape
subclass of: DMPA Use
comment: Indicates that a subject has never used the contraceptive Depot Medroxyprogesterone Acetate (DMPA).
notation: 1153
disjoint with: Has Used DMPA

Two Weeks Prior to Baseline
type: Class
type: Node shape
subclass of: duration
subclass of: Restriction
  some values from: Study Baseline
  on property: intervalMeets
comment: This class denotes Two Weeks Prior to Baseline

Mild Severity Asthma Score
type: Class
type: Quality Value
type: Node shape
subclass of: National Asthma Education and Prevention Program Test Score
comment: A test score for an asthma test based on the National Asthma Education and Prevention Program recommendations that indicates a subject's asthma is mildly severe.
notation: 1107

kilogram per cubic meter
type: unit of measurement
notation: kg/m3

red blood cell count
type: Class
subclass of: SIO_000794
comment: This class denotes red blood cell count

4, 4'-DDT
type: Class
type: Facet Value
subclass of: HHEAR_01375
comment: This class denotes 4, 4'-DDT
notation: PPDDT

disease of metabolism
type: Class
type: Quality Value
type: Facet
subclass of: Comorbidity Disease
comment: This class denotes disease of metabolism
notation: 403

Population Group by Randomization
type: Class
type: Node shape
subclass of: Population Group
comment: This class denotes Population Group by Randomization

All of the Time Had Trouble Breathing Today
type: Class
type: Quality Value
type: Node shape
subclass of: always
subclass of: Asthma Induced Trouble Breathing Response
comment: This class denotes All of the Time Had Trouble Breathing Today
notation: 768

SNP
type: Class
type: Node shape
subclass of: SO_0001483
comment: SNPs are single base pair positions in genomic DNA at which different sequence alternatives exist in normal individuals in some population(s), wherein the least frequent variant has an abundance of 1% or greater.

Mandelic acid
type: Class
type: Facet Value
subclass of: Volatile Organic Compound
comment: This class denotes Mandelic acid
notation: MA
editorial note: To Do: align with CHEBI.

Did Not Consume Alcohol
type: Class
type: Quality Value
subclass of: HHEAR_00172
comment: This class denotes Did Not Consume Alcohol
notation: 53

phenanthrene
type: Class
type: Node shape
subclass of: polycyclic hydrocarbon
comment: A polycyclic aromatic hydrocarbon composed of three fused benzene rings which takes its name from the two terms 'phenyl' and 'anthracene.' (Source: ChEBI Ontology)
notation: PHENANTHRENE

Aluminum
type: Class
type: Facet Value
subclass of: Metal
subclass of: HHEAR_01387
notation: Al
definition: ALUMINUM is a metallic element that has the atomic number 13, atomic symbol Al, and atomic weight 26.98.

Alabama, United States of America
type: geographic region
comment: The state, province, or territory of Alabama, United States of America
SIO_000313: Q1139046

air
type: Class
type: Facet
subclass of: Thing
subclass of: Environmental Material
comment: This class denotes air

placenta disease
type: Class
type: Quality Value
subclass of: phenotype
comment: This class denotes placenta disease
notation: 922

Prince Edward Island, Canada
type: geographic region
comment: The state, province, or territory of Prince Edward Island, Canada
SIO_000313: Canada

Sickle Cell Anemia
type: Class
type: Quality Value
subclass of: Disease
notation: 122
definition: A blood protein disease that is characterized by low number of red blood cells, repeated infections, and periodic episodes of pain, resulting from atypical hemoglobin molecules called hemoglobin S, which can distort red blood cells into a sickle, or crescent, shape.

Household Income - Monthly - Suriname
type: Class
type: Node shape
subclass of: NCIT C70811
comment: The monthly household income in Suriname Dollar (SRD)

Neurodevelopmental delay
type: Class
type: Node shape
subclass of: Neurodevelopmental abnormality
subclass of: HHEAR_00903
comment: This class denotes Neurodevelopmental delay

on property: minValue
has value: 20000

Population Group by Study Site
type: Class
type: Node shape
subclass of: Population Group
comment: This class denotes Population Group by Study Site

Asthma Induced Distress Response
type: Class
type: Node shape
subclass of: Discover Questionnaire Response
comment: This class denotes Asthma Induced Distress Response

Mandelic acid(ng/mL)
type: Class
subclass of: Volatile Organic Compound
comment: This class denotes Mandelic acid(ng/mL)
notation: VOCMAD
editorial note: To Do: align with CHEBI.

Diet Quantity
type: Class
type: Quantity Variable
subclass of: SIO_000052
subclass of: HHEAR_00053
definition: A quantity relating to diet and nutrition.
was approved by: PER-Jeanette-Stingone
editorial note: What differentiated diet from nutrition? That is why is this needed since we have the DietAndNutrition Class

Population Group
type: Class
type: Quality Variable
subclass of: Study Indicator
definition: A group of individuals united by a common factor (e.g., geographic location, ethnicity, disease, age, gender)

Receives Income Assistance
type: Class
type: Quality Value
type: Node shape
subclass of: Receives Public Assistance
subclass of: Restriction
  some values from: Income Assistance
  on property: SIO_000230
comment: This class denotes Receives Income Assistance
notation: 707
disjoint with: Does Not Receive Income Assistance

Some of the Time Had Trouble Breathing Today
type: Class
type: Quality Value
type: Node shape
subclass of: some of the time
subclass of: Asthma Induced Trouble Breathing Response
comment: This class denotes Some of the Time Had Trouble Breathing Today
notation: 771

Pregnancy
type: Class
type: Facet
subclass of: time interval
subclass of: Pregnancy Characteristic
subclass of: From Conception
subclass of: Life Stage
subclass of: Maternal Prenatal Stage
subclass of: Study Population
subclass of: HHEAR_01727
subclass of: Restriction
  on property: SIO_000668
  all values from: Class
    intersection of: HHEAR_00047
definition: The time during which one or more offspring develops inside a woman.
was approved by: PER-Jeanette-Stingone

High School or Less
type: Class
type: Quality Value
subclass of: Education
notation: 33
definition: Education Level of High School or Less
was approved by: PER-Jeanette-Stingone

Consumed Alcohol
type: Class
type: Quality Value
subclass of: HHEAR_00172
comment: This class denotes Consumed Alcohol
notation: 52

Followup Sample Collection
type: Class
type: Node shape
subclass of: HHEAR_00042
subclass of: Restriction
  some values from: HHEAR_00554
  on property: intervalDuring
comment: A time interval at which a sample is collected from a study participant that occurs during the followup of a study

Apartment
type: Class
type: Quality Value
subclass of: Living Quarters
comment: This class denotes Apartment
notation: 196

total fat intake measurement
type: Class
type: Node shape
subclass of: diet measurement
comment: quantification of the total amount of dietary fat consumed by an individual (Source: Experimental Factors Ontology)

Sepsis
type: Class
subclass of: phenotype
subclass of: Sepsis, Septic Shock, or SIRS
comment: This class denotes Sepsis

Receives Utility Assistance
type: Class
type: Quality Value
type: Node shape
subclass of: Receives Public Assistance
subclass of: Restriction
  some values from: Utility Assistance
  on property: SIO_000230
comment: This class denotes Receives Utility Assistance
notation: 708
disjoint with: Does Not Receive Utility Assistance

Most of the Time Had Trouble Breathing Today
type: Class
type: Quality Value
type: Node shape
subclass of: most of the time
subclass of: Asthma Induced Trouble Breathing Response
comment: This class denotes Most of the Time Had Trouble Breathing Today
notation: 769

Post-Secondary Education
type: Class
type: Quality Value
subclass of: Education
notation: 31
definition: College or university education beyond the successful completion of high school or grammar school, or the attainment of an approved equivalent
was approved by: PER-Jeanette-Stingone

Republic of Ireland
type: geographic region
comment: The country of Republic of Ireland
SIO_000313: Outside United States

Date of Birth
type: Class
type: Quantity Variable
subclass of: Demographic
subclass of: time interval
definition: Date of day on which a person was born.
was approved by: PER-Jeanette-Stingone

Hungary
type: geographic region
comment: The country of Hungary
SIO_000313: Outside United States

Neurodevelopmental abnormality
type: Class
type: Node shape
subclass of: Abnormal nervous system physiology
comment: A deviation from normal of the neurological development of a child, which may include any or all of the aspects of the development of personal, social, gross or fine motor, and cognitive abilities. This term should be used to describe abnormalities with onset in the developmental period.

Pre-gestational Diabetes
type: Class
type: Quality Value
type: Node shape
subclass of: diabetes
comment: Diabetes diagnosed before current pregnancy. (Source: reVITALize)
notation: 693

endocrine system disease
type: Class
subclass of: Comorbidity Disease
comment: This class denotes endocrine system disease

A Little of the Time Had Trouble Breathing Today
type: Class
type: Quality Value
type: Node shape
subclass of: some of the time
subclass of: Asthma Induced Trouble Breathing Response
comment: This class denotes A Little of the Time Had Trouble Breathing Today
notation: 767

British Columbia, Canada
type: geographic region
comment: The state, province, or territory of British Columbia, Canada
SIO_000313: Canada

Finished Elementary School
type: Class
type: Quality Value
subclass of: Finished Elementary Grade 4
notation: 15
definition: Finished Elementary School
was approved by: PER-Jim-McCusker

drug
type: Class
subclass of: chemical substance
comment: A drug is a chemical substance that contains one or more active ingredients that regulate one or more biological processes. (Source: SIO Ontology)

Eats Fresh Vegetables
type: Class
type: Quality Value
subclass of: Eating or Drinking
notation: 29
definition: Whether or not Fresh Vegetables are consumed.
was approved by: PER-Jeanette-Stingone

Body Weight Quality
type: Class
subclass of: Anthropometry
subclass of: quality
definition: A categorization of body mass relative to the height, as defined using Body Mass Index.

pharmaceutical drug
type: Class
subclass of: drug
comment: This class denotes pharmaceutical drug

microgram per liter
type: unit of measurement
notation: µg/L

Spain
type: geographic region
comment: The country of Spain
SIO_000313: Outside United States

Pack Year
type: Class
type: Node shape
subclass of: unit
comment: A quantification of lifetime tobacco exposure defined as (number of cigarettes smoked per day x number of years smoked)/20. One pack-year is smoking 20 cigarettes a day for one year. (Source: NCI Thesaurus)

2-hydroxyfluorene + 3-hydroxyfluorene
type: Class
type: Facet Value
subclass of: polycyclic hydrocarbon
subclass of: Restriction
  some values from: 2-hydroxyfluorene
  on property: SIO_000369
subclass of: Restriction
  some values from: 3-hydroxyfluorene
  on property: SIO_000369
comment: This class denotes 2-hydroxyfluorene + 3-hydroxyfluorene
notation: FLUO2_FLUO3

Kaufman Assessment Battery for Children
type: Class
type: Node shape
subclass of: Questionnaire
comment: A clinical tool used to assess a child's strengths and weaknesses in cognitive ability and mental processing. (Source: NCI Thesaurus)

Receives Housing Assistance
type: Class
type: Quality Value
type: Node shape
subclass of: Receives Public Assistance
subclass of: Restriction
  some values from: Housing Assistance
  on property: SIO_000230
comment: This class denotes Receives Housing Assistance
notation: 706
disjoint with: Does Not Receive Housing Assistance

A Good Bit of the Time Had Trouble Breathing Today
type: Class
type: Quality Value
type: Node shape
subclass of: most of the time
subclass of: Asthma Induced Trouble Breathing Response
comment: This class denotes A Good Bit of the Time Had Trouble Breathing Today
notation: 766

Quebec, Canada
type: geographic region
comment: The state, province, or territory of Quebec, Canada
SIO_000313: Canada

Dust
type: Class
subclass of: Environmental Material
comment: Particulate environmental material with diameters less than 500 micrometers. (Source: Environment Ontology)

Normal Weight
type: Class
type: Quality Value
subclass of: Body Weight Quality
subclass of: HHEAR_00427
subclass of: Restriction
  on property: SIO_000011
notation: 61
definition: Adult normal weight is defined as having a BMI between 18.5 and 25 kg/m^2; Child normal weight is defined as greater than or equal to the 5th percentile but less than the 85th percentile for age, gender and height.

obsolete: Gestational Age at Birth
type: Class
subclass of: Gestational Age
definition: Describes how far along a pregnancy is, usually measured in weeks, as measured at birth.
deprecated: true

Car Count
type: Class
type: Quantity Variable
subclass of: SIO_000794
subclass of: Housing Characteristic
definition: Total Number of Cars in the Home
editorial note: Again, this isn't related to physical properties of housing. This is more closely related to Socioeconomic Status. Consider moving it.

C-reactive protein
type: Class
type: Facet Value
subclass of: Protein
subclass of: HHEAR_01389
notation: CRP
definition: Displays several functions associated with host defense: it promotes agglutination, bacterial capsular swelling, phagocytosis and complement fixation through its calcium-dependent binding to phosphorylcholine. Can interact with DNA and histones and may scavenge nuclear material released from damaged circulating cells.

Baseline Sample Collection
type: Class
type: Node shape
subclass of: HHEAR_00042
subclass of: Restriction
  some values from: Study Baseline
  on property: intervalDuring
comment: A time interval at which a sample is collected from a study participant that occurs during the baseline of a study

Some College Less Than One Year
type: Class
type: Quality Value
type: Node shape
subclass of: Some College
comment: This class denotes Some College Less Than One Year
notation: 816

Fluticasone/vilanterol (Breo Ellipta)
type: Class
subclass of: Asthma Controller Medication
comment: This class denotes Fluticasone/vilanterol (Breo Ellipta)

Education Grade 6
type: Class
type: Quality Value
subclass of: Education By Highest Grade Attained
subclass of: Some Middle School
notation: 118
definition: Finished grade 6

Eats Fast Food
type: Class
type: Quality Value
subclass of: Eating or Drinking
notation: 16
definition: Whether or not fast food is consumed.
was approved by: PER-Jeanette-Stingone

Macerated Stillbirth
type: Class
type: Quality Value
type: Node shape
subclass of: Stillbirth
comment: A stillbirth in which the fetus shows signs of maceration, indicating that fetal death occurred significantly before delivery
notation: 1006

Asthma Induced Trouble Breathing Response
type: Class
type: Node shape
subclass of: Discover Questionnaire Response
comment: This class denotes Asthma Induced Trouble Breathing Response

Medical Examination
type: Class
type: Node shape
subclass of: NCIT C18020
comment: An appraisal or evaluation of a patient's condition by a clinician that is based on a physical exam, medical history, and the patient's account of symptoms. (Source: NCI Thesaurus)

First Trimester
type: Class
subclass of: time interval
subclass of: From Conception
subclass of: Restriction
  on property: SIO_000668
  all values from: Class
    intersection of: HHEAR_00047
subclass of: Restriction
  some values from: Pregnancy
  on property: intervalStarts
definition: From pregnancy week 1 through 12 and includes conception. Conception is when the sperm fertilizes the egg. The fertilized egg then travels down the fallopian tube and attaches to the inside of the uterus, where it begins to form the embryo and placenta. The first trimester carries the highest risk of miscarriage (natural death of embryo or fetus).
was approved by: PER-Jeanette-Stingone

Education Grade 7
type: Class
type: Quality Value
subclass of: Education By Highest Grade Attained
subclass of: Some Middle School
notation: 119
definition: Finished grade 7

acetamiprid
type: Class
type: Node shape
type: Facet Value
subclass of: HHEAR_01374
comment: A carboxamidine that is acetamidine in which the amino hydrogens are substituted by a (6-chloropyridin-3-yl)methyl and a methyl group while the hydrogen attached to the imino nitrogen is replaced by a cyano group. Source: ChEBI
notation: ACE

cohort study
type: Class
subclass of: Thing
comment: This class denotes cohort study

Never Had Trouble Breathing Today
type: Class
type: Quality Value
type: Node shape
subclass of: never
subclass of: Asthma Induced Trouble Breathing Response
comment: This class denotes Never Had Trouble Breathing Today
notation: 770

Some College More Than One Year, No Degree
type: Class
type: Quality Value
type: Node shape
subclass of: Some College
comment: This class denotes Some College More Than One Year, No Degree
notation: 815

cannabinoid
type: Class
subclass of: chemical entity
comment: This class denotes cannabinoid

Receives Food Assistance
type: Class
type: Quality Value
type: Node shape
subclass of: Receives Public Assistance
subclass of: Restriction
  some values from: Food Assistance
  on property: SIO_000230
comment: This class denotes Receives Food Assistance
notation: 705
disjoint with: Does Not Receive Food Assistance

Duration of Central Venous Cannula Insertion
type: Class
type: Quantity Variable
type: Node shape
subclass of: Duration of Medical Procedure
comment: The length of time a patient undergoes a central venous cannula insertion procedure

Airborne Particulate Matter
type: Class
type: Quality Variable
subclass of: Air Pollutant
comment: This class denotes Airborne Particulate Matter

EPA
type: Class
type: Facet
subclass of: Funding Institute
comment: This class denotes EPA

Annual Income $100,000 to $149,999
type: Class
type: Quality Value
type: Node shape
subclass of: HHEAR_00900
subclass of: Annual Income $75,000 to $149,999
subclass of:
  on property: currency
  has value: USD
subclass of:
  on property: maxValue
  has value: 149999
comment: This class denotes Annual Income $100,000 to $149,999
notation: 595

Cis-Nonachlor
type: Class
type: Facet Value
subclass of: HHEAR_01375
comment: This class denotes Cis-Nonachlor
notation: CNON

Chad
type: geographic region
comment: The country of Chad
SIO_000313: Outside United States

diabetes mellitus
type: Class
type: Quality Value
subclass of: Disease
comment: This class denotes diabetes mellitus
notation: 342

Dead
type: Class
type: Quality Value
subclass of: Destination
notation: 173
definition: The cessation of life.

Duration of Noninvasive Positive-Pressure Ventilation
type: Class
type: Quantity Variable
type: Node shape
subclass of: Duration of Medical Procedure
subclass of: Restriction
  some values from: noninvasive positve-pressure ventilation
  on property: SIO_000215
comment: The length of time a patient undergoes noninvasive positive-pressure ventilation

on property: minValue
has value: 2501

blood serum
type: Class
subclass of: Blood Component
subclass of: UBERON_0006314
notation: SERUM
definition: Liquid derived from blood plasma that has clotting factors removed. [database_cross_reference: http://en.wikipedia.org/wiki/Serum_(blood)][database_cross_reference: http://orcid.org/0000-0002-6601-2165]

Residential Building With A Yard
type: Class
type: Node shape
subclass of: Residential Building
subclass of: Restriction
  some values from: Residential Yard
  on property: SIO_000028
comment: A residential building that has an attached yard or garden where domestic leisure activities occur.
equivalent class: Class
  intersection of: Residential Building
  equivalent class: Residential Building With A Yard
disjoint with: Residential Building Without A Yard

Annual Income $150,000 to $199,999
type: Class
type: Quality Value
type: Node shape
subclass of: HHEAR_00900
subclass of: Annual Income More Than $125,000
subclass of:
  on property: currency
  has value: USD
subclass of:
  on property: SIO_000900
  has value: year
subclass of:
  on property: minValue
  has value: 150000
subclass of:
  on property: maxValue
  has value: 199999
comment: This class denotes Annual Income $150,000 to $199,999
notation: 596

pancreas disease
type: Class
subclass of: Thing
comment: This class denotes pancreas disease

Bisulfite Pyrosequencing
type: Class
subclass of: Nucleic Acid Sequencing
comment: This class denotes Bisulfite Pyrosequencing

Pediatric Food Allergy
type: Class
type: Quality Value
type: Node shape
subclass of: DOID 3044
comment: Positive response from birth through age 6 to the question "...has a health care provider said that [CHILD] has food allergies?"
notation: 716

Annual Income $50,000 to $59,999
type: Class
type: Quality Value
type: Node shape
subclass of: Annual Income $50,000 to $74,999
subclass of: HHEAR_01115
subclass of: Annual Income $40,000 to $60,000
subclass of:
  on property: SIO_000900
  has value: year
comment: This class denotes Annual Income $50,000 to $59,999
notation: 593

Howland Island, United States of America
type: geographic region
comment: The state, province, or territory of Howland Island, United States of America
SIO_000313: United States of America

Restaurant
type: Class
type: Quality Value
type: Node shape
subclass of: Workplace
comment: A building within which food and drink are prepared and served to customers in exchange for money or other goods and/or services. (Source: Environment Ontology)
notation: 980

Systemic Inflammatory Response Syndrome
type: Class
subclass of: phenotype
subclass of: Sepsis, Septic Shock, or SIRS
comment: This class denotes Systemic Inflammatory Response Syndrome

Chihuahua, Mexico
type: geographic region
comment: The state, province, or territory of Chihuahua, Mexico
SIO_000313: Q96

Receives Public Assistance
type: Class
type: Node shape
subclass of: Public Assistance Status
subclass of: Restriction
  some values from: Public Assistance
  on property: SIO_000230
comment: This class denotes Receives Public Assistance
disjoint with: Does Not Receive Public Assistance

Annual Income $60,000 to $74,999
type: Class
type: Quality Value
type: Node shape
subclass of: HHEAR_00542
subclass of: Annual Income $50,000 to $74,999
subclass of: Annual Income $60,000 to $100,000
subclass of:
  on property: maxValue
  has value: 74999
subclass of:
  on property: minValue
  has value: 60000
subclass of:
  on property: SIO_000900
  has value: year
subclass of:
  on property: currency
  has value: USD
comment: This class denotes Annual Income $60,000 to $74,999
notation: 594

Residential Building
type: Class
type: Quality Value
type: Quality Variable
subclass of: Human Dwelling
subclass of: Workplace
comment: This class denotes Residential Building
notation: 154

Pediatric Eczema With Itchy Rash
type: Class
type: Quality Value
type: Node shape
subclass of: Eczema
comment: Positive response to "...has a health care provider said that [CHILD] has eczema?" at any time from birth through age 6, PLUS positive response to "...itchy rash which was coming and going but did not completely get better?"
notation: 714

Visited Doctor, ER, or Hospital Due to Asthma
type: Class
type: Quality Value
type: Node shape
subclass of: Asthma Induced Medical Encounter Response
comment: This class denotes Visited Doctor, ER, or Hospital Due to Asthma
notation: 938

Used Only Anti Malarials or No Medications
type: Class
type: Quality Value
subclass of: Prescription Medication and Dietary Supplements
subclass of: Drug Other Than Antimalarial Use
comment: This class denotes Used Only Anti Malarials or No Medications
notation: 139

Lower Respiratory Tract Infection
type: Class
type: Quality Value
subclass of: infection
comment: This class denotes Lower Respiratory Tract Infection
notation: 384

Crowdsourcing
type: Class
type: Node shape
subclass of: data collection
comment: Results of data collected from Crowdsource collection. Social media model for enabling public involvement and recruitment in participation. Use of social media to collect feedback and recruit volunteer subjects. Source: Medical Subject Headings Ontology

Sleep disturbance
type: Class
subclass of: biological quality
comment: This class denotes Sleep disturbance

on property: maxValue
has value: 24999

Biomolecule
type: Class
subclass of: HHEAR_00177
definition: A biospecimen that is composed of molecular entities.

Pediatric Allergic Rhinitis Before Age Six
type: Class
type: Quality Value
type: Node shape
subclass of: Allergic rhinitis
comment: Positive response from birth through age 6 to the question "...has a health care provider said that [CHILD] has hay fever, allergic rhinitis, or allergies involving the eyes or nose?"
notation: 715

Did Not Visit Doctor, ER, or Hospital Due to Asthma
type: Class
type: Quality Value
type: Node shape
subclass of: Asthma Induced Medical Encounter Response
comment: This class denotes Did Not Visit Doctor, ER, or Hospital Due to Asthma
notation: 937

Cockroach
type: Class
type: Node shape
subclass of: SIO_010375
comment: This class denotes Cockroach

Dimethylarsinic Acid
type: Class
type: Facet Value
subclass of: Arsenic Species
comment: This class denotes Dimethylarsinic Acid
notation: DMA

Perfluorooctanesulfonamide
type: Class
type: Facet Value
subclass of: Perfluoroakyl and Polyfluoroalkyl Substance
comment: This class denotes Perfluorooctanesulfonamide
notation: PFOSA

2,3,4,5-Tetrabromobenzoic acid
type: Class
type: Node shape
type: Facet Value
subclass of: brominated flame retardant
comment: 2,3,4,5-Tetrabromobenzoic acid is a member of benzoic acids and an organohalogen compound. (Source: Pubchem)
notation: TBBA

Ages and Stages Adjusted Score
type: Class
type: Node shape
subclass of: Adjusted Score
comment: An adjusted score of an Ages and Stages Questionnaire response, where the derivation is the one documented in this reference: https://www.michaeltaymormd.com/storage/app/media/forms/master-set-asq.pdf

Not Absent Due to Weekend or Vacation
type: Class
type: Quality Value
type: Node shape
subclass of: Asthma Induced School Absenteeism Response
comment: This class denotes Not Absent Due to Weekend or Vacation
notation: 765

type 2 diabetes mellitus
type: Class
type: Quality Value
subclass of: diabetes mellitus
comment: This class denotes type 2 diabetes mellitus
notation: 181

Cotinine (total)
type: Class
type: Facet Value
subclass of: Tobacco Metabolite
comment: This class denotes Cotinine (total)
notation: COTT
editorial note: To Do: align with CHEBI.

Tobacco Smoke Exposure
type: Class
type: Quality Value
type: Facet
subclass of: HHEAR_00062
comment: This class denotes Tobacco Smoke Exposure
notation: 98

Interleukin-5
type: Class
type: Facet Value
subclass of: Protein
subclass of: HHEAR_01389
comment: This class denotes Interleukin-5
notation: IL5

suburb
type: Class
type: Quality Value
type: Node shape
subclass of: urban area
comment: human settlement that is part of/or near to a larger city or town (Source: wikidata.org)
notation: 1079

Screening Test
type: Class
subclass of: Test
comment: This class denotes Screening Test

Interleukin-4
type: Class
type: Facet Value
subclass of: Protein
subclass of: HHEAR_01389
comment: This class denotes Interleukin-4
notation: IL4

polycyclic hydrocarbon
type: Class
type: Facet
subclass of: Targeted Analyte
comment: This class denotes polycyclic hydrocarbon
notation: UPAH

Education Grade 7 or 8
type: Class
type: Quality Value
type: Node shape
subclass of: Education By Highest Grade Attained
subclass of: Some Middle School
subclass of: Class
  union of: Education Grade 7
  union of: HHEAR_01108
comment: This class denotes Education Grade 7 or 8
notation: 811
equivalent class: Class
  equivalent class: Education Grade 7 or 8

tetracosanoic acid
type: Class
type: Facet Value
subclass of: Fatty Acid
notation: C240
definition: A C24 straight-chain saturated fatty acid.

Physician Diagnosed Asthma With Medication or Wheezing
type: Class
type: Quality Value
type: Node shape
subclass of: childhood-onset asthma
comment: Report of physician-diagnosed asthma at any time in the first 6 years of life, PLUS after the 5th birthday a) report of child’s use of any asthma medication OR b) report of wheeze
notation: 721

Asthma Induced Medical Encounter Response
type: Class
type: Node shape
subclass of: Discover Questionnaire Response
comment: This class denotes Asthma Induced Medical Encounter Response

acenaphthene
type: Class
type: Node shape
subclass of: Targeted Analyte
subclass of: CHEBI_51958
comment: A polycyclic aromatic hydrocarbon derived from naphthalene by the addition of an ethylene bridge connecting C-1 and C-8. (Source: ChEBI Ontology)
notation: ACEN

Cousin
type: Class
type: Quality Value
subclass of: Relative
notation: 354
definition: A person belonging to the same extended family.

Tri-Cell DMA-80 Direct Mercury Analyzer
type: Class
subclass of: HHEAR_00056
definition: The DMA-80 is based on the principles of sample thermal decomposition, mercury amalgamation and atomic absorption detection. The DMA-80 has been used to develop the US EPA method 7473 (Mercury in solids and solutions by thermal decomposition, amalgamation, and atomic absorption spectrophotometry). It is furthermore compliant with ASTM method D-6722-01 (Total mercury in coal and coal combustion residues) and ASTM method D-7623-10 (Total mercury in crude oil).
was approved by: PER-Jim-McCusker

Agreement Answer
type: Class
type: Node shape
subclass of: agreement quality
comment: A response about an individual's agreement about something. [Definition Source: NCI]

Carpet
type: Class
type: Node shape
subclass of: Floor Covering
comment: carpet or rug (Source: Wikidata)

liver disease
type: Class
type: Facet
subclass of: Comorbidity Disease
comment: This class denotes liver disease

Trauma Related Hospital Admission
type: Class
type: Quality Value
subclass of: Hospital Admission By Admission Type
subclass of: Restriction
  some values from: injury
  on property: SIO_001157
comment: This class denotes Trauma Related Hospital Admission
notation: 378

Blinded Season 2 Group
type: Class
type: Quality Value
subclass of: Seasonal Population Group
comment: This class denotes Blinded Season 2 Group
notation: 299

Duration of Muscle Relaxant Use
type: Class
type: Quantity Variable
type: Node shape
subclass of: Prescription Medication and Dietary Supplements
subclass of: Duration of Medical Intervention
subclass of: Restriction
  some values from: Uses Muscle Relaxants
  on property: SIO_000215
comment: The length of time a patient is taking muscle relaxants as a medical intervention

Urgent Care Facility Visit
type: Class
type: Node shape
subclass of: Emergency Department or Urgent Care Visit
comment: A visit to an urgent care center to address an acute or emergent medical issue

days per week
type: Class
type: Node shape
subclass of: rate unit
comment: This class denotes days per week

Honduras
type: geographic region
comment: The country of Honduras
SIO_000313: Outside United States

Two Years or More Since Last Birth
type: Class
type: Quality Value
type: Node shape
subclass of: Time Since Last Birth
comment: Two years or more since the subject's last childbirth
notation: 1151

Ruthenium
type: Class
subclass of: Metal
notation: Ru
definition: RUTHENIUM is a hard, brittle, grayish-white rare earth metal with an atomic symbol Ru, atomic number 44, and atomic weight 101.07. It is used as a catalyst and hardener for PLATINUM and PALLADIUM.

milliliter
type: unit of measurement
notation: ml

Detached Umbilical Cord Width
type: Class
type: Quantity Variable
type: Node shape
subclass of: Umbilical Cord Measurement
comment: This class denotes Detached Umbilical Cord Width
intersection of: Class
  complement of: Umbilical Cord Measurement
intersection of: umbilical cord
intersection of: SIO_000042

Tanner Scale For Breast Development
type: Class
type: Node shape
subclass of: Tanner Scale
comment: This class denotes Tanner Scale For Breast Development

rest: nil
first: Restriction
  on property: SIO_000300
  has value: 500.0

Tanner Scale For Genital Development
type: Class
type: Node shape
subclass of: Tanner Scale
comment: This class denotes Tanner Scale For Genital Development

South Dakota, United States of America
type: geographic region
comment: The state, province, or territory of South Dakota, United States of America
SIO_000313: Q186545

Blinded Season 3 Group
type: Class
type: Quality Value
subclass of: Seasonal Population Group
comment: This class denotes Blinded Season 3 Group
notation: 300

sampling
type: Class
subclass of: interacting
comment: Sampling is the act of obtaining a sample, whether through selection, collection or preparation. (SIO Ontology)

biological fluid
type: Class
subclass of: Thing
comment: This class denotes biological fluid

Surgery Related Hospital Admission
type: Class
type: Quality Value
subclass of: Hospital Admission By Admission Type
comment: This class denotes Surgery Related Hospital Admission
notation: 376

Duration of Antibiotic Use
type: Class
type: Quantity Variable
type: Node shape
subclass of: Prescription Medication and Dietary Supplements
subclass of: Duration of Medical Intervention
subclass of: Restriction
  some values from: Uses Antibiotics
  on property: SIO_000215
comment: The length of time a patient receives antibiotic treatment as a medical intervention

Drank Alcohol Sometime Last Week
type: Class
type: Quality Value
type: Node shape
subclass of: Consumed Alcohol
comment: This class denotes drank alcohol sometime last week
notation: 1100

Visited Emergency Department or Urgent Care Facility
type: Quality Value
type: Node shape
type: Class
subclass of: Emergency Department or Urgent Care Visit
comment: Indicates that a subject visited an emergency department or urgent care facility; typically during a specified time period.
notation: 1111

DMPA Use
type: Class
type: Node shape
subclass of: Pharmacotherapy
comment: This attribute is used to indicate the status of a subject's use of the contraceptive Depot Medroxyprogesterone Acetate (DPMA).

Hawaii, United States of America
type: Quality Value
type: NamedIndividual
type: geographic region
comment: state of the United States of America
notation: 1202
SIO_000313: Western United States

Diagnosis Group
type: Class
type: Quality Variable
subclass of: Demographic
subclass of: HHEAR_00549
comment: This class denotes Diagnosis Group

cubic centimeter
type: unit of measurement
notation: cm3

Number of Detatched Cords
type: Class
type: Quantity Variable
type: Node shape
subclass of: SIO_000794
subclass of: Umbilical Cord Measurement
comment: This class denotes Number of Detatched Cords
alternative label: Detached Umbilical Cord Count

plasma indirect bilirubin level
type: Class
subclass of: Clinical Measurement
comment: This class denotes plasma indirect bilirubin level

cerebrospinal fluid
type: Class
subclass of: biological entity
definition: A clear, colorless fluid that is found in the brain and spinal cord.

Duration of Medical Intervention
type: Class
type: Node shape
subclass of: duration
subclass of: Restriction
  some values from: medical intervention
  on property: SIO_000215
comment: The length of time a patient receives some form of medical intervention

Hospital ER Admission
type: Class
type: Quality Value
subclass of: Hospital Admission
subclass of: Restriction
  some values from: Hospital Emergency Room
  on property: SIO_000061
comment: This class denotes an ER admission that results in a hospital admission as well.
notation: 371

Asthma Related Hospitalization
type: Class
type: Quantity Variable
subclass of: Asthma Related Health Encounter
subclass of: Restriction
  some values from: DOID 2841
  on property: SIO_000635
comment: This class denotes Asthma Related Hospitalization

Antigua and Barbuda
type: geographic region
comment: The country of Antigua and Barbuda
SIO_000313: Outside United States

Hospital Admission By Duration
type: Class
type: Node shape
subclass of: Hospital Admission
comment: A subclass of Hospital Admission that facets admissions by their duration.

Age at Menarche
type: Class
type: Quantity Variable
type: Node shape
subclass of: Physical And Mental Assessment
subclass of: age
comment: The age at menarche for a subject

Dioxybenzone
type: Class
type: Facet Value
subclass of: HHEAR_01385
comment: This class denotes Dioxybenzone
notation: BP8

Krieger Racism Scale
type: Class
type: Node shape
subclass of: Questionnaire
subclass of: Research or Clinical Assessment Tool
comment: Instrument conceptualized as measuring self-report experiences of racial discrimination; Combines questions from multiple instruments including the Experiences of Discrimination questionnaire, Williams’ Major and Everyday Discrimination measures, a five-item social desirability scale and additional items on worries, global experiences and formal complaints of discrimination. Source: Krieger N, Smith K, Naishadham D, Hartman C, Barbeau EM. Experiences of discrimination: validity and reliability of a self-report measure for population health research on racism and health. Soc Sci Med. 2005 Oct;61(7):1576-96. doi: 10.1016/j.socscimed.2005.03.006. Epub 2005 Apr 21. PMID: 16005789.

Residential Building With A Large Yard
type: Class
type: Quality Value
type: Node shape
subclass of: Residential Building With A Yard
subclass of: Restriction
  some values from: Large Residential Yard
  on property: SIO_000028
comment: A residential building with a medium yard attached or adjacent to it
notation: 582
equivalent class: Class
  intersection of: Residential Building
  intersection of: Restriction
    some values from: Large Residential Yard
    on property: SIO_000028
  equivalent class: Residential Building With A Large Yard

Hospital Emergency Room
type: Class
subclass of: Emergency Medical Services Facility
subclass of: Restriction
  some values from: Hospital
  on property: SIO_000061
comment: This class denotes Hospital Emergency Room

Duration of Oxygen Treatment
type: Class
type: Quantity Variable
type: Node shape
subclass of: Medical History
subclass of: Duration of Medical Intervention
subclass of: Restriction
  some values from: Oxygen Treatment
  on property: SIO_000215
comment: The length of time a patient is receiving oxygen treatment as a medical intervention

Blinded Season 1 Group
type: Class
type: Quality Value
subclass of: Seasonal Population Group
comment: This class denotes Blinded Season 1 Group
notation: 298

2-(((6-Oxo-2-propylheptyl)oxy)carbonyl)benzoic Acid
type: Class
type: Node shape
type: Facet Value
subclass of: Phthalate
comment: This class denotes 2-(((6-Oxo-2-propylheptyl)oxy)carbonyl)benzoic Acid
notation: MPOHP

Less Than Two Years Since Last Birth
type: Class
type: Quality Value
type: Node shape
subclass of: Time Since Last Birth
comment: Less than two years since the subject's last childbirth
notation: 1150

central nervous system infection
type: Class
type: Quality Value
subclass of: infection
comment: This class denotes central nervous system infection
notation: 402

Hours Per Week
type: Class
type: Node shape
subclass of: Temporal Frequency
comment: A unit of measurement equal to the number of hours within a period of time equal to one week. (Source: NCI Thesaurus)

liter
type: unit of measurement
notation: L

Preschool-age Children's Physical Activity Questionnaire
type: Class
type: Node shape
subclass of: Questionnaire
comment: The Preschool-age Children's Physical Activity Questionnaire (Pre-PAQ) was designed to measure activity of preschool-age children in the home environment in population studies. Reference: The validity and reliability of a home environment preschool-age physical activity questionnaire (Pre-PAQ) Genevieve M Dwyer, Louise L Hardy, Jennifer K Peat & Louise A Baur International Journal of Behavioral Nutrition and Physical Activity volume 8, Article number: 86 (2011) https://ijbnpa.biomedcentral.com/articles/10.1186/1479-5868-8-86

interacting
type: Class
subclass of: process
comment: Interacting is a process characterized by the interaction between two or more entities. (Source: SIO Ontology)

Gestational Age From 20 to 28 Weeks
type: Class
type: Quality Value
type: Node shape
subclass of: Gestational Age
comment: The gestational age range of a fetus beginning at the start of week 20 and ending immediately before the beginning of week 28
notation: 700

NIAMS
type: Class
type: Node shape
subclass of: Funding Institute
comment: The National Institute of Arthritis and Musculoskeletal and Skin Diseases

Pediatric Intensive Care Unit
type: Class
type: Quality Value
subclass of: Intensive Care Unit
comment: This class denotes Pediatric Intensive Care Unit
notation: 689

WHO Weighted Z-Score
type: Class
type: Quantity Variable
subclass of: SIO_001245
subclass of: HHEAR_00036
subclass of: Birth Weight Z-Score
definition: Derived from Birth Weight, Gestational Age, and Child Sex
was approved by: PER-Jeanette-Stingone

Hospital Discharge By Oxygen Use
type: Class
type: Quality Variable
type: Node shape
subclass of: Hospital Discharge
comment: A subclass of ICU Discharge; this class differentiates between whether or not a patient is discharged from a hospital on oxygen.

Legally Acceptable Representative
type: Class
type: Quality Value
type: Node shape
subclass of: SIO_000287
comment: An individual or juridical or other body authorized under applicable law to consent, on behalf of a prospective subject, to the subject's participation in the clinical trial. (ICH) (Source: NCI Thesaurus)
notation: 1117
alternative label: Legally Authorized Representative

geographic region
type: Class
type: Node shape
type: Facet Category
subclass of: Location
comment: 2D or 3D defined space on something, mainly in terrestrial and astrophysics sciences

Residential Building With A Small Yard
type: Class
type: Quality Value
type: Node shape
subclass of: Residential Building With A Yard
subclass of: Restriction
  some values from: Small Residential Yard
  on property: SIO_000028
comment: A residential building with a small yard attached or adjacent to it
notation: 585
equivalent class: Class
  equivalent class: Residential Building With A Small Yard

Multidimensional Scale of Perceived Social Support
type: Class
type: Node shape
subclass of: Questionnaire
subclass of: Research or Clinical Assessment Tool
comment: Source: Zimet, G. D., Dahlem, N. W., Zimet, S. G., & Farley, G. K. (1988). The multidimensional scale of perceived social support. Journal of personality assessment, 52(1), 30-41.

Dominican Republic
type: geographic region
comment: The country of Dominican Republic
SIO_000313: Outside United States

Time Since Last Birth
type: Class
type: Node shape
subclass of: duration
comment: The elapsed time since the last time a person gave birth

penicillin
type: Class
type: Node shape
subclass of: chemical entity
comment: Any member of the group of substituted penams containing two methyl substituents at position 2, a carboxylate substituent at position 3 and a carboxamido group at position 6.

microbiome richness
type: Class
type: Quantity Variable
subclass of: SIO_000052
subclass of: Physical And Mental Assessment
subclass of: HHEAR_00549
subclass of: community species diversity
comment: Microbiome richness is the total number of bacterial species in a microbiome.

Hospital Discharge Not On Oxygen
type: Class
type: Quality Value
type: Node shape
subclass of: Hospital Discharge By Oxygen Use
subclass of: Class
comment: An event in which a patient is discharged from a hospital and is not given oxygen treatment.
notation: 440
equivalent class: Class
  intersection of: Hospital Discharge
  intersection of: Class
    complement of: Restriction
      some values from: Oxygen Treatment
      on property: SIO_000250
  equivalent class: Hospital Discharge Not On Oxygen
disjoint with: Hospital Discharge On Oxygen

Residential Building With A Medium Yard
type: Class
type: Quality Value
type: Node shape
subclass of: Residential Building With A Yard
subclass of: Restriction
  some values from: Medium Residential Yard
  on property: SIO_000028
comment: A residential building with a medium yard attached or adjacent to it
notation: 586
equivalent class: Class
  equivalent class: Residential Building With A Medium Yard

Pregnancy Experience Scale
type: Class
type: Node shape
subclass of: Questionnaire
subclass of: Research or Clinical Assessment Tool
comment: “The Pregnancy Experience Scale measures daily stressors women may experience during pregnancy (DiPietro et al., 2004). The brief version of the scale (PES-Brief) contains 20 items representing the most frequently endorsed hassles and uplifts from the 41-item original scale (DiPietro, Christensen, & Costigan, 2008). Each item is rated on a 4-point Likert scale with values of 0 to 3. The items are combined into a set of six scores: frequency of hassles,frequency of uplifts, intensity of hassles, intensity of uplifts, hassle:uplift frequency ratio, andhassle:uplift intensity ratio. DiPietro, Christensen, & Costigan (2008) reported that the hassleand uplift scales demonstrated acceptable internal consistency reliability with Cronbach’s alphasof 0.83 and 0.82, respectively. Test-retest reliability of the scales ranged from 0.63 to 0.73. ThePES-Brief scores were significantly correlated with the STAI, Center for Epidemiologic Studies-Depression scale (CES-D; Radloff, 1977), and the World Health Organization five-item wellbeingindex (WHO-5), supporting the convergent validity of the scale.” Source: DiPietro JA, Christensen AL, & Costigan KA (2008). The pregnancy experience scale-brief version. JPsychosom Obstet Gynaecol, 29(4), 262-267.

ICU Discharge By Oxygen Use
type: Class
type: Node shape
subclass of: ICU Discharge
comment: A subclass of ICU Discharge; this class differentiates between whether or not a patient is discharged from the ICU on oxygen.

cis-vaccenic acid
type: Class
type: Facet Value
subclass of: Fatty Acid
notation: C181N7
definition: The cis isomer of vaccenic acid.

Cannabis Consumption
type: Class
type: Node shape
subclass of: NBO_0001845
comment: This class denotes cannabis consumption

One Month Prior to Followup
type: Class
type: Node shape
subclass of: time interval
subclass of: Restriction
  some values from: HHEAR_00554
  on property: intervalMeets
comment: A time interval that begins one month prior to a study follow-up and ends at the beginning of the study follow-up.

Residential Building Without A Yard
type: Class
type: Quality Value
type: Node shape
subclass of: Residential Building Without A Private Yard
subclass of: Class
  complement of: Restriction
    some values from: Residential Yard
    on property: SIO_000028
comment: A residential building that does not have a yard attached or adjacent to it
notation: 588
equivalent class: Class
  equivalent class: Residential Building Without A Yard
disjoint with: Residential Building With A Yard

Obesity
type: Class
type: Quality Value
subclass of: Body Weight Quality
subclass of: DOID 9970
comment: Accumulation of substantial excess body fat.
notation: 63

Alternaria
type: Class
subclass of: Fungus
comment: A genus of dematiaceous fungi within the phylum Ascomycota that are ubiquitous in nature and are common allergens in humans. Members of the Alternaria genus produce septate, brown and filamentous hyphae, and may cause opportunistic infections in immunocompromised individuals, such as phaeohyphomycosis, onychomycosis, sinusitis, ulcerated cutaneous infections, keratitis, visceral infections and osteomyelitis. (Source: NCI Thesaurus)

Guanajuato, Mexico
type: geographic region
comment: The state, province, or territory of Guanajuato, Mexico
SIO_000313: Q96

2-hydroxychrysene
type: Class
type: Facet Value
subclass of: polycyclic hydrocarbon
comment: This class denotes 2-hydroxychrysene
notation: CHRY2

Metalloproteinase inhibitor 1
type: Class
type: Facet Value
subclass of: Protein
subclass of: HHEAR_01389
comment: This class denotes Metalloproteinase inhibitor 1
notation: TIMP1

Triisobutyl phosphate
type: Class
type: Node shape
subclass of: HHEAR_01372
comment: Tri-isobutylphosphate is a trialkyl phosphate. (Source: PubChem)
notation: TINP

Ventilator Free Respiration
type: Class
subclass of: NCIT C17091
comment: Resipration that is not aided by a mechanical ventilator.
equivalent class: Class
  intersection of: NCIT C17091
  intersection of: Class
    complement of: Restriction
      some values from: invasive mechanical ventilation
      on property: SIO_001157
  equivalent class: Ventilator Free Respiration
disjoint with: Invasive Mechanical Ventilator Assisted Respiration

ICU Discharge Not On Oxygen
type: Class
type: Quality Value
type: Node shape
subclass of: ICU Discharge By Oxygen Use
subclass of: Class
  complement of: Restriction
    some values from: Oxygen Treatment
    on property: SIO_000250
comment: An event in which a patient is discharged from an intensive care unit and is not given oxygen treatment.
notation: 439
equivalent class: Class
  intersection of: ICU Discharge
  intersection of: Class
    complement of: Restriction
      some values from: Oxygen Treatment
      on property: SIO_000250
  equivalent class: ICU Discharge Not On Oxygen
disjoint with: ICU Discharge On Oxygen

WHO Child Growth Standard
type: Class
type: Node shape
subclass of: line graph
comment: This class denotes WHO Child Growth Standard, taken from https://www.who.int/tools/child-growth-standards/standards/weight-for-age

Dominica
type: geographic region
comment: The country of Dominica
SIO_000313: Outside United States

Residential Building Without A Private Yard
type: Class
type: Quality Value
type: Node shape
subclass of: Residential Building
comment: A residential building that has an attached or adjacent yard that is not private
notation: 589

Connor Davidson Resilience Scale
type: Class
type: Node shape
subclass of: Questionnaire
subclass of: Research or Clinical Assessment Tool
comment: "Resilience may be viewed as a measure of stress coping ability and, as such, could be an important target of treatment in anxiety, depression, and stress reactions. We describe a new rating scale to assess resilience. The Connor-Davidson Resilience scale (CD-RISC) comprises of 25 items, each rated on a 5-point scale (0–4), with higher scores reflecting greater resilience." Source: DEVELOPMENT OF A NEW RESILIENCE SCALE: THE CONNOR-DAVIDSON RESILIENCE SCALE (CD-RISC) Kathryn M. Connor, M.D., and Jonathan R.T. Davidson, M.D.

environment
type: Class
subclass of: Thing
comment: This class denotes environment

Kitchen
type: Class
type: Node shape
subclass of: Room
subclass of: Living Room or Child's Bedroom or Kitchen
comment: This class denotes Kitchen

formazin nephelometric unit
type: unit of measurement
notation: FNU

Chief Complaint
type: Class
type: Quality Variable
subclass of: HHEAR_00549
comment: This class denotes Chief Complaint

biological entity
type: Class
subclass of: Thing
comment: This class denotes biological entity

Study Indicator
type: Class
subclass of: Thing
comment: This class denotes Study Indicator

nulliparous
type: Class
subclass of: Thing
comment: A viviparous organism having never given birth. (Source: Phenotype and Trait Ontology)
notation: 62

Two Months Prior to Followup 2
type: Class
type: Node shape
subclass of: duration
subclass of: Restriction
  some values from: Study Followup 2
  on property: intervalMeets
comment: This class denotes Two Months Prior to Followup 2

PCB180
type: Class
type: Facet Value
subclass of: Polychlorobiphenyl
comment: This class denotes PCB180
notation: PCB180

cubic centimeter per mole
type: unit of measurement
notation: cm3/mol

Intrauterine growth retardation
type: Class
type: Quality Value
type: Node shape
subclass of: phenotype
comment: Intrauterine growth restriction is a newer term that is preferred over Intrauterine growth retardation. The causes of IUGR include maternal abnormalities (chronic hypertension, cyanotic heart disease, smoking, drug abuse), placental or umbilical cord abnormalities (including placenta previa and cord anomalies), maternal medicationas, and genetic disorders of the fetus. An abnormal restriction of fetal growth with fetal weight below the tenth percentile for gestational age. (Source: Human Phenotype Ontology)
notation: 921

Interleukin-17A
type: Class
type: Facet Value
subclass of: Protein
subclass of: HHEAR_01389
comment: This class denotes Interleukin-17A
notation: IL17A

device
type: Class
subclass of: Thing
comment: This class denotes device

Site 4
type: Class
type: Quality Value
type: Node shape
subclass of: SEARCH Population Group
comment: Jensen Blinded Population Group #4
notation: 804

Preschool
type: Class
type: Quality Value
subclass of: Education By Highest Grade Attained
notation: 112
definition: Finished preschool.

Distance From Umbilical Cord To Placental Edge
type: Class
type: Quantity Variable
type: Node shape
subclass of: SIO_000041
subclass of: Umbilical Cord Measurement
comment: The distance from the umbilical cord to the edge of the placenta. Normally, the umbilical cord is attached to the center of the placenta, but unusual placements can occur. Marginal cord insertion occurs when the umbilical cord is within two centimeters or less from the edge of the placenta. The umbilical cord is still attached, just not in the center. Source: https://my.clevelandclinic.org/health/diseases/23318-marginal-cord-insertion

Difference of POPC Scores
type: Class
type: Quantity Variable
subclass of: Physical And Mental Assessment
subclass of: HHEAR_00054
comment: The arithemetic difference of two Pediatric Overall Performance Category scores.

United States of America
type: geographic region
comment: The country of United States of America
SIO_000313: Q2

fat intake measurement
type: Class
type: Node shape
subclass of: diet measurement
comment: Quantification of the fat intake of an individual. (Source: Experimental Factors Ontology)

Annulled
type: Class
type: Quality Value
subclass of: NCIT C51774
notation: 43
definition: A marital status in which a voidable marriage is legally declared null and void, as though it never existed. Specific grounds for annullment vary within the presiding jurisdiction, whether geographic or religious.

PCB99
type: Class
type: Facet Value
subclass of: Polychlorobiphenyl
comment: CAS Number: 38380-01-7
notation: PCB99

Two Months Prior to Baseline
type: Class
type: Node shape
subclass of: duration
subclass of: Restriction
  some values from: Study Baseline
  on property: intervalMeets
comment: This class denotes Two Months Prior to Baseline

turns per second
type: unit of measurement
notation: 1/s

calculated body weight estimate
type: Class
subclass of: Thing
comment: This class denotes calculated body weight estimate

Transplantation
type: Class
type: Quality Value
subclass of: Comorbidity Disease
comment: This class denotes Transplantation
notation: 401

Palmyra Atoll, United States of America
type: geographic region
comment: The state, province, or territory of Palmyra Atoll, United States of America
SIO_000313: United States of America

Benzophenone-1
type: Class
type: Facet Value
subclass of: Benzophenone
comment: This class denotes Benzophenone-1
notation: BP1

Interlocutory Marital Status
type: Class
type: Quality Value
subclass of: Marital Status
notation: 44
definition: The condition existing when an order or judgement is considered temporary until either a specified period of time has passed or specific information is provided to assist in rendering a permanent decision.

Flow-Mediated Vasodilation
type: Class
type: Node shape
subclass of: Physical And Mental Assessment
comment: The percent change in arterial vessel diameter in response to an increase in blood flow caused by mechanical or chemical stimuli, which is usually measured using ultrasound-based methods. This measurement can reflect the functionality of the endothelium in the observed blood vessels. (Source: NCI Thesaurus)

Belgium
type: geographic region
comment: The country of Belgium
SIO_000313: Outside United States

PCB153
type: Class
type: Facet Value
subclass of: Polychlorobiphenyl
comment: This class denotes PCB153
notation: PCB153

Two Months Prior to Followup
type: Class
type: Node shape
subclass of: duration
subclass of: Restriction
  some values from: HHEAR_00554
  on property: intervalMeets
comment: This class denotes Two Months Prior to Followup

kilogram meter per second
type: unit of measurement
notation: kg.m/s

Large Residential Yard
type: Class
type: Node shape
subclass of: Residential Yard
comment: This class denotes Large Residential Yard

Pediatric Overall Performance Category
type: Class
subclass of: Physical And Mental Assessment
comment: Reference: POPC/PCPC Reference: Fiser HD, Tilford JM, Roberson PK. Relationship of illness severity and length of stay to functional outcomes in the pediatric intensive care unit. Critical Care Medicine 2000. 28(4):1173-1179.

Wyoming, United States of America
type: geographic region
comment: The state, province, or territory of Wyoming, United States of America
SIO_000313: Western United States

Benzyl butyl phthalate
type: Class
type: Node shape
subclass of: Targeted Analyte
comment: Butylbenzyl phthalate is a benzyl ester. (Source: ChEBI Ontology)
notation: BBP

2, 2', 4, 4'-tetrahydroxybenzophenone
type: Class
type: Facet Value
subclass of: HHEAR_01385
comment: This class denotes 2, 2', 4, 4'-tetrahydroxybenzophenone
notation: BP2

Luxembourg
type: geographic region
comment: The country of Luxembourg
SIO_000313: Outside United States

Nickel
type: Class
type: Facet Value
subclass of: Metal
subclass of: HHEAR_01387
notation: Ni
definition: NICKEL is a trace element with the atomic symbol Ni, atomic number 28, and atomic weight 58.69. It is a cofactor of the enzyme UREASE.

toxoplasmosis
type: Class
type: Quality Value
subclass of: coccidiosis
comment: This class denotes toxoplasmosis
notation: 1073

PCB85 + PCB120
type: Class
type: Facet Value
subclass of: Polychlorobiphenyl
comment: CAS Number: 65510-45-4_68194-12-7
notation: PCB85_PCB120

Outdoor Pesticide Usage Exposure
type: Class
type: Quality Variable
type: Node shape
subclass of: Pesticide Usage Exposure
comment: Exposure to pesticides that occurs from their usage outdoors.

meter per second
type: unit of measurement
notation: m/s

mean corpuscular volume
type: Class
subclass of: SIO_000049
comment: This class denotes mean corpuscular volume

Difference of PCPC Scores
type: Class
type: Quantity Variable
subclass of: Physical And Mental Assessment
subclass of: HHEAR_00054
subclass of: Restriction
  some values from: Class
  on property: SIO_000008
comment: The arithemetic difference of two Pediatric Cerebral Performance Category scores.

2,2'-Dihydroxy-4,4'-dimethoxybenzophenone
type: Class
type: Node shape
type: Facet Value
subclass of: HHEAR_01385
comment: This class denotes 2,2'-Dihydroxy-4,4'-dimethoxybenzophenone
notation: BP6

Protein
type: Class
subclass of: HHEAR_00034
comment: This class denotes Protein

Finland
type: geographic region
comment: The country of Finland
SIO_000313: Outside United States

PCB90 + PCB101 + PCB89
type: Class
type: Facet Value
subclass of: Polychlorobiphenyl
comment: This class denotes a polychlorobiphenyl compound identified by the CAS Number: 68194-07-0_37680-73-2_73575-57-2
notation: PCB90_101_89

Morelos, Mexico
type: geographic region
comment: The state, province, or territory of Morelos, Mexico
SIO_000313: Q96

Indoor Pesticide Usage Exposure
type: Class
type: Quality Variable
type: Node shape
subclass of: Pesticide Usage Exposure
comment: Exposure to pesticides that occurs from their usage indoors.

cubic meter per kilogram
type: unit of measurement
notation: m3/kg

Small Residential Yard
type: Class
type: Node shape
subclass of: Residential Yard
comment: This class denotes Small Residential Yard

NIEHS
type: Class
type: Facet
subclass of: Funding Institute
comment: This class denotes NIEHS

Montana, United States of America
type: geographic region
comment: The state, province, or territory of Montana, United States of America
SIO_000313: Western United States

CAUTI or CLABSI or VAP
type: Class
type: Quality Value
subclass of: hospital-acquired infection
comment: This class denotes CAUTI or CLABSI or VAP
notation: 362
equivalent class: Class
  union of: catheterization associated UTI
  union of: Central Line Infection
  equivalent class: CAUTI or CLABSI or VAP

Duration of Medical Procedure
type: Class
type: Node shape
subclass of: Medical History
subclass of: duration
subclass of: Restriction
  some values from: medical procedure
  on property: SIO_000215
comment: The length of time a patient undergoes a medical procedure

Hotel
type: Class
type: Quality Value
type: Node shape
subclass of: Workplace
comment: A building which 1) containing multiple dwellings of pre-furnished accommodation and 2) is rented on a short term and/or longer-term basis. (Source: Environment Ontology)
notation: 974

Recruited In Nicaragua
type: Class
type: Quality Value
type: Node shape
subclass of: Population Group by Recruitment Location
subclass of: Restriction
  on property: SIO_000668
  has value: Nicaragua
comment: A population group of study participants that were recruited in Nicaragua
notation: 910

PCB73 + PCB95
type: Class
type: Facet Value
subclass of: Polychlorobiphenyl
comment: CAS Number: 74338-23-1_38379-99-6
notation: PCB73_PCB95

Sweden
type: geographic region
comment: The country of Sweden
SIO_000313: Outside United States

Digestive System Disorder
type: Class
type: Quality Value
subclass of: Disease
comment: This class denotes Digestive System Disorder
notation: 392

cubic meter
type: unit of measurement
notation: m3

Duration of Vasopressor Agent Therapy
type: Class
type: Quantity Variable
type: Node shape
subclass of: Duration of Medical Procedure
subclass of: Restriction
  some values from: vasopressor agent therapy
  on property: SIO_000215
comment: The length of time a patient undergoes vasopressor agent therapy

Medium Residential Yard
type: Class
type: Node shape
subclass of: Residential Yard
comment: This class denotes Medium Residential Yard

Pediatric Cerebral Performance Category
type: Class
subclass of: Physical And Mental Assessment
comment: Reference: POPC/PCPC Reference: Fiser HD, Tilford JM, Roberson PK. Relationship of illness severity and length of stay to functional outcomes in the pediatric intensive care unit. Critical Care Medicine 2000. 28(4):1173-1179.

Denmark
type: geographic region
comment: The country of Denmark
SIO_000313: Outside United States

Smoking Status By Last Occurrence
type: Class
type: Node shape
subclass of: Smoking Status
comment: This class denotes Smoking Status By Last Occurrence

rs2816316
type: Class
type: Node shape
subclass of: SNP
comment: This class denotes rs2816316

4-Fluoro-3-phenoxybenzoic acid
type: Class
type: Node shape
type: Facet Value
subclass of: HHEAR_01374
comment: This class denotes 4-Fluoro-3-phenoxybenzoic acid
notation: FPBA

PCB74 + PCB61
type: Class
type: Facet Value
subclass of: Polychlorobiphenyl
comment: CAS Number: 32690-93-0_33284-53-6
notation: PCB74_PCB61

Pharmacotherapy
type: Class
type: Quality Variable
subclass of: Prescription Medication and Dietary Supplements
subclass of: Medical Therapy Procedure
comment: This class denotes Pharmacotherapy

hematocrit
type: Class
subclass of: ratio
comment: This class denotes hematocrit

Adjusted Score
type: Class
type: Node shape
subclass of: score
comment: A single score that is derived from a test or an observation and that has been transformed or altered.
disjoint with: Raw Score

Not Absent Due to Asthma
type: Class
type: Quality Value
type: Node shape
subclass of: Asthma Induced School Absenteeism Response
comment: This class denotes Not Absent Due to Asthma
notation: 764

Poland
type: geographic region
comment: The country of Poland
SIO_000313: Outside United States

Eats Canned Food
type: Class
type: Quality Value
subclass of: Eating or Drinking
subclass of: food packaging
subclass of: Restriction
  some values from: Canned Food Product
  on property: SIO_000230
comment: The act of eating food that has been packaged in a metal container.
notation: 9
was approved by: PER-Jeanette-Stingone

Ultra Performance Liquid Chromatography - Mass Spectrometer
type: Class
subclass of: Mass Spectrometer
subclass of: Ultra High Performance Liquid Chromatography Instrument
comment: This class denotes Ultra Performance Liquid Chromatography - Mass Spectrometer
was approved by: PER-Jim-McCusker

Tandem Mass Spectrometer
type: Class
subclass of: Mass Spectrometer
definition: Tandem mass spectrometry, also known as MS/MS or MS2, involves multiple steps of mass spectrometry selection, with some form of fragmentation occurring in between the stages. In a tandem mass spectrometer, ions are formed in the ion source and separated by mass-to-charge ratio in the first stage of mass spectrometry (MS1). Ions of a particular mass-to-charge ratio (precursor ions) are selected and fragment ions (product ions) are created by collision-induced dissociation, ion-molecule reaction, photodissociation, or other process. The resulting ions are then separated and detected in a second stage of mass spectrometry (MS2).
was approved by: PER-Jim-McCusker

Fluticasone/salmeterol HFA(Advair HFA)
type: Class
subclass of: Asthma Controller Medication
comment: This class denotes Fluticasone/salmeterol HFA(Advair HFA)

hours per day
type: Class
type: Node shape
subclass of: rate unit
comment: This class denotes hours per day

placenta weight
type: Class
type: Quantity Variable
subclass of: Physical And Mental Assessment
comment: This class denotes placenta weight

surface area
type: Class
subclass of: Thing
comment: This class denotes surface area

Vital Statistics
type: Class
type: Node shape
subclass of: record
comment: Government records of live births, fetal deaths, marriages, divorces, and deaths that occur within that jurisdiction. (Source: NCI Thesaurus)

High Fat Diet With Daily Saturated Fat Calories > 10% Total
type: Class
type: Quality Value
subclass of: HHEAR_00053
subclass of: Dietary Calories Measurement
comment: A category where the mass percentage of daily uptake of calories that is contained in the average total daily saturated fat intake where the value is > 10.0 percent.
notation: 809
equivalent class: Class
  intersection of: food calorie intake rate
  equivalent class: High Fat Diet With Daily Saturated Fat Calories > 10% Total

Vitamin D Intervention Group
type: Class
type: Quality Value
type: Node shape
subclass of: Experimental Group
comment: This class denotes Vitamin D Intervention Group
notation: 720

Absent Due to Asthma
type: Class
type: Quality Value
type: Node shape
subclass of: Asthma Induced School Absenteeism Response
comment: This class denotes Absent Due to Asthma
notation: 762

Childhood Period
type: Class
subclass of: Childhood
subclass of: Restriction
  on property: SIO_000668
definition: The age span ranging from birth to adolescence

Lithuania
type: geographic region
comment: The country of Lithuania
SIO_000313: Outside United States

Term Birth
type: Class
type: Quality Value
subclass of: Birth Outcome By Gestational Age
comment: This class denotes Term Birth
notation: 97
disjoint with: Preterm Birth

diisononyl phthalate
type: Class
type: Node shape
subclass of: Phthalate
comment: The diisononyl ester of benzene-1,2-dicarboxylic acid. (Source: ChEBI Ontology)
notation: DINP

Blood Component
type: Class
subclass of: HHEAR_00177
definition: A derivable component of whole blood.

placenta morphological measurement
type: Class
subclass of: Thing
comment: This class denotes placenta morphological measurement

Education Grade 5 or 6
type: Class
type: Quality Value
type: Node shape
subclass of: Education By Highest Grade Attained
subclass of: Some Middle School
subclass of: Class
comment: This class denotes Education Grade 5 or 6
notation: 810
equivalent class: Class
  union of: Education Grade 5
  union of: Education Grade 6
  equivalent class: Education Grade 5 or 6

max exclusive: 25

Asthma Induced School Absenteeism Response
type: Class
type: Node shape
subclass of: Discover Questionnaire Response
comment: This class denotes Asthma Induced School Absenteeism Response

Italy
type: geographic region
comment: The country of Italy
SIO_000313: Outside United States

Step
type: Class
subclass of: Non-Biological Relative
definition: A stepfamily is a family where at least one parent has children that are not genetically related to the other spouse or partner. Either one parent may have children from a previous relationship. Children in a stepfamily may live with one biological parent, or they may live with each biological parent for a period of time. In addition, visitation rights mean that children in stepfamilies often have contact with both biological parents, even if they permanently live with only one. A child is referred to as the stepchild, stepdaughter or stepson of their biological parent's new spouse, and that person as the stepparent, stepfather or stepmother of the child. A stepfather is the husband of one's mother, and not one's biological father. A stepmother is the wife of one's father, and not one's biological mother. A step-grandmother is the wife of one's grandfather, and not one's biological grandmother. A step-grandfather is the husband of one's grandmother, and not one's biological grandfather. Similarly, a stepbrother is the son of a stepparent who one is not biologically related to. A stepsister is the daughter of a stepparent to whom one is not biologically related. A step-grandson is the son of a stepson or stepdaughter who one is not biologically related to. A step-granddaughter is the daughter of a stepson or stepdaughter who one is not biologically related. A parent's spouse of the same sex may also count as a stepparent.

Benzophenone-3
type: Class
type: Facet Value
subclass of: CHEBI_33853
notation: BP3
definition: Oxybenzone is a benzophenone derivative used as a sunscreen agent. Oxybenzone absorbs UVB and UVA II rays, resulting in a photochemical excitation and absorption of energy. Upon return to ground state, the absorbed energy results in emission of longer wavelength radiation and decreased skin penetration of radiation which reduces the risk of DNA damage.
editorial note: Duplicate of OXB?

SpectraMax Plus 384 Microplate Reader
type: Class
subclass of: Microplate Reader
definition: Get absorbance measurements from 190 to 1000 nm quickly for samples in test tubes, cuvettes, and 96- or 384-well microplates. The SpectraMax® Plus 384 Microplate Reader gives you walk-up convenience for both standard spectrophotometer and microplate reader applications on the same instrument. Monochromator wavelength selection saves you the time and trouble of ever having to change out filters. Typical applications for this powerful reader include DNA and RNA quantification, enzyme kinetic assays, and ELISA based assays. When your project is ready for high throughput, take advantage of StakMax® automated microplate handling compatibility for full robotic integration.
was approved by: PER-Jim-McCusker

Switzerland
type: geographic region
comment: The country of Switzerland
SIO_000313: Outside United States

Mass Spectrometry
type: Class
subclass of: Thing
comment: This class denotes Mass Spectrometry

scoliosis
type: Class
subclass of: phenotype
subclass of: Scoliosis or Spinal Surgery
comment: This class denotes scoliosis

Saturated Fat Calorie Intake Daily Rate
type: Class
subclass of: HHEAR_00053
subclass of: food calorie intake measurement
subclass of: food calorie intake rate
subclass of: Dietary Calories Measurement
subclass of: Class
  intersection of: Restriction
    some values from: Average Daily Total Saturated Fatty Acid Intake
    on property: AFX_0001049
  intersection of: mass percentage
comment: The mass percentage of daily uptake of calories that is contained in the average total daily fat intake.

Coahuila, Mexico
type: geographic region
comment: The state, province, or territory of Coahuila, Mexico
SIO_000313: Q96

Prenatal Questionnaire (PNQ)
type: Class
type: Node shape
subclass of: Questionnaire
comment: The Prenatal Questionnaire (PNQ) was adapted from the Self-Administered Questionnaire (SAQ) developed within the Indian Health Service in 1997 [14] to meet the special needs of the Northern Plains Indians. The 36 items included in the PNQ queries the extent of alcohol use before and during pregnancy, along with the potential risk factors and demographic information. Source: Leonardson, G.R., Loudenburg, R. & Struck, J. Factors predictive of alcohol use during pregnancy in three rural states. Behav Brain Funct 3, 8 (2007). https://doi.org/10.1186/1744-9081-3-8

Absent Part of the Day Due to Asthma
type: Class
type: Node shape
subclass of: Asthma Induced School Absenteeism Response
comment: This class denotes Absent Part of the Day Due to Asthma

Technical Post Junior College
type: Class
type: Quality Value
subclass of: HHEAR_00424
notation: 93
definition: Attended a Technical Post Junior College
was approved by: PER-Jeanette-Stingone

Biological Relative
type: Class
subclass of: Relative
definition: Being from the same biological kinship as another person. In that aspect, consanguinity is the quality of being descended from the same ancestor as another person.

Subject
type: Class
subclass of: SIO_000016
definition: A living individual about whom a research investigator (whether a professional or a student) obtains data through 1) intervention or interaction with the individual, or 2) identifiable private information
was approved by: PER-Jeanette-Stingone

New Brunswick, Canada
type: geographic region
comment: The state, province, or territory of New Brunswick, Canada
SIO_000313: Canada

Low Fat Diet With Daily Saturated Fat Calories <= 10% Total
type: Class
type: Quality Value
subclass of: HHEAR_00053
subclass of: Dietary Calories Measurement
comment: A category where the mass percentage of daily uptake of calories that is contained in the average total daily saturated fat intake where the value is <= 10.0 percent.
notation: 808
equivalent class: Class
  intersection of: food calorie intake rate
  intersection of: Restriction
    some values from: Average Daily Total Saturated Fatty Acid Intake
    on property: AFX_0001049
  intersection of: mass percentage
  intersection of: Restriction
    some values from: Datatype
      with restrictions:
        max inclusive: 10.0
      on datatype: float
    on property: value
  equivalent class: Low Fat Diet With Daily Saturated Fat Calories <= 10% Total

gamma-tocopherol
type: Class
type: Node shape
type: Facet Value
subclass of: HHEAR_01390
comment: This class denotes gamma-tocopherol
notation: GTOC

Abnormal nervous system physiology
type: Class
type: Quality Value
subclass of: phenotype
comment: This class denotes Abnormal nervous system physiology
notation: 352

Chile
type: geographic region
comment: The country of Chile
SIO_000313: Outside United States

Some High School
type: Class
type: Quality Value
subclass of: High School or Less
notation: 87
definition: Education Level of Some High School
was approved by: PER-Jeanette-Stingone

Adolescent Period
type: Class
subclass of: NCIT C39298
definition: The age span ranging from adolescence to adulthood

Woken Up By Asthma More Than Once Overnight
type: Class
type: Quality Value
type: Node shape
subclass of: some of the time
subclass of: Asthma Induced Sleeplessness Response
comment: This class denotes Woken Up By Asthma More Than Once Overnight
notation: 760

Low Fat Diet With Daily Fat Calories <= 35% of Total
type: Class
type: Quality Value
subclass of: HHEAR_00053
subclass of: Dietary Calories Measurement
comment: A category where the mass percentage of daily uptake of calories that is contained in the average total daily fat intake where the value is <= 35.0 percent.
notation: 806

Kept Awake By Asthma All Night
type: Class
type: Quality Value
type: Node shape
subclass of: Asthma Induced Sleeplessness Response
comment: This class denotes Kept Awake By Asthma All Night
notation: 761

rest: nil
first: Restriction
  on property: SIO_000300
  all values from: Datatype
    with restrictions:
      min exclusive: 25
    on datatype: integer

Some Middle School
type: Class
type: Quality Value
subclass of: High School or Less
notation: 90
definition: Attended Some Middle School
was approved by: PER-Jeanette-Stingone

Advanced Graduate Degree
type: Class
type: Quality Value
subclass of: HHEAR_01238
notation: 4
definition: Having earned a pos-baccalaureate degree

Shotgun Lipidomics
type: Class
subclass of: HHEAR_00061
comment: This class denotes Shotgun Lipidomics

High Fat Diet With Daily Fat Calories > 35% Total
type: Class
type: Quality Value
subclass of: HHEAR_00053
subclass of: Dietary Calories Measurement
comment: A category where the mass percentage of daily uptake of calories that is contained in the average total daily fat intake where the value is >35.0 percent.
notation: 807

Site 5
type: Class
type: Quality Value
type: Node shape
subclass of: SEARCH Population Group
comment: Jensen Blinded Population Group #5
notation: 805

SIO_010048
type: Quality Value
type: Facet
notation: 111

data collection
type: Class
subclass of: Thing
comment: This class denotes data collection

cells per microliter
type: unit of measurement
notation: cp/µl

4-(methlynitrosamino)-1-(3-pyridyl)-1-butanol
type: Class
type: Facet Value
subclass of: Tobacco Metabolite
comment: This class denotes 4-(methlynitrosamino)-1-(3-pyridyl)-1-butanol
notation: NNAL
editorial note: To Do: align with CHEBI.

Sibling
type: Class
type: Quality Value
subclass of: Relative
subclass of: Restriction
  on property: SIO_000668
  all values from: Class
    intersection of: Restriction
      on property: SIO_000228
      all values from: Sibling
    intersection of: SIO_000485
notation: 353
definition: One of two or more individuals having one or both parents in common. A male sibling is a brother, and a female sibling is a sister. In most societies throughout the world, siblings often grow up together, thereby facilitating the development of strong emotional bonds. The emotional bond between siblings is often complicated and is influenced by factors such as parental treatment, birth order, personality, and personal experiences outside the family. However, there are cases where siblings grow up in separate homes, in different environments.
was approved by: PER-Jeanette-Stingone

Fat Calorie Intake Daily Rate
type: Class
type: Quantity Variable
subclass of: HHEAR_00053
subclass of: food calorie intake measurement
subclass of: food calorie intake rate
subclass of: Dietary Calories Measurement
subclass of: Class
  intersection of: Restriction
    some values from: Average daily total fat intake
    on property: AFX_0001049
comment: The mass percentage of daily uptake of calories that is contained in the average total daily fat intake.

Some Elementary School
type: Class
type: Quality Value
subclass of: High School or Less
notation: 86
definition: Attended Some Elementary School
was approved by: PER-Jeanette-Stingone

Active Non-Tobacco Smoker
type: Class
type: Quality Value
subclass of: Active Smoker
notation: 1
definition: Active Non-Tobacco Smoker

on property: minValue
has value: 15000

Drowning
type: Class
subclass of: Activity
subclass of: Drowning or Asphyxia or Hanging
comment: Drowning is a type of suffocation induced by the submersion or immersion of the mouth and nose in a liquid. ... An incident of drowning can also cause further complications for victims due to low body temperature, aspiration of vomit, or acute respiratory distress syndrome (respiratory failure from lung inflammation). (Source: https://en.wikipedia.org/wiki/Drowning)

I Never Felt Problems Kept Piling Up Response
type: Class
type: Quality Value
type: Node shape
subclass of: never
subclass of: I Felt Problems Kept Piling Up Response
comment: This class denotes I Never Felt Problems Kept Piling Up Response
notation: 458

Active Some of the Time
type: Class
type: Quality Value
type: Node shape
subclass of: Active Some of the Time or Hardly At All
comment: Indicates that a subject is active some of the time
notation: 1167

Sixteen to Twenty Light Bulbs
type: Class
type: Quality Value
type: Node shape
subclass of: Light Bulb Count
comment: A count of sixteen to twenty light bulbs
notation: 1122

times per two months
type: unit of measurement
type: SIO_000794
notation: times / two months

West Virginia, United States of America
type: geographic region
comment: The state, province, or territory of West Virginia, United States of America
SIO_000313: Q1139046

Tanner Male Pubic Hair Development Stage V
type: Class
type: Quality Value
type: Node shape
subclass of: Tanner Scale For Male Pubic Hair Development
comment: hair extends to medial surface of the thighs (15+) Source: Adolescent health care : a practical guide. Neinstein, Lawrence S., Neinstein, Lawrence S. (5th ed.). Philadelphia: Lippincott Williams & Wilkins. 2008. ISBN 9780781792561. OCLC 148727849.
notation: 572

Magnesium
type: Class
type: Facet Value
subclass of: HHEAR_01387
notation: Mg
definition: An element with atomic symbol Mg, atomic number 12, and atomic weight 24.3. Magnesium is an alkaline earth metal and is important to bone structure in human physiology.

feces
type: Class
subclass of: HHEAR_00177
definition: Portion of semisolid bodily waste discharged through the anus[MW, modified] [database_cross_reference: http://en.wikipedia.org/wiki/Feces][database_cross_reference: http://www.merriam-webster.com/dictionary/feces]

Hanging
type: Class
subclass of: Activity
subclass of: Drowning or Asphyxia or Hanging
comment: Hanging is the suspension of a person by a noose or ligature around the neck. ... Hanging is a common method of suicide in which a person applies a ligature to the neck and brings about unconsciousness and then death by suspension or partial suspension. (Source: https://en.wikipedia.org/wiki/Hanging).

8,12-iso-Isoprostane-F2 alpha-VI
type: Class
type: Facet Value
subclass of: isoprostane
subclass of: HHEAR_01373
notation: F2A12I
definition: An Isoprostane with the CAS # 1445349-99-4

Active Hardly At All
type: Class
type: Quality Value
type: Node shape
subclass of: Active Some of the Time or Hardly At All
comment: Indicates that a subject is active hardly at all
notation: 1168

I Rarely Felt Problems Kept Piling Up Response
type: Class
type: Quality Value
type: Node shape
subclass of: some of the time
subclass of: I Felt Problems Kept Piling Up Response
comment: This class denotes I Rarely Felt Problems Kept Piling Up Response
notation: 460

Twenty One or More Light Bulbs
type: Class
type: Quality Value
type: Node shape
subclass of: Light Bulb Count
comment: A count of twenty one or more light bulbs
notation: 1123

millimolal
type: unit of measurement
notation: mmol/kg

parasite count
type: Class
subclass of: concentration
comment: This class denotes parasite count

Four Factor Index of Social Status Questionnaire
type: Class
type: Node shape
subclass of: Questionnaire
comment: Four Factor Index of Social Status by August B. Hollingshead Reference: https://sociology.yale.edu/sites/default/files/files/yjs_fall_2011.pdf

Cobalt
type: Class
type: Facet Value
subclass of: Metal
subclass of: HHEAR_01387
notation: Co
definition: COBALT is a trace element that is a component of vitamin B12. It has the atomic symbol Co, atomic number 27, and atomic weight 58.93. It is used in nuclear weapons, alloys, and pigments. Deficiency in animals leads to anemia; its excess in humans can lead to erythrocytosis.

mono-isononyl phthalate
type: Class
type: Facet Value
subclass of: Phthalate
comment: This class denotes mono-isononyl phthalate
notation: mINP

BRIEF Global Executive Composite Score
type: Class
type: Node shape
subclass of: Composite Score
subclass of: NCIT C121459
comment: A composite score obtained from a combination of the BRIEF Behavioral Regulation Scale and the BRIEF Metacognition Scale

Floor Covering
type: Class
type: Node shape
subclass of: material entity
comment: decorative or functional cover for permanent flooring (Source: Wikidata)

specimen
type: Class
type: Facet Category
subclass of: Thing
comment: This class denotes specimen

Activity
type: Class
subclass of: Thing
comment: An activity is something that occurs over a period of time and acts upon or with entities; it may include consuming, processing, transforming, modifying, relocating, using, or generating entities. (Source: PROV Ontology)

Cardiovascular disease - congenital
type: Class
type: Quality Value
subclass of: DOID 2348
comment: This class denotes Cardiovascular disease - congenital
notation: 389

I Never Felt Stressed Response
type: Class
type: Quality Value
type: Node shape
subclass of: Never Feels Stressed
subclass of: I Felt Stressed Response
comment: This class denotes I Never Felt Stressed Response
notation: 453

Bis(2-ethylhexyl) hydrogen phosphate
type: Class
type: Node shape
type: Facet Value
subclass of: HHEAR_01372
comment: This class denotes Bis(2-ethylhexyl) hydrogen phosphate
notation: BEHP

Tanner Male Pubic Hair Development Stage III
type: Class
type: Quality Value
type: Node shape
subclass of: Tanner Scale For Male Pubic Hair Development
comment: hair becomes more coarse and curly, and begins to extend laterally (11.5–13) Source: Adolescent health care : a practical guide. Neinstein, Lawrence S., Neinstein, Lawrence S. (5th ed.). Philadelphia: Lippincott Williams & Wilkins. 2008. ISBN 9780781792561. OCLC 148727849.
notation: 678

I Felt Problems Kept Piling Up Response
type: Class
type: Quality Variable
type: Node shape
subclass of: PROMIS Psychological Stress Experiences Response
comment: A response to the PROMIS questionnaire question "I felt that my problems kept piling up."

Active Most of the Time
type: Class
type: Quality Value
type: Node shape
subclass of: Physical Activity
comment: Indicates that a subject is active most of the time
notation: 1166

Virginia, United States of America
type: geographic region
comment: The state, province, or territory of Virginia, United States of America
SIO_000313: Q1139046

Congenital anomaly or chromosomal defect
type: Class
type: Quality Value
subclass of: Disease
comment: This class denotes Congenital anomaly or chromosomal defect
notation: 390
equivalent class: Class
  union of: EFO_0000336
  union of: Congenital Abnormality
  equivalent class: Congenital anomaly or chromosomal defect

placenta
type: Class
type: Facet
subclass of: tissue
subclass of: HHEAR_00177
subclass of: Pregnancy Sample
definition: Organ of metabolic interchange between fetus and mother, partly of embryonic origin and partly of maternal origin[GO]. The fetal portion of the placenta is known as the villous chorion. The maternal portion is known as the decidua basalis. The two portions are held together by anchoring villi that are anchored to the decidua basalis by the cytotrophoblastic shell. [database_cross_reference: http://en.wikipedia.org/wiki/Placenta][database_cross_reference: http://www.med.umich.edu/lrc/coursepages/m1/embryology/embryo/06placenta.htm]

Tanner Male Pubic Hair Development Stage IV
type: Class
type: Quality Value
type: Node shape
subclass of: Tanner Scale For Male Pubic Hair Development
comment: adult-like hair quality, extending across pubis but sparing medial thighs (13–15) Source: Adolescent health care : a practical guide. Neinstein, Lawrence S., Neinstein, Lawrence S. (5th ed.). Philadelphia: Lippincott Williams & Wilkins. 2008. ISBN 9780781792561. OCLC 148727849.
notation: 679

Summer
type: Class
type: Quality Value
subclass of: Season
comment: This class denotes Summer
notation: 212

Veracruz, Mexico
type: geographic region
comment: The state, province, or territory of Veracruz, Mexico
SIO_000313: Q96

Number of Minor Alleles for SNP
type: Class
type: Node shape
subclass of: SIO_000794
subclass of: Medical History
comment: The measured count of a specific minor allele for a single nucleotide polymorphism of a gene variant

I Sometimes Felt Stressed Response
type: Class
type: Quality Value
type: Node shape
subclass of: Sometimes Feels Stressed
subclass of: I Felt Stressed Response
comment: This class denotes I Sometimes Felt Stressed Response
notation: 456

Antimalarial
type: Class
type: Quality Value
subclass of: Medication
notation: 120
definition: A drug used in the treatment of malaria. Antimalarials are usually classified on the basis of their action against Plasmodia at different stages in their life cycle in the human.

Tanner Male Pubic Hair Development Stage I
type: Class
type: Quality Value
type: Node shape
subclass of: Tanner Scale For Male Pubic Hair Development
comment: no pubic hair at all (prepubertal) (typically age 10 and younger) Source: Adolescent health care : a practical guide. Neinstein, Lawrence S., Neinstein, Lawrence S. (5th ed.). Philadelphia: Lippincott Williams & Wilkins. 2008. ISBN 9780781792561. OCLC 148727849.
notation: 576

Pregnancy Characteristic
type: Class
subclass of: Study Indicator
definition: Pregnancy Characteristic Indicator Class
was approved by: PER-Jeanette-Stingone

amoxicillin
type: Class
type: Node shape
subclass of: chemical entity
comment: A penicillin in which the substituent at position 6 of the penam ring is a 2-amino-2-(4-hydroxyphenyl)acetamido group.

fatty liver disease
type: Class
type: Quality Value
subclass of: phenotype
comment: A lipid storage disease characterized by the accumulation of large vacuoles of triglyceride fat in liver cells via the process of steatosis. (Source: Disease Ontology)
notation: 1180

Fall
type: Class
type: Quality Value
subclass of: Season
comment: This class denotes Fall
notation: 213

BRIEF Monitor Scale
type: Class
type: Node shape
subclass of: BRIEF Metacognition Index
comment: A scale that measure's a subject's ability to check work and to assess one's own performance; ability to keep track of the effect of one's own behavior on other people.

Granulocyte-macrophage colony-stimulating factor
type: Class
type: Facet Value
subclass of: Protein
subclass of: HHEAR_01389
comment: This class denotes Granulocyte-macrophage colony-stimulating factor
notation: GMCSF

Imputed Measurement
type: Class
type: Node shape
subclass of: Measurement
comment: An imputed, or inferred measurement one where an assumed value given to an item when the actual value is not known or available. The value may be determined by applying a standard scale or algorithm to other measurements that can be used to estimate the true value of the measurement.
disjoint with: Direct Measurement

2,4,4',5-Tetrachlorobiphenyl
type: Class
type: Node shape
type: Facet Value
subclass of: Polychlorobiphenyl
comment: This class denotes 2,4,4',5-Tetrachlorobiphenyl
notation: PCB74

percentage
type: Class
subclass of: Thing
comment: This class denotes percentage

Dietary Supplement
type: Class
type: Node shape
subclass of: Drug, Food, Chemical or Biomedical Material
comment: Oral preparations containing dietary ingredient(s) intended to supplement the diet. Dietary ingredients include vitamins, minerals, herbs, amino acids, extracts and metabolites. (Source: NCI Thesaurus)

Cardiovascular disease - acquired
type: Class
type: Quality Value
subclass of: DOID 2348
comment: This class denotes Cardiovascular disease - acquired
notation: 388

I Rarely Felt Stressed Response
type: Class
type: Quality Value
type: Node shape
subclass of: Rarely Feels Stressed
subclass of: I Felt Stressed Response
comment: This class denotes I Rarely Felt Stressed Response
notation: 455

Tanner Male Pubic Hair Development Stage II
type: Class
type: Quality Value
type: Node shape
subclass of: Tanner Scale For Male Pubic Hair Development
comment: small amount of long, downy hair with slight pigmentation at the base of the penis and scrotum (10–11.5) Source: Adolescent health care : a practical guide. Neinstein, Lawrence S., Neinstein, Lawrence S. (5th ed.). Philadelphia: Lippincott Williams & Wilkins. 2008. ISBN 9780781792561. OCLC 148727849.
notation: 574

liver fat morphological measurement
type: Class
subclass of: CMO_0000093
comment: Any measurement of the physical form or structure of the fat deposits in the liver of an organism. (Source: Clinical Measurement Ontology)

executive function assessment
type: Class
type: Node shape
subclass of: HHEAR_00198
comment: Evaluation of organizing and planning ability, as well as working memory, mental flexibility, list-making, and execution of tasks. (Source: MAXO Ontology)

Predominantly fibrous material
type: Class
subclass of: comment
comment: This class denotes Predominantly fibrous material

food reheating
type: Class
type: Node shape
subclass of: food transformation process
comment: A process to bring an already fully cooked product to serving temperature.

Winter
type: Class
type: Quality Value
subclass of: Season
comment: This class denotes Winter
notation: 210

Mirex
type: Class
type: Facet Value
subclass of: HHEAR_01375
comment: This class denotes Mirex
notation: MIREX

Asian and White
type: Class
type: Quality Value
type: Node shape
subclass of: Asian
subclass of: White
subclass of: Multiracial
comment: A multiracial race category indicating that a subject identifies as both Asian and White
notation: 640

Zone 3: Mild Perisinusoidal
type: Class
type: Quality Value
type: Node shape
subclass of: Pathology Result
comment: This class denotes Zone 3: Mild Perisinusoidal
notation: 751

mono-methyl phthalate
type: Class
type: Facet Value
subclass of: Phthalate
comment: This class denotes mono-methyl phthalate
notation: mMP

I Always Felt Stressed Response
type: Class
type: Quality Value
type: Node shape
subclass of: Always Feels Stressed
subclass of: I Felt Stressed Response
comment: This class denotes I Always Felt Stressed Response
notation: 690

Spring
type: Class
type: Quality Value
subclass of: Season
comment: This class denotes Spring
notation: 211

Burmese
type: Class
type: Quality Value
type: Node shape
subclass of: Asian Non-Hispanic
comment: Denotes the inhabitants of Myanmar (formerly Burma), a person from there, or their descendants elsewhere. (Source: NCI Thesaurus)
notation: 1225

Black and White
type: Class
type: Quality Value
type: Node shape
subclass of: Black or African American
subclass of: White
subclass of: Multiracial
comment: A multiracial race category indicating that a subject identifies as both Black (African American) and White
notation: 641

I Often Felt Stressed Response
type: Class
type: Quality Value
type: Node shape
subclass of: Often Feels Stressed
subclass of: I Felt Stressed Response
comment: This class denotes I Often Felt Stressed Response
notation: 454

Tanner Female Pubic Hair Development Stage V
type: Class
type: Quality Value
type: Node shape
subclass of: Tanner Scale For Female Pubic Hair Development
comment: hair extends to medial surface of the thighs (15+) Source: Adolescent health care : a practical guide. Neinstein, Lawrence S., Neinstein, Lawrence S. (5th ed.). Philadelphia: Lippincott Williams & Wilkins. 2008. ISBN 9780781792561. OCLC 148727849.
notation: 575

Born Fourth
type: Class
type: Quality Value
subclass of: Birth Order
subclass of: Fourth
notation: 239
definition: The fourth born child

Vanuatu
type: geographic region
comment: The country of Vanuatu
SIO_000313: Outside United States

Overweight BMI
type: Class
type: Quality Value
subclass of: HHEAR_00549
subclass of: Body Mass Index
subclass of: Restriction
  on property: SIO_000216
comment: This class denotes Overweight BMI
notation: 685

Karen people
type: Class
type: Node shape
subclass of: Asian Non-Hispanic
comment: ethnolinguistic group of people in Myanmar and Thailand (Source: Wikidata)

Tanner Scale
type: Class
type: Node shape
subclass of: Research or Clinical Assessment Tool
comment: A scale of physical development in children, adolescents and adults based on external primary and secondary sex characteristics, such as the size of the breasts, genitalia, and development of pubic hair. [Definition Source: NCI][attribution: Tanner JM. Growth at adolescence. 2d ed. Oxford: Blackwell, 1962]

4, 4'-(1-phenylethylidene)bisphenol
type: Class
type: Facet Value
subclass of: HHEAR_01385
comment: This class denotes 4, 4'-(1-phenylethylidene)bisphenol
notation: BPAP

Stores Pesticide At Home
type: Class
type: Quality Value
type: Node shape
subclass of: Pesticide Storage Exposure
comment: Currently or has recently stored some pesticide in the home
notation: 1101

Central Line Infection
type: Class
subclass of: hospital-acquired infection
subclass of: CAUTI or CLABSI or VAP
subclass of: Restriction
  some values from: central venous cannula insertion
  on property: SIO_001157
comment: This class denotes Central Line Infection

Scaled Score Total Errors
type: Class
type: Node shape
subclass of: Scaled Score
comment: This class denotes Scaled Score Total Errors

Household Does Not Have a Microwave Oven
type: Class
type: Quality Value
type: Node shape
subclass of: Microwave Oven Count
comment: Indicates that a household does not have a microwave oven.
notation: 1129

Annual Income $40,000 to $60,000
type: Class
type: Quality Value
subclass of: Annual Income $30,000 to $60,000
subclass of: HHEAR_02320
subclass of:
  on property: minValue
  has value: 40000
subclass of:
  on property: SIO_000900
  has value: year
subclass of:
  on property: maxValue
  has value: 60000
comment: This class denotes Annual Income $40,000 to $60,000
notation: 892

degree Fahrenheit
type: unit of measurement
notation: F

molar
type: unit of measurement
notation: M

Thiacloprid amide
type: Class
type: Node shape
type: Facet Value
subclass of: HHEAR_01374
comment: This class denotes Thiacloprid amide
notation: TA

Home Observation for Measurement of the Environment, Revised Edition
type: Class
type: Node shape
subclass of: Research or Clinical Assessment Tool
comment: A 38-item questionnaire that evaluates the quality of a child's home environment filled out by the child's primary caregiver. The questions vary based on the age of the child.

Obese BMI
type: Class
type: Quality Value
subclass of: HHEAR_00549
subclass of: Body Mass Index
subclass of: Restriction
  on property: SIO_000216
subclass of: Restriction
  on property: SIO_000221
  has value: kilogram per square meter
comment: This class denotes Obese BMI
notation: 687

Born Fifth
type: Class
type: Quality Value
subclass of: Fifth
subclass of: Birth Order
notation: 240
definition: The fifth born child

1-hydroxychrysene
type: Class
type: Facet Value
subclass of: polycyclic hydrocarbon
comment: This class denotes 1-hydroxychrysene
notation: CHRY1

Solomon Islands
type: geographic region
comment: The country of Solomon Islands
SIO_000313: Outside United States

leukotriene E4
type: Class
type: Facet Value
subclass of: HHEAR_00034
subclass of: HHEAR_01389
comment: This class denotes leukotriene E4
notation: LTE4

Uses Pesticide Inside the Home
type: Class
type: Quality Value
type: Node shape
subclass of: Uses Pesticide
subclass of: Indoor Pesticide Usage Exposure
comment: Has used pesticides inside the home
notation: 1088

Annual Income $60,000 to $100,000
type: Class
type: Quality Value
type: Node shape
subclass of: Annual Income More Than $60,000
subclass of:
  on property: maxValue
  has value: 100000
subclass of:
  on property: SIO_000900
  has value: year
subclass of:
  on property: currency
  has value: USD
subclass of:
  on property: minValue
  has value: 60000
comment: This class denotes Annual Income $60,000 to $100,000
notation: 893

Behavior Assessment System for Children Attention Subscale
type: Class
type: Node shape
subclass of: Behavior Assessment System for Children, Third Edition
comment: This class denotes Behavior Assessment System for Children Attention Subscale

Household Has a Toaster
type: Class
type: Quality Value
type: Node shape
subclass of: Toaster Count
comment: Indicates that a household has at least one toaster.
notation: 1130

Non-White Non-Hispanic
type: Class
type: Quality Value
subclass of: HHEAR_00522
subclass of: Non-Hispanic Ethnicity
comment: This class denotes Non-White Non-Hispanic
notation: 326

Born Second
type: Class
type: Quality Value
subclass of: Birth Order
subclass of: Second
notation: 237
definition: The second born child

Neurological Vascular Malformation
type: Class
type: Quality Value
subclass of: vascular malformation
subclass of: NCIT C25262
comment: Vascular malformations within the central nervous system
notation: 411
editorial note: Additional research I did suggests this CNS vascular malformations includes AVMs, capillary telangiectasias, cavernous malformations, dural arteriovenous fistulas, venous malformations.

Pesticide Usage Exposure
type: Class
type: Node shape
subclass of: Pesticide Exposure
comment: The potential material exposure that a subject has to any form of pesticide through their direct use of the pesticide

Household Does Not Have a Washing Machine
type: Class
type: Quality Value
type: Node shape
subclass of: Washing Machine Count
comment: Indicates that a household does not have a washing machine
notation: 1127

Annual Income $80,000 to $89,999
type: Class
type: Quality Value
type: Node shape
subclass of: HHEAR_00543
subclass of:
  on property: maxValue
  has value: 89999
subclass of:
  on property: SIO_000900
  has value: year
comment: Denotes that a subject or subject's household has an annual income between $80,000 and $89,999.
notation: 1173

Budesonide nebulized (Pulmicort)
type: Class
subclass of: Asthma Controller Medication
comment: This class denotes Budesonide nebulized (Pulmicort)

liter per kilogram
type: unit of measurement
notation: l/kg

micromolar
type: unit of measurement
notation: µM

Scaled Score Combined
type: Class
type: Node shape
subclass of: Scaled Score
comment: This class denotes Scaled Score Combined

Human Dwelling With Flooring Other Than Fitted Carpet, Hardwood, Large Rug, Scatter Rug, Concrete or Tile
type: Class
type: Node shape
subclass of: Human Dwelling By Floor Covering Type
comment: This class denotes Human Dwelling With Flooring Other Than Fitted Carpet, Hardwood, Large Rug, Scatter Rug, Concrete or Tile
notation: 890
intersection of: Human Dwelling

Bioelectric Impedance Analysis
type: Class
type: Node shape
subclass of: NCIT C18020
comment: A method to assess body composition, i.e., the relative percentages of body weight comprised of fat tissue and lean body mass. It is based on the principle that the resistance to an applied electric current is inversely related to the amount of lean body mass within the body. Impedance is greatest in fat tissue, which contains only 10-20% water, while lean body mass, which contains 70-75% water, allows the signal to pass much more easily. (Source: NCI Thesaurus)

Healthy BMI
type: Class
type: Quality Value
subclass of: HHEAR_00549
subclass of: Body Mass Index
subclass of: Restriction
  on property: SIO_000216
subclass of: Restriction
  some values from: Class
    intersection of: SIO_001113
    intersection of: Restriction
      on property: SIO_000300
      has value: 0.0
  on property: SIO_000216
subclass of: Restriction
  on property: SIO_000221
  has value: kilogram per square meter
comment: This class denotes Healthy BMI
notation: 686

Born Third
type: Class
type: Quality Value
subclass of: Birth Order
subclass of: NCIT C25260
notation: 238
definition: The third born child

Samoa
type: geographic region
comment: The country of Samoa
SIO_000313: Outside United States

Pesticide Storage Exposure
type: Class
type: Node shape
subclass of: Pesticide Exposure
comment: The potential material exposure that a subject has to any form of pesticide through the home storage of the pesticide

Household Has a Microwave Oven
type: Class
type: Quality Value
type: Node shape
subclass of: Microwave Oven Count
comment: Indicates that a household has at least one microwave oven.
notation: 1128

Tandem Mass Spectrometry
type: Class
subclass of: Thing
comment: This class denotes Tandem Mass Spectrometry

2, 3, 4, 6-Tetrachlorophenol
type: Class
type: Facet Value
subclass of: CHEBI_33853
notation: TeCP2346
definition: PHYSICAL DESCRIPTION: Brown flakes or beige solid. Strong odor. (NTP, 1992)

Annual Income $20,000 or Less
type: Class
type: Quality Value
subclass of: Annual Income $24,999 or Less
subclass of:
  on property: maxValue
  has value: 20000
subclass of:
  on property: minValue
  has value: 0
subclass of:
  on property: SIO_000900
  has value: year
comment: This class denotes Annual Income $20,000 or Less
notation: 891

Scaled Score Total Correct
type: Class
type: Node shape
subclass of: Scaled Score
comment: This class denotes Scaled Score Total Correct

millimolar
type: unit of measurement
notation: mM

Toxin Ingestion
type: Class
subclass of: Drug or Toxin Ingestion
subclass of: ingestion
subclass of: Restriction
  some values from: toxin
  on property: SIO_000139
comment: This class denotes Toxin Ingestion

Cambodia
type: geographic region
comment: The country of Cambodia
SIO_000313: Outside United States

Garage
type: Class
type: Quality Value
subclass of: Human Dwelling
notation: 235
definition: A building, or part of a building primarily used for housing a motor vehicle or vehicles.

Household Does Not Have a Vacuum Cleaner
type: Class
type: Quality Value
type: Node shape
subclass of: Vacuum Cleaner Count
comment: Indicates that a household does not own, rent, or have exclusive access to a vacuum cleaner
notation: 1125

Post-Birth 1 Minute
type: Class
subclass of: time interval
definition: One minute after birth of a child

Annual Income $60,000 to $69,999
type: Class
type: Quality Value
type: Node shape
subclass of: Annual Income $40,001 to $70,000
subclass of: Annual Income $60,000 to $74,999
subclass of: Annual Income $60,000 to $100,000
subclass of:
  on property: minValue
  has value: 60000
subclass of:
  on property: SIO_000900
  has value: year
subclass of:
  on property: currency
  has value: USD
subclass of:
  on property: maxValue
  has value: 69999
comment: Denotes that a subject or subject's household has an annual income between $60,000 and $69,999.
notation: 1171

Polygamous
type: Class
type: Quality Value
subclass of: Marital Status
notation: 45
definition: A type of living arrangement or mating system in which at least one member of a relationship has more than one mate.

Flea and Tick Spray Exposure
type: Class
type: Node shape
subclass of: Flea and Tick Management Exposure
comment: The material exposure that a subject has to aerasol chemicals used to kill fleas and ticks currently on a pet

picomolar
type: unit of measurement
notation: pM

microliter per kilogram
type: unit of measurement
notation: µl/kg

Scaled Score RS Contrast
type: Class
type: Node shape
subclass of: Scaled Score
comment: This class denotes Scaled Score RS Contrast

Occupation Category 2
type: Class
type: Quality Value
type: Node shape
subclass of: ExO_0000034
subclass of: Four Factor Index of Social Status Questionnaire Response
comment: This class denotes Occupation Category 2, i.e. 2=unskilled workers
notation: 509

Drug or Toxin Ingestion
type: Class
type: Quality Value
subclass of: ingestion
comment: This class denotes Drug or Toxin Ingestion
notation: 394
equivalent class: Class
  union of: Drug Ingestion
  union of: Toxin Ingestion
  equivalent class: Drug or Toxin Ingestion

North Korea
type: geographic region
comment: The country of North Korea
SIO_000313: Outside United States

Post-Birth 5 Minutes
type: Class
subclass of: time interval
definition: Five minutes after birth of a child

malonaldehyde
type: Class
type: Node shape
type: Facet Value
subclass of: HHEAR_01373
comment: A dialdehyde that is propane substituted by two oxo groups at the terminal carbon atoms respectively. A biomarker of oxidative damage to lipids caused by smoking, it exists in vivo mainly in the enol form. (Source: ChEBI)
notation: OSMDA

Flea and Tick Spray
type: Class
type: Node shape
subclass of: chemical substance
comment: Aerosol chemical substances that are used on non-human animals to kill fleas and ticks from living on them

Born First
type: Class
type: Quality Value
subclass of: Birth Order
subclass of: First
notation: 236
definition: The first born child

Household Has a Washing Machine
type: Class
type: Quality Value
type: Node shape
subclass of: Washing Machine Count
comment: Indicates that a household has a washing machine
notation: 1126

Annual Income $70,000 to $79,999
type: Class
type: Quality Value
type: Node shape
subclass of: Annual Income $50,000 to $99,999
subclass of: HHEAR_01116
subclass of: Annual Income $60,000 to $100,000
subclass of:
  on property: maxValue
  has value: 79999
subclass of:
  on property: SIO_000900
  has value: year
subclass of:
  on property: minValue
  has value: 70000
comment: Denotes that a subject or subject's household has an annual income between $70,000 and $79,999.
notation: 1172

nanomolar
type: unit of measurement
notation: nM

milliliter per kilogram
type: unit of measurement
notation: ml/kg

Household Income Not Reported
type: Class
type: Node shape
subclass of: NCIT C70811
comment: This class denotes Household Income Not Reported
notation: 889

Scaled Score Completion Time Total
type: Class
type: Node shape
subclass of: Scaled Score
comment: This class denotes Scaled Score Completion Time Total

Butyl paraben
type: Class
type: Facet Value
subclass of: CHEBI_85122
notation: BuPB
definition: Butylparaben is a Standardized Chemical Allergen. The physiologic effect of butylparaben is by means of Increased Histamine Release, and Cell-mediated Immunity. The chemical classification of butylparaben is Allergens.

Seasonal Population Group
type: Class
type: Quality Variable
subclass of: Population Group
definition: A Population Group organized by which season of the year the subjects were tested or studied.

Active Some of the Time or Hardly At All
type: Class
type: Quality Value
type: Node shape
subclass of: Physical Activity
comment: Indicates that a subject is active some of the time or hardly at all
notation: 1169
equivalent class: Class
  union of: Active Some of the Time
  union of: Active Hardly At All
  equivalent class: Active Some of the Time or Hardly At All

Drowning or Asphyxia or Hanging
type: Class
type: Quality Value
subclass of: Activity
comment: This class denotes Drowning or Asphyxia or Hanging
notation: 393
equivalent class: Class
  equivalent class: Drowning or Asphyxia or Hanging

I Sometimes Felt Problems Kept Piling Up Response
type: Class
type: Quality Value
type: Node shape
subclass of: some of the time
subclass of: I Felt Problems Kept Piling Up Response
comment: This class denotes I Sometimes Felt Problems Kept Piling Up Response
notation: 461

Human Dwelling with Ground or Cement Floor
type: Class
type: Quality Value
type: Node shape
subclass of: Human Dwelling By Floor Covering Type
comment: A human dwelling (house, apartment, etc.) with a floor that is either the dirt or cement
notation: 1145

molal
type: unit of measurement
notation: mol/kg

Ethylbenzene
type: Class
type: Facet Value
subclass of: Volatile Organic Compound
notation: EB
definition: Ethylbenzene is mainly used in the manufacture of styrene. Acute (short-term) exposure to ethylbenzene in humans results in respiratory effects, such as throat irritation and chest constriction, irritation of the eyes, and neurological effects such as dizziness. Chronic (long-term) exposure to ethylbenzene by inhalation in humans has shown conflicting results regarding its effects on the blood. Animal studies have reported effects on the blood, liver, and kidneys from chronic inhalation exposure to ethylbenzene. Limited information is available on the carcinogenic effects of ethylbenzene in humans. In a study by the National Toxicology Program (NTP), exposure to ethylbenzene by inhalation resulted in an increased incidence of kidney and testicular tumors in rats, and lung and liver tumors in mice. EPA has classified ethylbenzene as a Group D, not classifiable as to human carcinogenicity.

Percentile Rank Total Uncorrected Errors
type: Class
type: Quantity Variable
type: Node shape
subclass of: Percentile Rank
comment: This class denotes Percentile Rank Total Uncorrected Errors

albuterol
type: Class
type: Node shape
subclass of: Asthma Controller Medication
subclass of: chemical entity
comment: A member of the class of phenylethanolamines that is 4-(2-amino-1-hydroxyethyl)-2-(hydroxymethyl)phenol having a tert-butyl group attached to the nirogen atom. It acts as a β-adrenergic agonist used in the treatment of asthma and chronic obstructive pulmonary disease (COPD).

biological quality
type: Class
subclass of: Thing
comment: This class denotes biological quality

Four Factor Index of Social Status Questionnaire Response
type: Class
type: Quality Variable
type: Node shape
subclass of: Demographic
subclass of: Socioeconomic Status
subclass of: Questionnaire Response
comment: This class denotes Four Factor Index of Social Status Questionnaire Response

rest: nil
first: Restriction
  on property: SIO_000300
  has value: 1000.0

I Often Felt Problems Kept Piling Up Response
type: Class
type: Quality Value
type: Node shape
subclass of: most of the time
subclass of: I Felt Problems Kept Piling Up Response
comment: This class denotes I Often Felt Problems Kept Piling Up Response
notation: 459

lutein
type: Class
type: Node shape
type: Facet Value
subclass of: HHEAR_01390
comment: This class denotes lutein
notation: LUT

Tetrachloroethene
type: Class
type: Facet Value
subclass of: Volatile Organic Compound
notation: TCE
definition: TETRACHLOROETHYLENE is a chlorinated hydrocarbon used as an industrial solvent and cooling liquid in electrical transformers. It is a potential carcinogen.

4-hydroxychrysene
type: Class
type: Facet Value
subclass of: polycyclic hydrocarbon
comment: This class denotes 4-hydroxychrysene
notation: CHRY4

Drug Ingestion
type: Class
subclass of: Drug or Toxin Ingestion
subclass of: ingestion
subclass of: Restriction
  some values from: CHEBI_23888
  on property: SIO_000139
comment: This class denotes Drug Ingestion

Pregnancy Month 1
type: Class
subclass of: time interval
definition: The first month of pregnancy

11 or More Residence Building
type: Class
type: Quality Value
subclass of: Multi Residence Building
notation: 234
definition: A residential building that contains eleven or more apartments, town houses, condos, or other single family dwelling spaces.

Flea and Tick Preventative Medicine Exposure
type: Class
type: Node shape
subclass of: Flea and Tick Management Exposure
comment: The material exposure that a subject has to medicine or other chemical used to prevent pets from hosting fleas and ticks

Household Has a Vacuum Cleaner
type: Class
type: Quality Value
type: Node shape
subclass of: Vacuum Cleaner Count
comment: Indicates that a household owns, rents, or has exclusive access to a vacuum cleaner
notation: 1124

Annual Income $10,000 or Less
type: Class
type: Quality Value
type: Node shape
subclass of: Annual Income $14,999 or Less
subclass of:
  on property: currency
  has value: USD
subclass of:
  on property: maxValue
  has value: 10000
subclass of:
  on property: minValue
  has value: 0
comment: Denotes a subject or subject's household has an annual income that is at or below $10,000.
notation: 1170

Percentile Rank Total Errors
type: Class
type: Quantity Variable
type: Node shape
subclass of: Percentile Rank
comment: This class denotes Percentile Rank Total Errors

on property: currency
has value: USD

phthalic acid
type: Class
type: Facet Value
subclass of: Phthalate
notation: PA
definition: PHYSICAL DESCRIPTION: White crystals or fine white powder. (NTP, 1992)

Occupation Category 1
type: Class
type: Quality Value
type: Node shape
subclass of: ExO_0000034
subclass of: Four Factor Index of Social Status Questionnaire Response
comment: 1=farm laborers, menial service workers, students, housewives, (dependent on welfare, no regular occupation),
notation: 508

study
type: Class
subclass of: Thing
comment: A study is a process that realizes the steps of a study design. (Source: SIO Ontology)

SIO_010058
type: Quality Value
notation: 131

currency
type: Property
comment: The currency in which the monetary amount is expressed.\n\nUse standard formats: [ISO 4217 currency format](http://en.wikipedia.org/wiki/ISO_4217), e.g. "USD"; [Ticker symbol](https://en.wikipedia.org/wiki/List_of_cryptocurrencies) for cryptocurrencies, e.g. "BTC"; well known names for [Local Exchange Trading Systems](https://en.wikipedia.org/wiki/Local_exchange_trading_system) (LETS) and other currency types, e.g. "Ithaca HOUR".

N-Ace-S-(dimethylphenyl)-L-Cys(ng/mL)
type: Class
subclass of: Volatile Organic Compound
comment: This class denotes N-Ace-S-(dimethylphenyl)-L-Cys(ng/mL)
notation: VOCDPM
editorial note: To Do: align with CHEBI.

Non-Spontaneous Preterm Birth
type: Class
type: Quality Value
subclass of: Preterm Birth
subclass of: Non-spontaneous Birth
subclass of: Class
  intersection of: Preterm Birth
comment: This class denotes Non-Spontaneous Preterm Birth
notation: 60
equivalent class: Class
  intersection of: Preterm Birth
  intersection of: Non-spontaneous Birth
  equivalent class: Non-Spontaneous Preterm Birth

Water Source
type: Class
type: Node shape
subclass of: HHEAR_00062
subclass of: material entity
comment: natural body of water that can be used as drinking water (Source: wikidata.org)

Head
type: Class
subclass of: biological entity
comment: This class denotes Head

dengue disease
type: Class
type: Quality Value
subclass of: DOID 934
comment: This class denotes dengue disease
notation: 1066

microcephaly
type: Class
type: Quality Value
subclass of: phenotype
comment: This class denotes microcephaly
notation: 1020

Residential Building With Central Air Conditioning
type: Class
type: Quality Value
type: Node shape
subclass of: Residential Building
subclass of: Restriction
  some values from: Q91660517
  on property: SIO_000369
comment: This class denotes Residential Building With Central Air Conditioning
notation: 788
disjoint with: Residential Building Without Central Air Conditioning

SIO_010059
type: Quality Value
notation: 132

N-Acel-S-(2, 2-Dichlorvinyl)-L-cys(ng/mL)
type: Class
subclass of: Volatile Organic Compound
comment: This class denotes N-Acel-S-(2, 2-Dichlorvinyl)-L-cys(ng/mL)
notation: VOC2DC
editorial note: To Do: align with CHEBI.

Other GI Disease
type: Class
type: Quality Value
subclass of: disease
subclass of: HHEAR_00549
comment: This class denotes Other GI Disease
notation: 69
editorial note: This is a temp concept that needs addressing

Domestic Partnership
type: Class
type: Quality Value
subclass of: Unmarried
subclass of: Married or living together with partner
notation: 42
definition: Indicates a person who is a member of an unmarried couple, including same sex couples, living together in longstanding relationships, that are registered or unregistered.

Grade of Steatosis in Liver
type: Class
type: Quality Variable
type: Node shape
subclass of: Measurement
subclass of: Restriction
  some values from: Hepatic Steatosis
  on property: SIO_000215
comment: A measurement of the severity of steatosis in the liver

Residential Building Without Central Air Conditioning
type: Class
type: Quality Value
type: Node shape
subclass of: Residential Building
comment: This class denotes Residential Building Without Central Air Conditioning
notation: 789
equivalent class: Class
  intersection of: Residential Building
  intersection of: Class
    complement of: Residential Building With Central Air Conditioning
  equivalent class: Residential Building Without Central Air Conditioning
disjoint with: Residential Building With Central Air Conditioning

SIO_001068
type: Quality Value
notation: 135

communicating
type: Class
subclass of: Thing
comment: This class denotes communicating

phenotype
type: Class
type: Quality Variable
subclass of: HHEAR_00549
comment: This class denotes phenotype

Nicotelline
type: Class
type: Node shape
type: Facet Value
subclass of: Tobacco Metabolite
comment: This class denotes Nicotelline
notation: NICTL

Uses Flea and Tick Spray
type: Class
type: Quality Value
type: Node shape
subclass of: Flea and Tick Spray Exposure
comment: Currently uses or has recently used flea and tick spray on a pet or domestic animal
notation: 1023

N-Ace-S-(3-Hydroxypropyl)-L-Cys(ng/mL)
type: Class
subclass of: Volatile Organic Compound
comment: This class denotes N-Ace-S-(3-Hydroxypropyl)-L-Cys(ng/mL)
notation: VOCHPM
editorial note: To Do: align with CHEBI.

systolic blood pressure
type: Class
subclass of: Thing
comment: This class denotes systolic blood pressure

Asthma Limited Activity All of the Time
type: Class
type: Quality Value
type: Node shape
subclass of: always
subclass of: Asthma Induced Activity Limitation Response
comment: This class denotes Asthma Limited Activity All of the Time
notation: 781

Bangladesh
type: Quality Value
type: NamedIndividual
type: geographic region
comment: country in South Asia
comment: The country of Bangladesh
notation: 1185
SIO_000313: Outside United States

T-Score
type: Class
subclass of: Physical And Mental Assessment
subclass of: score
definition: A method for converting an individual score into a standard form. While similar to a z-score, t-score is used when the conversion is made without knowledge of the population standard deviation and mean.

life status
type: Class
type: Quality Variable
subclass of: Physical And Mental Assessment
comment: This class denotes life status

N-Ace-S-(N-methlcarbamoyl)-L-cys(ng/mL)
type: Class
subclass of: Volatile Organic Compound
comment: This class denotes N-Ace-S-(N-methlcarbamoyl)-L-cys(ng/mL)
notation: VOCAMC
editorial note: To Do: align with CHEBI.

Multiplex real-time PCR
type: Class
subclass of: Polymerase Chain Reaction
comment: This class denotes Multiplex real-time PCR

diastolic blood pressure
type: Class
subclass of: Thing
comment: This class denotes diastolic blood pressure

Terrace House End
type: Class
type: Quality Value
type: Node shape
subclass of: Terrace House
comment: A unit in a terrace or row house that is on the end. I.e. one that shares only one side with another unit.
notation: 787
alternative label: Row House End

Palaung people
type: Class
type: Quality Value
type: Node shape
subclass of: Asian Non-Hispanic
comment: Mon-Khmer ethnic group (Source: Wikidata)
notation: 1227

Percentile Rank Total Commission Errors
type: Class
type: Quantity Variable
type: Node shape
subclass of: Percentile Rank
comment: This class denotes Percentile Rank Total Commission Errors

N-Ace-S-(2-carbamoylethyl)-L-cys(ng/mL)
type: Class
subclass of: Volatile Organic Compound
comment: This class denotes N-Ace-S-(2-carbamoylethyl)-L-cys(ng/mL)
notation: VOCAAM
editorial note: To Do: align with CHEBI.

Flea and Tick Management Exposure
type: Class
type: Node shape
subclass of: HHEAR_00062
comment: The material exposure that a subject has to any form of medicine or other chemical used to manage fleas and ticks on pets

cyclic peptide
type: Class
subclass of: HHEAR_00034
subclass of: HHEAR_00548
definition: A molecular entity capable of accepting a hydron from a donor (Bronsted acid).

Pathogen Transmission
type: Class
subclass of: process
comment: This class denotes Pathogen Transmission

Surface Water
type: Class
type: Quality Value
type: Node shape
subclass of: Water Source
comment: water on the continents surface, rather than underground (Source: wikidata.org)
notation: 991

Percentile Rank Total Self-Corrected Errors
type: Class
type: Quantity Variable
type: Node shape
subclass of: Percentile Rank
comment: This class denotes Percentile Rank Total Self-Corrected Errors

N-Ace-S-(2-hydroxypropyl)-L-cys(ng/mL)
type: Class
subclass of: Volatile Organic Compound
comment: This class denotes N-Ace-S-(2-hydroxypropyl)-L-cys(ng/mL)
notation: VOCHP2
editorial note: To Do: align with CHEBI.

Retinol
type: Class
type: Node shape
type: Facet Value
subclass of: HHEAR_01390
comment: This class denotes Retinol
notation: VITA

Uses Flea and Tick Preventative Medicine
type: Class
type: Quality Value
type: Node shape
subclass of: Flea and Tick Preventative Medicine Exposure
subclass of: Restriction
  some values from: Flea and Tick Preventative Medicine
  on property: SIO_000139
comment: Currently uses or has recently used flea and tick preventative medicine on a pet or domestic animal
notation: 1022

rest: nil
first: Restriction
  on property: SIO_000300
  has value: 4

Mean Concentration Range > 1000 ng/mL
type: Class
type: Quality Value
subclass of: HHEAR_00527
subclass of: Restriction
  some values from: Class
  on property: SIO_000216
comment: This class denotes Mean Concentration Range > 1000 ng/mL
notation: 322

SIO_010052
type: Quality Value
type: Facet
notation: 110

microbial phenotype
type: Class
subclass of: phenotype
comment: This class denotes microbial phenotype

Pesticide Exposure
type: Class
type: Node shape
subclass of: HHEAR_00062
comment: The potential material exposure that a subject has to any form of pesticide

Percentile Rank Total Omission Errors
type: Class
type: Quantity Variable
type: Node shape
subclass of: Percentile Rank
comment: This class denotes Percentile Rank Total Omission Errors

Six to Ten Light Bulbs
type: Class
type: Quality Value
type: Node shape
subclass of: Light Bulb Count
comment: A count of six to ten light bulbs
notation: 1120

Clinical Measurement
type: Class
subclass of: Measurement
definition: A quantitative or qualitative value which is the result of an act of assessing a morphological or physiological state or property in a single individual or sample or a group of individuals or samples, based on direct observation or experimental manipulation.

10^3 cells per microliter
type: unit of measurement
type: SIO_000794
notation: 10^3 cells / µL

Forced Expiratory Flow at 25-75 Percent
type: Class
type: Quality Variable
subclass of: CMO_0000094
comment: This class denotes Forced Expiratory Flow at 25-75 Percent

Morphologic Finding
type: Class
type: Node shape
subclass of: Histopathology Result
comment: A light microscopic finding that describes the cellular characteristics and architectural patterns of cell populations in a tissue sample. (Source: NCI Thesaurus)

Percentile Rank Total Inhibitory Errors
type: Class
type: Quantity Variable
type: Node shape
subclass of: Percentile Rank
comment: This class denotes Percentile Rank Total Inhibitory Errors

Flea and Tick Preventative Medicine
type: Class
type: Node shape
subclass of: chemical substance
comment: Medicine that is used on non-human animals to prevent fleas and ticks from staying on them

Eleven to Fifteen Light Bulbs
type: Class
type: Quality Value
type: Node shape
subclass of: Light Bulb Count
comment: A count of eleven to fifteen light bulbs
notation: 1121

District of Columbia, United States of America
type: geographic region
comment: The state, province, or territory of District of Columbia, United States of America
SIO_000313: Q1139046

Inpatient Encounter
type: Class
type: Quality Value
subclass of: Destination
notation: 169
definition: A patient encounter where a patient is admitted to a hospital or equivalent facility.

Maternal Antibody
type: Class
type: Node shape
subclass of: antibody
comment: Maternal antibodies are transferred from mother to child and protect neonates and infants during the time of maturation of their immune system. The vast majority of maternal antibodies are of the IgG isotype. Source: Niewiesk S. Maternal antibodies: clinical significance, mechanism of interference with immune responses, and possible vaccination strategies. Front Immunol. 2014 Sep 16;5:446. doi: 10.3389/fimmu.2014.00446. PMID: 25278941; PMCID: PMC4165321.

Zone 3: Suspicious, Borderline, or Indeterminate Periportal Pattern
type: Class
type: Quality Value
type: Node shape
subclass of: Pathology Result
subclass of: Restriction
  some values from: non-alcoholic fatty liver disease
  on property: SIO_000668
comment: This class denotes Zone 3: Suspicious, Borderline, or Indeterminate Periportal Pattern
notation: 753

Spontaneous Preterm Birth
type: Class
type: Quality Value
subclass of: Preterm Birth
subclass of: Spontaneous Labor and Birth
comment: This class denotes Spontaneous Preterm Birth
notation: 91

Social communication questionnaire
type: Class
subclass of: Questionnaire
comment: The Social Communication Questionnaire consists of 40 yes-no questions (answered by parents) to screen for autism spectrum disorders in children four years of age and older. Specifically, the questions ask about social functioning and communication skills. Two forms of the SCQ include the Lifetime and Current, which assesst behaviors for each of those periods. Theoretically derived subscales include 1) Reciprocal Social Interaction subscale, 2) Communication subscale, and 3) Restricted, Repetitive, and Stereotyped Patterns of Behavior subscale, although they have not been formally validated. Questions 20 through 40 (Lifetime) focus on behaviors occurring between the ages of 4 and 5. Total scores can range from 0 to 39 The first question is a language screening item that is not included in the final score. Total SCQ raw score of ≥ 15 is highly suggestive of ASD (Source: COGAT Ontology)

Personal Product Use
type: Class
subclass of: Study Indicator
definition: Personal Product Use Indicator Class
was approved by: PER-Jeanette-Stingone

Kentucky, United States of America
type: geographic region
comment: The state, province, or territory of Kentucky, United States of America
SIO_000313: Q1139046

Medication
type: Class
type: Quality Variable
subclass of: Prescription Medication and Dietary Supplements
notation: 142
definition: A drug product that contains one or more active and/or inactive ingredients; it is intended to treat, prevent or alleviate the symptoms of disease. This term does not refer to the individual ingredients that make up the product.

Exposure to Maternal Antibodies
type: Class
type: Quality Value
type: Node shape
subclass of: exposure
subclass of: Restriction
  some values from: Maternal Antibody
  on property: SIO_000139
comment: This class denotes exposure to maternal antibodies
notation: 639

Zone 1: Suspicious, Borderline, or Indeterminate Periportal Pattern
type: Class
type: Quality Value
type: Node shape
subclass of: Pathology Result
comment: This class denotes Zone 1: Suspicious, Borderline, or Indeterminate Periportal Pattern
notation: 749

Partial match
type: Class
subclass of: comment
comment: This class denotes Partial match

EC 3.6.3.10 (H+/K+-exchanging ATPase) inhibitor
type: Class
type: Node shape
subclass of: CHEBI_23888
comment: This class denotes EC 3.6.3.10 (H+/K+-exchanging ATPase) inhibitor

Study Followup 7
type: Class
subclass of: Study Activity
subclass of: Restriction
  some values from: Study Followup 6
  on property: intervalAfter
definition: A point in a study where data is gathered after the sixth study followup.

Mild Hepatic Portal Inflammation
type: Class
type: Quality Value
type: Node shape
subclass of: Portal Inflammation Measurement
comment: This class denotes Mild Hepatic Portal Inflammation
notation: 745
disjoint with: More Than Mild Hepatic Portal Inflammation

Above Average Condition Human Dwelling
type: Class
type: Quality Value
type: Node shape
subclass of: Human Dwelling by Physical Condition
comment: This class denotes Above Average Condition Human Dwelling
notation: 790

Akha
type: Class
type: Quality Value
type: Node shape
subclass of: Asian Non-Hispanic
comment: ethnic group in Southeast Asia (Source: Wikidata)
notation: 1226

Socioeconomic Status Index
type: Class
type: Quantity Variable
subclass of: SIO_000052
subclass of: Socioeconomic Status
definition: A measure of SES.
editorial note: This is a specific index, derived from other variables. So, it should somehow be connected to this variables. Also, we may want to be more specific about the type of index that it is. Perhaps there should be a general SESIndex and then subclasses of specific measures?

rs231775
type: Class
type: Node shape
subclass of: SNP
comment: This class denotes rs231775

Physical And Mental Assessment
type: Class
subclass of: Study Indicator
definition: Physical and Mental Assessments Indicator Class
was approved by: PER-Jeanette-Stingone

Study Followup 8
type: Class
subclass of: Study Activity
subclass of: Restriction
  some values from: Study Followup 7
  on property: intervalAfter
definition: A point in a study where data is gathered after the seventh study followup.

More Than Mild Hepatic Portal Inflammation
type: Class
type: Quality Value
type: Node shape
subclass of: Portal Inflammation Measurement
comment: This class denotes More Than Mild Hepatic Portal Inflammation
notation: 746
disjoint with: Mild Hepatic Portal Inflammation

Excellent Condition Human Dwelling
type: Class
type: Quality Value
type: Node shape
subclass of: Human Dwelling by Physical Condition
comment: This class denotes Excellent Condition Human Dwelling
notation: 793

body fat volume
type: Class
subclass of: body fat morphological measurement
comment: Any measurement of the size of the three dimensional space occupied by fat in the body of an organism. (Source: Clinical Measurement Ontology)

Solid-Phase Sandwich ELISA
type: Class
subclass of: Sandwich ELISA
comment: This class denotes Solid-Phase Sandwich ELISA
was approved by: PER-Jim-McCusker

4-hydroxyphenanthrene
type: Class
type: Facet Value
subclass of: polycyclic hydrocarbon
comment: This class denotes 4-hydroxyphenanthrene
notation: PHEN4

Physical Activity and Fitness
type: Class
subclass of: Study Indicator
definition: Physical Activity and Fitness Indicator Class
was approved by: PER-Jeanette-Stingone

mono (5-carboxy-2-ethylpentyl) phthalate (DEHP)
type: Class
type: Facet Value
subclass of: Phthalate
comment: This class denotes mono (5-carboxy-2-ethylpentyl) phthalate (DEHP)
notation: MECPP

Barium
type: Class
type: Facet Value
subclass of: Metal
subclass of: HHEAR_01387
notation: Ba
definition: BARIUM is an element of the alkaline earth group of metals. It has an atomic symbol Ba, atomic number 56, and atomic weight 138. All of its acid-soluble salts are poisonous.

Study Followup 5
type: Class
subclass of: Study Activity
subclass of: Restriction
  some values from: Study Followup 4
  on property: intervalAfter
definition: A point in a study where data is gathered after the fourth study followup.

Many Ballooning Hepatocytes Measurement
type: Class
type: Quality Value
type: Node shape
subclass of: Hepatocellular Ballooning Measurement
comment: This class denotes a measurement of many ballooning hepatocytes
notation: 744
disjoint with: Few Ballooning Hepatocytes Measurement

Below Average Condition Human Dwelling
type: Class
type: Quality Value
type: Node shape
subclass of: Human Dwelling by Physical Condition
comment: This class denotes Below Average Condition Human Dwelling
notation: 792

N-Acetyl-S- (3-hydroxypropyl)-L-cysteine
type: Class
type: Facet Value
subclass of: Volatile Organic Compound
comment: This class denotes N-Acetyl-S- (3-hydroxypropyl)-L-cysteine
notation: HPMA
editorial note: To Do: align with CHEBI.

behaviour
type: Class
subclass of: Physical And Mental Assessment
comment: This class denotes behaviour

Room Count
type: Class
type: Quantity Variable
subclass of: SIO_000794
subclass of: Housing Characteristic
definition: Total Number of Rooms in the Home
was approved by: PER-Jeanette-Stingone

Overloaded filter
type: Class
subclass of: comment
comment: This class denotes Overloaded filter

adult respiratory distress syndrome
type: Class
type: Quality Value
subclass of: phenotype
comment: This class denotes adult respiratory distress syndrome
notation: 385

Study Followup 6
type: Class
subclass of: Study Activity
subclass of: Restriction
  some values from: Study Followup 5
  on property: intervalAfter
definition: A point in a study where data is gathered after the fifth study followup.

Portal Inflammation Measurement
type: Class
type: Quality Variable
type: Node shape
subclass of: Measurement
subclass of: Restriction
  some values from: Portal Inflammation Assessment
  on property: SIO_000215
comment: A measurement from a Portal Inflammation Assessment
equivalent class: Class
  intersection of: Measurement
  intersection of: Restriction
    some values from: Portal Inflammation Assessment
    on property: SIO_000215
  equivalent class: Portal Inflammation Measurement

Average Condition Human Dwelling
type: Class
type: Quality Value
type: Node shape
subclass of: Human Dwelling by Physical Condition
comment: This class denotes Average Condition Human Dwelling
notation: 791

N-Acetyl-S-(1, 2-dichlorovinyl)-L-cysteine
type: Class
type: Facet Value
subclass of: Volatile Organic Compound
comment: This class denotes N-Acetyl-S-(1, 2-dichlorovinyl)-L-cysteine
notation: DCVMA12
editorial note: To Do: align with CHEBI.

SYNAPT G2-Si Mass Spectrometer
type: Class
subclass of: HHEAR_00189
comment: This class denotes SYNAPT G2-Si Mass Spectrometer
was approved by: PER-Jim-McCusker

Oral Health
type: Class
subclass of: Study Indicator
definition: Oral Health Indicator Class
was approved by: PER-Jeanette-Stingone

Human Dwelling by Physical Condition
type: Class
type: Node shape
subclass of: Human Dwelling
comment: This class denotes Human Dwelling by Physical Condition

agreement quality
type: Class
subclass of: Thing
comment: This class denotes agreement quality

United States Virgin Islands, United States of America
type: geographic region
comment: The state, province, or territory of United States Virgin Islands, United States of America
SIO_000313: United States of America

N-Acetyl-S- (2-carboxyethyl)-L-cysteine
type: Class
type: Facet Value
subclass of: Volatile Organic Compound
comment: This class denotes N-Acetyl-S- (2-carboxyethyl)-L-cysteine
notation: CEMA
editorial note: To Do: align with CHEBI.

community
type: Class
subclass of: Thing
comment: This class denotes community

Pregnancy Sample
type: Class
subclass of: HHEAR_00177
definition: A sample that is taken at or near pregnancy or birth.

anti-inflammatory agent
type: Class
subclass of: Thing
comment: This class denotes anti-inflammatory agent

Parental Health and Family History
type: Class
subclass of: Study Indicator
definition: Parental Health and Family History Indicator Class
was approved by: PER-Jeanette-Stingone

Hepatocellular Ballooning Measurement
type: Class
type: Quality Variable
type: Node shape
subclass of: Measurement
subclass of: Restriction
  some values from: Hepatocellular Ballooning Assessment
  on property: SIO_000215
comment: A measurement from a hepatocellular ballooning assessment

Few Ballooning Hepatocytes Measurement
type: Class
type: Quality Value
type: Node shape
subclass of: Hepatocellular Ballooning Measurement
comment: This class denotes a measurement of few ballooning hepatocytes
notation: 743
disjoint with: Many Ballooning Hepatocytes Measurement

Mallory Bodies Present
type: Class
type: Quality Value
type: Node shape
subclass of: Morphologic Finding
comment: A morphologic finding indicating the presence of Mallory bodies in the liver parenchyma. Mallory bodies are eosinophilic cytoplasmic inclusions in the hepatocytes. They contain filaments and are present in the liver parenchyma of patients with various liver disorders including alcoholic liver disease, Wilson disease, and primary biliary cirrhosis. (Source: NCI Thesaurus)
notation: 757

Extremely Poor Condition Human Dwelling
type: Class
type: Quality Value
type: Node shape
subclass of: Human Dwelling by Physical Condition
comment: This class denotes Extremely Poor Condition Human Dwelling
notation: 794

N-Acetyl-S- (3, 4-dihydroxybutyl)-L-cysteine
type: Class
type: Facet Value
subclass of: Volatile Organic Compound
comment: This class denotes N-Acetyl-S- (3, 4-dihydroxybutyl)-L-cysteine
notation: DHBMA
editorial note: To Do: align with CHEBI.

RNA Sequencing
type: Class
subclass of: Nucleic Acid Sequencing
comment: This class denotes RNA Sequencing

on property: minValue
has value: 3751

Panel change
type: Class
subclass of: comment
comment: This class denotes Panel change

chemical substance
type: Class
subclass of: Thing
comment: This class denotes chemical substance

N-methyl Perfluorooctane sulfonamido acetic acid
type: Class
type: Facet Value
subclass of: Perfluoroakyl and Polyfluoroalkyl Substance
comment: This class denotes N-methyl Perfluorooctane sulfonamido acetic acid
notation: NMFOSAA

beta-carotene
type: Class
type: Node shape
type: Facet Value
subclass of: HHEAR_01390
comment: A cyclic carotene obtained by dimerisation of all-trans-retinol. A strongly-coloured red-orange pigment abundant in plants and fruit and the most active and important provitamin A carotenoid. (Source: ChEBI)
notation: BCAR

Mono(2-propyl-6-carboxyhexyl) phthalate
type: Class
type: Node shape
type: Facet Value
subclass of: Phthalate
comment: This class denotes Mono(2-propyl-6-carboxyhexyl) phthalate
notation: MPCHP

PROMIS Pediatric Instrument Bank
type: Class
type: Node shape
subclass of: Questionnaire
subclass of: Restriction
  some values from: PROMIS Questionnaire Response
  on property: SIO_000059
comment: This class denotes PROMIS Pediatric Instrument Bank

BRIEF Metacognition Index
type: Class
type: Node shape
subclass of: NCIT C121459
comment: An index in in the Behavior Rating Inventory of Executive Function (BRIEF) that measures the metacognition of a subject

Functional Status Respiratory Status Score Below 2
type: Class
type: Quality Value
subclass of: Functional Status Respiratory Status Score
comment: This class denotes Functional Status Respiratory Status Score Below 2
notation: 367

Tanner Scale For Male Pubic Hair Development
type: Class
type: Node shape
subclass of: Tanner Scale For Pubic Hair Development
comment: This class denotes Tanner Scale For Male Pubic Hair Development

Class
intersection of: SIO_001114
intersection of: Restriction
  on property: SIO_000300
  has value: 14

Chiapas, Mexico
type: geographic region
comment: The state, province, or territory of Chiapas, Mexico
SIO_000313: Q96

hemoglobin measurement
type: Class
subclass of: concentration
comment: This class denotes hemoglobin measurement

White
type: Class
type: Quality Value
type: Facet Value
subclass of: race
notation: 102
definition: A person having origins in any of the original peoples of Europe, the Middle East, or North Africa.
was approved by: PER-Jeanette-Stingone

Comorbidity Disease
type: Class
type: Quality Value
subclass of: Disease
comment: This class denotes Comorbidity Disease
notation: 363

PROMIS Pediatric Psychological Stress Experiences
type: Class
type: Node shape
subclass of: PROMIS Pediatric Instrument Bank
comment: This class denotes PROMIS Pediatric Psychological Stress Experiences

BRIEF Behavioral Regulation Scale
type: Class
type: Node shape
subclass of: NCIT C121459
comment: A scale in in the Behavior Rating Inventory of Executive Function (BRIEF) that measures the behavioral regulation of a subject

Homeostatic Model Assessment of Insulin Resistance
type: Class
subclass of: Physical And Mental Assessment
comment: This class denotes Homeostatic Model Assessment of Insulin Resistance

on property: currency
has value: USD

Tanner Scale For Female Pubic Hair Development
type: Class
type: Node shape
subclass of: Tanner Scale For Pubic Hair Development
comment: This class denotes Tanner Scale For Female Pubic Hair Development

Argentina
type: geographic region
comment: The country of Argentina
SIO_000313: Outside United States

Study Followup 3
type: Class
subclass of: Study Activity
subclass of: Restriction
  some values from: Study Followup 2
  on property: intervalAfter
definition: A point in a study where data is gathered after the second study followup.

Employment in Medical Field
type: Class
type: Quality Value
type: Node shape
subclass of: Employment
subclass of: medical role
comment: Employment in some medical field
notation: 449
equivalent class: Class
  equivalent class: Employment in Medical Field
disjoint with: Employment not in Medical Field

Tanner Genital Development Stage IV
type: Class
type: Quality Value
type: Node shape
subclass of: Tanner Scale For Genital Development
comment: testicular volume between 12 and 20 ml; scrotum enlarges further and darkens; penis increases in length (12.5–14) Source: Adolescent health care : a practical guide. Neinstein, Lawrence S., Neinstein, Lawrence S. (5th ed.). Philadelphia: Lippincott Williams & Wilkins. 2008. ISBN 9780781792561. OCLC 148727849.
notation: 684

Chest Tube
type: Class
type: Node shape
subclass of: Medical Device
comment: A hollow tube that is inserted into the pleural space through a surgical incision in the chest wall. [Definition Source: NCI]

on property: maxValue
has value: 74999

Drank At Least 6 to 8 Alcoholic Drinks On Days When Drinking Or Four Or More Drinks At Least 2 to 3 Times Per Month
type: Class
type: Quality Value
type: Node shape
subclass of: Frequency of Alcohol Consumption
comment: Indicates that a subject drink at least 6-8 drinks on days they drink or 4+ drinks at a single sitting at least 2-3 times a month.
notation: 1165

Study Followup 4
type: Class
subclass of: Study Activity
subclass of: Restriction
  some values from: Study Followup 3
  on property: intervalAfter
definition: A point in a study where data is gathered after the third study followup.

Functional Status Respiratory Status Score 2 or Above
type: Class
type: Quality Value
subclass of: Functional Status Respiratory Status Score
comment: This class denotes Functional Status Respiratory Status Score 2 or Above
notation: 366

High School or Some College
type: Class
type: Quality Value
type: Node shape
subclass of: Education
comment: High school or some college educational status
notation: 450
equivalent class: Class
  union of: Graduated From High School
  union of: Some College
  equivalent class: High School or Some College

Tanner Genital Development Stage V
type: Class
type: Quality Value
type: Node shape
subclass of: Tanner Scale For Genital Development
comment: testicular volume greater than 20 ml; adult scrotum and penis (14+) Source: Adolescent health care : a practical guide. Neinstein, Lawrence S., Neinstein, Lawrence S. (5th ed.). Philadelphia: Lippincott Williams & Wilkins. 2008. ISBN 9780781792561. OCLC 148727849.
notation: 590

bone marrow proteoglycan proteolytic cleavage product
type: Class
type: Node shape
subclass of: SIO_010363
comment: This class denotes bone marrow proteoglycan proteolytic cleavage product

Has Not Provided a Stool Sample
type: Class
type: Quality Value
type: Node shape
subclass of: Measurement
comment: A subject has not provided a stool sample for analysis.
notation: 637
disjoint with: Has Provided a Stool Sample

Liver Biopsy During Childhood
type: Class
type: Node shape
subclass of: Liver Biopsy
subclass of: Restriction
  some values from: Childhood Period
  on property: intervalDuring
comment: The collection of tissue from a subject's liver that occurs during the subject's childhood period

cis-Permethrin
type: Class
type: Node shape
subclass of: carboxylic ester
comment: A pyrethroid insecticide commonly used in the treatment of LICE INFESTATIONS and SCABIES. (Source MeSH Ontology)
notation: CPERM

Annual Income $100,000 to $124,999
type: Class
type: Quality Value
type: Node shape
subclass of: Annual Income $100,000 to $149,999
subclass of:
  on property: SIO_000900
  has value: year
subclass of:
  on property: currency
  has value: USD
subclass of:
  on property: maxValue
  has value: 124999
comment: This class denotes Annual Income $100,000 to $124,999
notation: 446

No preservative added
type: Class
subclass of: comment
comment: This class denotes No preservative added

Short Stay
type: Class
type: Quality Value
subclass of: Destination
notation: 170
definition: A patient encounter where the patient is admitted to a health care facility for a predetermined length of time, usually less than 24 hours. [def-source:

Study Followup 2
type: Class
subclass of: Study Activity
definition: A point in a study where data is gathered after the first study followup.

Annual Income More Than $125,000
type: Class
type: Quality Value
type: Node shape
subclass of: HHEAR_00545
subclass of:
  on property: minValue
  has value: 125000
subclass of:
  on property: currency
  has value: USD
subclass of:
  on property: maxValue
subclass of:
  on property: SIO_000900
  has value: year
comment: This class denotes Annual Income More Than $125,000
notation: 447

Tanner Genital Development Stage III
type: Class
type: Quality Value
type: Node shape
subclass of: Tanner Scale For Genital Development
comment: testicular volume between 6 and 12 ml; scrotum enlarges further; penis begins to lengthen (11–12.5) Source: Adolescent health care : a practical guide. Neinstein, Lawrence S., Neinstein, Lawrence S. (5th ed.). Philadelphia: Lippincott Williams & Wilkins. 2008. ISBN 9780781792561. OCLC 148727849.
notation: 591

No Hct, Hct=40 assumed
type: Class
subclass of: comment
comment: This class denotes No Hct, Hct=40 assumed

Total Breast Area
type: Class
type: Quantity Variable
type: Node shape
subclass of: Physical And Mental Assessment
subclass of: surface area
comment: The total surface area of a human breast

Serum Collection
type: Class
type: Quality Value
type: Node shape
subclass of: Biospecimen Collection
comment: A time interval during which serum blood is collected from a subject
notation: 925

Medical Therapy Procedure
type: Class
type: Quality Variable
subclass of: medical procedure
definition: Medical Therapy Procedure to aide in treatment.
was approved by: PER-Jeanette-Stingone

Estonia
type: geographic region
comment: The country of Estonia
SIO_000313: Outside United States

Congenital Abnormality
type: Class
type: Quality Value
subclass of: Disease
subclass of: Congenital anomaly or chromosomal defect
comment: This class denotes Congenital Abnormality
notation: 1076

Obvious coarse debris
type: Class
subclass of: comment
comment: This class denotes Obvious coarse debris

Peru
type: geographic region
comment: The country of Peru
SIO_000313: Outside United States

compound eye retinal cell
type: Class
subclass of: Cell
comment: This class denotes compound eye retinal cell

Has Provided a Stool Sample
type: Class
type: Quality Value
type: Node shape
subclass of: Measurement
comment: A subject has provided a stool sample for analysis
notation: 636
disjoint with: Has Not Provided a Stool Sample

Serum Collection During Childhood
type: Class
type: Node shape
subclass of: Serum Collection
comment: A time interval during which serum blood is collected from a subject that occurs during the subject's childhood period
equivalent class: Class
  intersection of: Serum Collection
  equivalent class: Serum Collection During Childhood

Mometasone HFA (Asmanex HFA)
type: Class
subclass of: Asthma Controller Medication
comment: This class denotes Mometasone HFA (Asmanex HFA)

octadecanoic acid
type: Class
type: Facet Value
subclass of: Fatty Acid
notation: C180
definition: A C18 straight-chain saturated fatty acid component of many animal and vegetable lipids. As well as in the diet, it is used in hardening soaps, softening plastics and in making cosmetics, candles and plastics.

Not Current Student
type: Class
type: Quality Value
subclass of: Education
notation: 141
definition: The state of an individual not currently engaged in educational activity as a pupil.

Post Ventilation Childhood Followup 2
type: Class
subclass of: HHEAR_00670
comment: A second follow-up evaluation that occurs after the subject has been removed from artificial ventilation.

Mean Concentration Range 200 - 500 ng/mL
type: Class
type: Quality Value
subclass of: HHEAR_00527
subclass of: Restriction
  on property: SIO_000221
  has value: UO_0000275
subclass of: Restriction
  some values from: Class
  on property: SIO_000216
subclass of: Restriction
  some values from: Class
  on property: SIO_000216
comment: This class denotes Mean Concentration Range 200 - 500 ng/mL
notation: 320

Pregnancy Outcome By Fetal Status
type: Class
type: Node shape
subclass of: NCIT C90491
comment: This class denotes pregnancy outcome by fetal status

Residential Building Without Heating
type: Class
type: Node shape
subclass of: Residential Building
subclass of: Class
  complement of: Restriction
    some values from: heating equipment
    on property: SIO_000028
comment: A residential building that does not have heating equipment to warm the living areas
disjoint with: Residential Building With Heating

Tlaxcala, Mexico
type: geographic region
comment: The state, province, or territory of Tlaxcala, Mexico
SIO_000313: Q96

BRIEF Organization of Materials Scale
type: Class
type: Node shape
subclass of: BRIEF Metacognition Index
comment: A scale that measure's a subject's ability to put order in work, play and storage spaces (e.g., desks, lockers, backpacks, and bedrooms).

neuron
type: Class
subclass of: Cell
comment: These cells are also reportedly CD4-negative and CD200-positive. They are also capable of producing CD40L and IFN-gamma. (Source: CL Ontology)

Percentile Rank
type: Class
type: Node shape
subclass of: STATO_0000293
comment: The percentile rank (PR) of a given score is the percentage of scores in its frequency distribution that are less than that score. (Source: https://en.wikipedia.org/wiki/Percentile_rank)

metribuzin
type: Class
type: Node shape
type: Facet Value
subclass of: HHEAR_01374
comment: A member of the class of 1,2,4-triazines that is 1,2,4-triazin-5(4H)-one substituted by an amino group at position 4, tert-butyl group at position 6 and a methylsulfanyl group at position 3. Source: ChEBI
notation: METB

Mean Concentration Range 500 - 1000 ng/mL
type: Class
type: Quality Value
subclass of: HHEAR_00527
subclass of: Restriction
  on property: SIO_000216
subclass of: Restriction
  on property: SIO_000221
  has value: UO_0000275
comment: This class denotes Mean Concentration Range 500 - 1000 ng/mL
notation: 321

sulfoxaflor
type: Class
type: Node shape
type: Facet Value
subclass of: HHEAR_01374
comment: A mixture of the four diastereoisomers arising from the two tetrahedral stereocentres of [methyl(oxido){1-[6-(trifluoromethyl)pyridin-3-yl]ethyl}-λ6-sulfanylidene]cyanamide (the sulfur atom and the carbon attached to position 3 of the pyridine ring). [Both E- and Z-isomers involving the S=N double bond and the cyano group exist, but they interconvert rapidly at r.t.]. A nicotinic acetylcholine receptor agonist in insects, sulfoxaflor is used as an insecticide, particularly for the control of aphids. Source: ChEBI
notation: SUF

Uses Pesticide
type: Class
type: Quality Value
type: Node shape
subclass of: Pesticide Usage Exposure
comment: Currently uses or has recently used some pesticide
notation: 1021

Percentile Rank Total Correct
type: Class
type: Quantity Variable
type: Node shape
subclass of: Percentile Rank
comment: This class denotes Percentile Rank Total Correct

Five or Fewer Light Bulbs
type: Class
type: Quality Value
type: Node shape
subclass of: Light Bulb Count
comment: A count of five or fewer light bulbs
notation: 1119

femtomolar
type: unit of measurement
notation: fM

Home Medical Technology
type: Class
type: Quality Value
subclass of: medical intervention
comment: This class denotes Home Medical Technology
notation: 364

Mean Concentration Range 30 - 100 ng/mL
type: Class
type: Quality Value
subclass of: HHEAR_00527
subclass of: Restriction
  on property: SIO_000221
  has value: UO_0000275
subclass of: Restriction
  some values from: Class
    intersection of: SIO_001114
    intersection of: Restriction
      on property: SIO_000300
      has value: 100.0
  on property: SIO_000216
subclass of: Restriction
  some values from: Class
    intersection of: SIO_001113
  on property: SIO_000216
comment: This class denotes Mean Concentration Range 30 - 100 ng/mL
notation: 318

Drank Six or More Alcoholic Drinks
type: Class
type: Quality Value
type: Node shape
subclass of: Quantity of Alcohol Consumption
comment: drank six or more alcoholic drinks
notation: 1017

Tuvalu
type: geographic region
comment: The country of Tuvalu
SIO_000313: Outside United States

Bathroom With Shower Count
type: Class
type: Node shape
subclass of: Bathroom Count
comment: The total number of bathrooms that include a shower in a house

BRIEF Working Memory Scale
type: Class
type: Node shape
subclass of: BRIEF Metacognition Index
comment: A scale that measure's a subject's ability to hold information when completing a task, when encoding information, or when generating goals/plans in a sequential manner.

mole fraction
type: unit of measurement
notation: chi

social domain measurement
type: Class
type: Node shape
subclass of: Measurement
comment: A measurement of some aspect of psychological systems for social processes e.g. those that mediate responses in interpersonal settings of various types, including perception and interpretation of others’ actions. Based on the NIH NIMH's research domain criteria (RDoC). https://www.nimh.nih.gov/research-priorities/rdoc/definitions-of-the-rdoc-domains-and-constructs.shtml (Source: EFO Ontology)

Inhibition Switching Subscale
type: Class
type: Node shape
subclass of: Inhibition Subtest
comment: The Inhibition Switching subscale

Thai
type: Class
type: Quality Value
type: Node shape
subclass of: Asian Non-Hispanic
comment: Denotes the inhabitants of Thailand, a person from there, or their descendants elsewhere. (Source: NCI Thesaurus)
notation: 1222

Tanner Female Pubic Hair Development Stage IV
type: Class
type: Quality Value
type: Node shape
subclass of: Tanner Scale For Female Pubic Hair Development
comment: adult-like hair quality, extending across pubis but sparing medial thighs (13–15) Source: Adolescent health care : a practical guide. Neinstein, Lawrence S., Neinstein, Lawrence S. (5th ed.). Philadelphia: Lippincott Williams & Wilkins. 2008. ISBN 9780781792561. OCLC 148727849.
notation: 680

Mean Concentration Range 100 - 200 ng/mL
type: Class
type: Quality Value
subclass of: HHEAR_00527
subclass of: Restriction
  some values from: Class
    intersection of: SIO_001113
    intersection of: Restriction
      on property: SIO_000300
      has value: 100.0
  on property: SIO_000216
subclass of: Restriction
  on property: SIO_000221
  has value: UO_0000275
comment: This class denotes Mean Concentration Range 100 - 200 ng/mL
notation: 319

Post Ventilation Childhood Followup
type: Class
subclass of: HHEAR_00553
comment: A follow-up evaluation that occurs after the subject has been removed from artificial ventilation.

Pregnancy Outcome By Birth Count
type: Class
type: Node shape
subclass of: SIO_000794
subclass of: NCIT C90491
comment: This class denotes pregnancy outcome by birth count

Monoisopropyl phthalate
type: Class
type: Facet Value
subclass of: Phthalate
comment: This class denotes Monoisopropyl phthalate
notation: MiPP

Residential Building With Heating
type: Class
type: Node shape
subclass of: Residential Building
subclass of: Restriction
  some values from: heating equipment
  on property: SIO_000028
comment: A residential building that contains equipment for heating the living areas
equivalent class: Class
  intersection of: Residential Building
  intersection of: Restriction
    some values from: heating equipment
    on property: SIO_000028
  equivalent class: Residential Building With Heating
disjoint with: Residential Building Without Heating

BRIEF Plan/Organize Scale
type: Class
type: Node shape
subclass of: BRIEF Metacognition Index
comment: A scale that measure's a subject's ability to anticipate future events; to set goals; to develop steps; to grasp main ideas; to organize and understand the main points in written or verbal presentations.

normal
type: unit of measurement
notation: Norm

body morphological measurement
type: Class
subclass of: Clinical Measurement
comment: Measurement of the structure or forms of the entire body or parts of the body of an organism. (Source: Clinical Measurement Ontology)

Inhibition Inhibition Subscale
type: Class
type: Node shape
subclass of: Inhibition Subtest
comment: The Inhibition Inhibition subscale

on property: maxValue
has value: 2917

PROMIS Psychological Stress Experiences Response
type: Class
type: Node shape
subclass of: PROMIS Questionnaire Response
comment: A response to a PROMIS Pediatric Psychological Stress Experiences question

Tonga
type: geographic region
comment: The country of Tonga
SIO_000313: Outside United States

Pediatric Risk of Mortality Score (PRISM III)
type: Class
subclass of: Physical And Mental Assessment
subclass of: score
comment: "The PRISM III score has 17 physiologic variables subdivided into 26 ranges. The variables most predictive of mortality were minimum systolic blood pressure, abnormal pupillary reflexes, and stupor/coma. Other risk factors, including two acute and two chronic diagnoses, and four additional risk factors, were used in the final predictors." (See skos:editorialNote for reference)
editorial note: This concept is taken from PRISM III: an updated Pediatric Risk of Mortality score M M Pollack 1, K M Patel, U E Ruttimann PMID: 8706448 DOI: 10.1097/00003246-199605000-00004 https://pubmed.ncbi.nlm.nih.gov/8706448/

Mean Concentration Range 0 - 10 ng/mL
type: Class
type: Quality Value
subclass of: HHEAR_00527
subclass of: Restriction
  some values from: Class
    intersection of: SIO_001114
    intersection of: Restriction
      on property: SIO_000300
      has value: 10.0
  on property: SIO_000216
subclass of: Restriction
  on property: SIO_000221
  has value: UO_0000275
comment: This class denotes Mean Concentration Range 0 - 10 ng/mL
notation: 316

FEF 25-75 Best Value (pre-bronchodilator administration)
type: Class
type: Quantity Variable
subclass of: FEF 25-75 Best Value
comment: This class denotes FEF 25-75 Best Value (pre-bronchodilator administration)

BRIEF Emotional Control Scale
type: Class
type: Node shape
subclass of: BRIEF Behavioral Regulation Scale
comment: A scale that measure's a subject's ability to regulate emotional responses appropriately.

Navassa Island, United States of America
type: geographic region
comment: The state, province, or territory of Navassa Island, United States of America
SIO_000313: United States of America

radian per second per second
type: unit of measurement
notation: alpha

Vitamin
type: Class
subclass of: Drug, Food, Chemical or Biomedical Material
comment: This class denotes Vitamin

Inhibition Subtest
type: Class
type: Node shape
subclass of: Attention and Executive Functioning Domain
comment: The Inhibition subtest in the Attention and Executive Functioning Domain of the Developmental Neuropsychological Assessment (NEPSY-II)

Datatype
with restrictions:
  min inclusive: 15
on datatype: integer

Tanner Female Pubic Hair Development Stage II
type: Class
type: Quality Value
type: Node shape
subclass of: Tanner Scale For Female Pubic Hair Development
comment: small amount of long, downy hair with slight pigmentation on the labia majora (10–11.5) Source: Adolescent health care : a practical guide. Neinstein, Lawrence S., Neinstein, Lawrence S. (5th ed.). Philadelphia: Lippincott Williams & Wilkins. 2008. ISBN 9780781792561. OCLC 148727849.
notation: 583

Home Ventilation
type: Class
subclass of: Home Medical Technology
subclass of: artificial respiration
comment: This class denotes Home Ventilation

I Felt Stressed Response
type: Class
type: Quality Variable
type: Node shape
subclass of: PROMIS Psychological Stress Experiences Response
comment: A response to the question "I felt stressed" in the PROMIS Questionnaire

Number of Living Children
type: Class
type: Quantity Variable
type: Node shape
subclass of: Demographic
subclass of: SIO_000794
comment: The number of living children for a subject at a point in time

Season
type: Class
type: Quality Value
subclass of: NCIT C170964
comment: This class denotes Season
notation: 209

Mean Concentration Range 10 - 30 ng/mL
type: Class
type: Quality Value
subclass of: HHEAR_00527
subclass of: Restriction
  some values from: Class
    intersection of: SIO_001113
    intersection of: Restriction
      on property: SIO_000300
      has value: 10.0
  on property: SIO_000216
comment: This class denotes Mean Concentration Range 10 - 30 ng/mL
notation: 317

BRIEF Initiate Scale
type: Class
type: Node shape
subclass of: BRIEF Metacognition Index
comment: A scale that measure's a subject's ability to begin an activity and to independently generate ideas or problem-solving strategies.

Histidine-rich protein PFHRP-II
type: Class
subclass of: Protein
comment: This class denotes Histidine-rich protein PFHRP-II

Drank Three to Five Alcoholic Drinks
type: Class
type: Quality Value
type: Node shape
subclass of: Quantity of Alcohol Consumption
comment: drank three to five alcoholic drinks
notation: 1016

Phthalate
type: Class
type: Facet
subclass of: Targeted Analyte
comment: This class denotes Phthalate
notation: UPHTH

meter per second per second
type: unit of measurement
notation: m/s2

Inhibition Naming Subscale
type: Class
type: Node shape
subclass of: Inhibition Subtest
comment: The Inhibition Naming subscale

Tanner Female Pubic Hair Development Stage III
type: Class
type: Quality Value
type: Node shape
subclass of: Tanner Scale For Female Pubic Hair Development
comment: hair becomes more coarse and curly, and begins to extend laterally (11.5–13) Source: Adolescent health care : a practical guide. Neinstein, Lawrence S., Neinstein, Lawrence S. (5th ed.). Philadelphia: Lippincott Williams & Wilkins. 2008. ISBN 9780781792561. OCLC 148727849.
notation: 584

Mississippi, United States of America
type: geographic region
comment: The state, province, or territory of Mississippi, United States of America
SIO_000313: Q1139046

(9Z)-hexadecenoic acid
type: Class
type: Facet Value
subclass of: Fatty Acid
notation: C161N7
definition: A hexadecenoic acid with a cis-double bond at position C-9.

Antibiotic Score
type: Class
subclass of: score
subclass of: Prescription Medication and Dietary Supplements
comment: Antibiotic Score is the total coverage score that was based on whether the antibiotic included coverage against gram-positive bacteria, gram-negative bacteria and/or anaerobic bacteria. Coverage in each area was graded on a 3-point scale: 0 for no activity, 1 for narrow activity, and 2 for broad activity. For patients treated with multiple antibiotics simultaneously, the score for each antibiotic received on a given day was summed. Cumulative scores were summed across days.

5+ Years of College, Technical, or Vocational Training
type: Class
type: Quality Value
subclass of: Some College or Technical School
comment: This class denotes 5+ Years of College, Technical, or Vocational Training
notation: 315

BRIEF Inhibit Scale
type: Class
type: Node shape
subclass of: BRIEF Behavioral Regulation Scale
comment: A scale that measure's a subject's ability to control impulses and to stop engaging in a behavior.

Questionnaire Response
type: Class
type: Node shape
subclass of: SIO_000785
comment: A response to a question in a questionnaire

organic heterocyclic compound
type: Class
subclass of: Thing
comment: This class denotes organic heterocyclic compound

Asthma Severity
type: Class
type: Node shape
subclass of: Clinical Observations Severity
comment: A rating or measure of the severity of acute or chronic asthma in a subject

District of Keewatin, Canada
type: geographic region
comment: The state, province, or territory of District of Keewatin, Canada
SIO_000313: Canada

Lymphocyte
type: Class
subclass of: Leukocyte
definition: A lymphocyte is a leukocyte commonly found in the blood and lymph that has the characteristics of a large nucleus, a neutral staining cytoplasm, and prominent heterochromatin.

cholesterol
type: Class
type: Node shape
type: Facet Value
subclass of: HHEAR_01391
comment: This class denotes cholesterol
notation: CHOL

Tanner Scale For Female Pubic Hair Development (Assigned By Child's Mother)
type: Class
type: Quality Variable
type: Node shape
subclass of: Tanner Scale For Female Pubic Hair Development
comment: A rating of the Tanner Scale for Female Pubic Hair Development as assigned by the child's mother

Laboratory Facility
type: Class
type: Quality Value
type: Node shape
subclass of: Workplace
comment: A research facility in which systems of manufactured products control internal conditions and in which scientific or technological research, experiments, and measurement may be performed. (Source: Environment Ontology)
notation: 975

Corticosteroid Burst
type: Class
type: Quantity Variable
subclass of: Prescription Medication and Dietary Supplements
subclass of: medical intervention
subclass of: Restriction
  some values from: SIO_000393
  on property: SIO_000291
subclass of: Restriction
  some values from: corticosteroid
  on property: SIO_000230
comment: This class denotes Corticosteroid Burst

BRIEF Shift Scale
type: Class
type: Node shape
subclass of: BRIEF Behavioral Regulation Scale
comment: A scale that measure's a subject's ability to move freely from one activity or situation to another, to tolerate change, or to switch or alternate attention.

Toluene
type: Class
type: Facet Value
subclass of: Volatile Organic Compound
notation: TOL
definition: Toluene is a widely used industrial solvent.

duration hospital admission to urine sample
type: Class
type: Quantity Variable
subclass of: Physical And Mental Assessment
subclass of: duration
comment: This class denotes duration hospital admission to urine sample

PROMIS Questionnaire Response
type: Class
type: Node shape
subclass of: Physical And Mental Assessment
subclass of: Questionnaire Response
comment: A response to a question in the PROMIS questionnaire See also <http://purl.bioontology.org/ontology/LNC/LP102768-1>

Hospitalization
type: Class
type: Quality Value
subclass of: medical procedure
subclass of: HHEAR_00188
notation: 104
definition: Admission to a hospital

FEF 25-75 Best Value (post-bronchodilator administration)
type: Class
type: Quantity Variable
subclass of: FEF 25-75 Best Value
comment: This class denotes FEF 25-75 Best Value (post-bronchodilator administration)

radian per second
type: unit of measurement
notation: rad/s

Tanner Female Pubic Hair Development Stage I
type: Class
type: Quality Value
type: Node shape
subclass of: Tanner Scale For Female Pubic Hair Development
comment: no pubic hair at all (prepubertal) (typically age 10 and younger) Source: Adolescent health care : a practical guide. Neinstein, Lawrence S., Neinstein, Lawrence S. (5th ed.). Philadelphia: Lippincott Williams & Wilkins. 2008. ISBN 9780781792561. OCLC 148727849.
notation: 587

Focus Group
type: Class
type: Node shape
subclass of: collective
comment: A small, usually diverse group of people whose response to something is studied to determine the response that can be expected from a larger population. It is used especially in market research and political analysis. (Source: NCI Thesaurus)

Monthly Income SRD 1500 - 2999
type: Class
type: Node shape
subclass of: Household Income - Monthly - Suriname
subclass of:
  on property: SIO_000900
  has value: SIO_000429
subclass of:
  on property: currency
  has value: SRD
subclass of:
  on property: maxValue
  has value: 2999
subclass of:
  on property: minValue
  has value: 1500
comment: 1500 to 2999 Suriname Dollars [SRD]
notation: 821

N,N-diethyl-m-toluamide
type: Class
type: Node shape
type: Facet Value
subclass of: HHEAR_01374
comment: A monocarboxylic acid amide resulting from the formal condensation of the carboxy group of m-toluic acid with the nitrogen of diethylamine. First developed by the U.S. Army in 1946 for use by military personnel in insect-infested areas, it is the most widely used insect repellent worldwide. Source: ChEBI
notation: DEET

Parent
type: Class
subclass of: Ancestor
subclass of: Restriction
  on property: SIO_000668
  all values from: Class
    intersection of: Restriction
      on property: SIO_000228
      all values from: Child
    intersection of: SIO_000485
definition: A parent is the caretaker of a child (where "child" refers to offspring, not necessarily age). A biological parent is a person whose gamete resulted in a child, a male through the sperm, and a female through the ovum. Parents are first-degree relatives and have 50% genetic meet. A female can also become a parent through surrogacy. Some parents may be adoptive parents, who nurture and raise an offspring, but are not actually biologically related to the child. Orphans without adoptive parents can be raised by their grandparents or other family members.
was approved by: PER-Jeanette-Stingone

Drank No Alcoholic Drinks
type: Class
type: Quality Value
type: Node shape
subclass of: Did Not Consume Alcohol
subclass of: Quantity of Alcohol Consumption
comment: drank no alcoholic drinks
notation: 1015

Whole Blood
type: Class
type: Facet
subclass of: UBERON_0006314
definition: A fluid that is composed of blood plasma and erythrocytes. [database_cross_reference: http://orcid.org/0000-0002-6601-2165][database_cross_reference: http://en.wikipedia.org/wiki/Blood][database_cross_reference: https://github.com/obophenotype/uberon/issues/9][database_cross_reference: FMA:9670]

Creatinine
type: Class
type: Facet Value
subclass of: HHEAR_01388
notation: CRE
definition: Creatinine is the breakdown product of creatine, a constituent of muscle tissue, that is excreted by the kidney and whose serum level is used to evaluate kidney function.

rs12708716
type: Class
type: Node shape
subclass of: SNP
comment: This class denotes rs12708716

Bothered Me Somewhat Today
type: Class
type: Quality Value
type: Node shape
subclass of: some of the time
subclass of: Asthma Induced Distress Response
comment: This class denotes Bothered Me Somewhat Today
notation: 774

Monthly Income SRD 3000 - 4999
type: Class
type: Node shape
subclass of: Household Income - Monthly - Suriname
subclass of:
  on property: minValue
  has value: 3000
subclass of:
  on property: maxValue
  has value: 4999
subclass of:
  on property: SIO_000900
  has value: SIO_000429
subclass of:
  on property: currency
  has value: SRD
comment: 3000 to 4999 Suriname Dollars [SRD]
notation: 822

2, 3, 4, 5-Tetrachlorophenol
type: Class
type: Facet Value
subclass of: CHEBI_33853
notation: TeCP2345
definition: PHYSICAL DESCRIPTION: Needles (from petroleum ether, ligroin) or beige solid. (NTP, 1992)

Ultra-Performance Liquid Chromatography - Tandem Mass Spectrometer
type: Class
subclass of: Tandem Mass Spectrometer
subclass of: Ultra Performance Liquid Chromatography - Mass Spectrometer
comment: This class denotes Ultra-Performance Liquid Chromatography - Tandem Mass Spectrometer
was approved by: PER-Jim-McCusker

Metal
type: Class
subclass of: Element
definition: For environmental purposes, HHEAR metals are metals and metalliods, as originally defined in CHEAR.

Household Appliance Count
type: Class
type: Quantity Variable
subclass of: SIO_000794
subclass of: Housing Characteristic
definition: Total number of appliances that can be found in the home.
was approved by: PER-Jeanette-Stingone

2, 4-Dichlorophenol
type: Class
type: Facet Value
subclass of: CHEBI_33853
notation: DCP24
definition: 2, 4-dichlorophenol is a colorless crystalline solid with a medicinal odor. Melting point 45°C. Sinks in water. Strong irritant to tissues; toxic by ingestion.

Datatype
with restrictions:
  min exclusive: 35.0
on datatype: float

Bothered Me A Good Deal Today
type: Class
type: Quality Value
type: Node shape
subclass of: most of the time
subclass of: Asthma Induced Distress Response
comment: This class denotes Bothered Me A Good Deal Today
notation: 777

Monthly Income SRD 400 - 799
type: Class
type: Node shape
subclass of: Household Income - Monthly - Suriname
subclass of:
  on property: SIO_000900
  has value: SIO_000429
subclass of:
  on property: currency
  has value: SRD
comment: 400 to 799 Suriname Dollars [SRD]
notation: 819

Quality Value
type: Class
type: Node shape
subclass of: Thing
comment: This class denotes Quality Value

respiratory system disease
type: Class
subclass of: Thing
comment: This class denotes respiratory system disease

Attention and Executive Functioning Domain
type: Class
type: Node shape
subclass of: Developmental Neuropsychological Assessment
comment: The Attention and Executive Functioning domain of the Developmental Neuropsychological Assessment (NEPSY-II)

genomic feature
type: Class
type: Node shape
subclass of: Thing
comment: A sequence feature (continuous extent of biological sequence) that is of genomic origin (i.e. carries sequence from the genome of a cell or organism)

Finished Elementary Grade 4
type: Class
type: Quality Value
subclass of: Graduated From High School
notation: 116
definition: Finished grade 4

Maternal Weight Gain
type: Class
subclass of: Pregnancy Characteristic
subclass of: Difference of Weights
definition: The amount of weight gained during a pregnacy.
was approved by: PER-Jeanette-Stingone

Hospital
type: Class
subclass of: NCIT C21541
comment: This class denotes Hospital

Quantity of Alcohol Consumption
type: Class
type: Node shape
subclass of: HHEAR_00172
comment: This class denotes quantity of alcohol consumption

Monthly Income SRD 800 - 1499
type: Class
type: Node shape
subclass of: Household Income - Monthly - Suriname
subclass of:
  on property: minValue
  has value: 800
subclass of:
  on property: SIO_000900
  has value: SIO_000429
subclass of:
  on property: currency
  has value: SRD
subclass of:
  on property: maxValue
  has value: 1499
comment: 800 to 1499 Suriname Dollars [SRD]
notation: 820

Warehouse
type: Class
type: Quality Value
type: Node shape
subclass of: Workplace
comment: An industrial building which is used to store goods. (Source: Environment Ontology)
notation: 982

genotype
type: Class
subclass of: Medical History
comment: This class denotes genotype

mean platelet volume
type: Class
subclass of: SIO_001109
subclass of: SIO_000049
comment: This class denotes mean platelet volume

Head Of Household
type: Class
subclass of: Demographic
subclass of: SIO_000016
subclass of: Restriction
  on property: SIO_000668
definition: The Person is the head of Household
definition: Head of Household is a filing status for individual United States taxpayers. To use the Head of Household filing status, a taxpayer must: (1) Be unmarried or considered unmarried at the end of the year (2) Have paid more than half the cost of keeping up a home for the tax year (either one's own home or the home of a qualifying parent) (3) Usually have a qualifying person who lived with the head in the home for more than half of the tax year unless the qualifying person is a dependent parent.
was approved by: PER-Jeanette-Stingone

Drank One or Two Alcoholic Drinks
type: Class
type: Quality Value
type: Node shape
subclass of: Quantity of Alcohol Consumption
comment: drank one or two alcoholic drinks
notation: 1014

Auditory Attention and Response Set Subtest
type: Class
type: Node shape
subclass of: Attention and Executive Functioning Domain
comment: The Auditory Attention and Response Set subtest in the Attention and Executive Functioning Domain of the Developmental Neuropsychological Assessment (NEPSY-II)

Mercapturic acids of 1, 3-butadiene
type: Class
subclass of: Tobacco Metabolite
comment: This class denotes Mercapturic acids of 1, 3-butadiene
notation: HEMA

nutrition intake
type: Class
type: Quality Variable
type: Activity
subclass of: HHEAR_00053
definition: Nutrition intake is the process of taking in of nutrients, especially by eating or drinking, considered in relation to the body’s dietary needs.

toxin
type: Class
subclass of: Thing
comment: Poisonous substance produced by a biological organism such as a microbe, animal or plant. (Source: CHEBI Ontology)

Cotinine
type: Class
type: Facet Value
subclass of: Tobacco Metabolite
notation: COT
definition: The N-glucuronide conjugate of cotinine is a major urinary metabolite of NICOTINE. It thus serves as a biomarker of exposure to tobacco SMOKING. It has CNS stimulating properties.

1 or 2 Years of College, Technical, or Vocational Training
type: Class
type: Quality Value
subclass of: Some College or Technical School
comment: This class denotes 1 or 2 Years of College, Technical, or Vocational Training
notation: 313

rs2476601
type: Class
type: Node shape
subclass of: SNP
comment: This class denotes rs2476601

Patella
type: Class
subclass of: biological entity
definition: The patella, also known as the knee cap or kneepan, is the largest sesamoid bone in the human body. The primary functional role of the patella is knee extension. The patella has convergently evolved in placental mammals and birds; marsupials have only rudimentary, non-ossified patellae. In more primitive tetrapods, including living amphibians and reptiles, the muscle tendons from the upper leg are attached directly to the tibia, and the patella is not present. See also: fabella.

Asthma Related Health Encounter
type: Class
type: Node shape
subclass of: HHEAR_00074
comment: Any encounter with health care that is caused or motivated by acute asthma

Technical Post-Middle School
type: Class
type: Quality Value
subclass of: High School or Less
subclass of: HHEAR_00424
notation: 94
definition: Attended a Technical Post-Middle School.
was approved by: PER-Jeanette-Stingone

Drank Alcohol Less Than One Day Per Week
type: Class
type: Quality Value
type: Node shape
subclass of: Frequency of Alcohol Consumption
comment: This class denotes drank alcohol less than one day per week
notation: 1013

FIC
type: Class
type: Facet
subclass of: Funding Institute
comment: This class denotes FIC

Number of Nights of Albuterol Use
type: Class
type: Quantity Variable
type: Node shape
subclass of: SIO_000794
subclass of: Prescription Medication and Dietary Supplements
subclass of: Restriction
  some values from: Uses Albuterol Inhaler
  on property: SIO_000215
comment: This class denotes Number of Nights of Albuterol Use

micromolal
type: unit of measurement
notation: µmol/kg

3 or 4 Years of College, Technical, or Vocational Training
type: Class
type: Quality Value
subclass of: Some College or Technical School
comment: This class denotes 3 or 4 Years of College, Technical, or Vocational Training
notation: 314

Monthly Income SRD 0 - 399
type: Class
type: Node shape
subclass of: Household Income - Monthly - Suriname
subclass of:
  on property: maxValue
  has value: 399
subclass of:
  on property: currency
  has value: SRD
subclass of:
  on property: minValue
  has value: 0
subclass of:
  on property: SIO_000900
  has value: SIO_000429
comment: 0 to 399 Suriname Dollars [SRD]
notation: 818

nitric oxide exhalation measurement
type: Class
type: Node shape
subclass of: Measurement
comment: Quantification of the fraction of nitric oxide in the total exhalation volume, used as a non-invasive biomarker of eosinophilic airway inflammation. Higher Feno values are associated with childhood asthma symptoms, exacerbations, physician-diagnosed asthma and atopy. (Source: Experimental Factor Ontology)

m-Xylene*
type: Class
type: Facet Value
subclass of: Volatile Organic Compound
notation: MXY
definition: M-xylene is a colorless watery liquid with a sweet odor. Less dense than water. Insoluble in water. Irritating vapor. (USCG, 1999)

Child
type: Class
type: Facet
subclass of: Descendant
subclass of: Study Population
definition: A relationship with a parent (such as sons and daughters of any age).
was approved by: PER-Jeanette-Stingone

Number of Days With Asthma Symptoms
type: Class
type: Quantity Variable
type: Node shape
subclass of: Physical And Mental Assessment
subclass of: SIO_000794
comment: The total number of days (in some time period) when a subject experienced asthma symptoms

Drank Alcohol Three or More Days Per Week
type: Class
type: Quality Value
type: Node shape
subclass of: Frequency of Alcohol Consumption
comment: This class denotes drank alcohol three or more days per week
notation: 1012

Less Than Grade 8
type: Class
type: Quality Value
type: Node shape
subclass of: Some Middle School
comment: Completed less than Grade 7
notation: 1112
disjoint with: Completed Eighth Grade But Not A High School Graduate

Functional Status Total Score Below 3
type: Class
type: Quality Value
subclass of: Functional Status Total Score
comment: This class denotes Functional Status Total Score Below 3
notation: 369

Asthma Diagnosis Group
type: Class
type: Quality Value
subclass of: Diagnosis Group
comment: This class denotes Asthma Diagnosis Group
notation: 312

2,3-dinor-8-iso Prostaglandin F2 alpha
type: Class
type: Facet Value
subclass of: HHEAR_01373
comment: This class denotes 2,3-dinor-8-iso Prostaglandin F2 alpha
notation: F2A23D

Did Not Drink Alcohol
type: Class
type: Quality Value
type: Node shape
subclass of: Did Not Consume Alcohol
subclass of: Frequency of Alcohol Consumption
comment: This class denotes did not drink alcohol
notation: 1010

4-((Benzyloxy)carbonyl)benzoic acid
type: Class
type: Node shape
type: Facet Value
subclass of: Phthalate
comment: This class denotes 4-((Benzyloxy)carbonyl)benzoic acid
notation: MBZTP

Drank Four or More Alcoholic Drinks Two to Three Times Per Month
type: Class
type: Quality Value
type: Node shape
subclass of: Frequency of Alcohol Consumption
comment: This class denotes drank four or more alcoholic drinks two to three times per month
notation: 1164

body weight
type: Class
type: Quantity Variable
subclass of: Anthropometry
subclass of: SIO_000279
definition: The resulting Force from the interaction between a person's Mass and Gravity.
was approved by: PER-Jeanette-Stingone

Serum Was Collected
type: Class
type: Quality Value
type: Node shape
subclass of: Serum Collection
comment: Indicates that serum was collected during a study event
notation: 934

Asthma Control Test Score for 12 to 18 Years
type: Class
type: Node shape
subclass of: HHEAR_00688
comment: This class denotes Asthma Control Test Score for 12 to 18 Years

picomolal
type: unit of measurement
notation: pmolal

on property: currency
has value: USD

Bedroom
type: Class
subclass of: room
subclass of: Room
definition: A room in a human dwelling that is the primary location where one or more occupants sleep.

on property: maxValue
has value: 99999

Technical Post Primary School
type: Class
type: Quality Value
subclass of: High School or Less
subclass of: HHEAR_00424
notation: 95
definition: Attended a Technical Post Primary School
was approved by: PER-Jeanette-Stingone

Drank Alcohol One or Two Days Per Week
type: Class
type: Quality Value
type: Node shape
subclass of: Frequency of Alcohol Consumption
comment: This class denotes drank alcohol one or two days per week
notation: 1011

Urine Was Collected
type: Class
type: Quality Value
type: Node shape
subclass of: Urine Collection
comment: Indicates that urine was collected during a study event
notation: 935

Asthma Control Test Score for 8 to 11 Years
type: Class
type: Node shape
subclass of: HHEAR_00688
comment: This class denotes Asthma Control Test Score for 8 to 11 Years

nanomolal
type: unit of measurement
notation: nmolal

Ferrous fumarate
type: Class
type: Node shape
subclass of: HHEAR 2348
comment: Ferrous fumarate is an iron supplement used to treat or prevent iron deficiency anemia.

Breast Fibroglandular Tissue Volume
type: Class
type: Quantity Variable
type: Node shape
subclass of: Physical And Mental Assessment
subclass of: SIO_000049
subclass of: Restriction
  some values from: Breast Fibroglandular Tissue
  on property: SIO_000215
comment: The volume of a human breast's fibroglandular tissue

St. Louis, MO Site
type: Class
type: Quality Value
type: Node shape
subclass of: Population Group by Study Site
subclass of: Restriction
  on property: SIO_000668
  has value: St. Louis
comment: This class denotes St. Louis, MO Site
notation: 719

Asthma Limited Activity A Good Bit of the Time
type: Class
type: Quality Value
type: Node shape
subclass of: most of the time
subclass of: Asthma Induced Activity Limitation Response
comment: This class denotes Asthma Limited Activity A Good Bit of the Time
notation: 779

Long Range Polymerase Chain Reaction
type: Class
subclass of: Polymerase Chain Reaction
definition: Amplification of DNA lengths that cannot typically be amplified using routine PCR methods or reagents. For simple DNA templates, polymerases optimized for Long Range PCR can amplify up to 30 kb and beyond. For complex, genomic templates, 20 kb is a typical target.
was approved by: PER-Jim-McCusker

Moderately hemolyzed
type: Class
subclass of: comment
comment: This class denotes Moderately hemolyzed

Manganese
type: Class
type: Facet Value
subclass of: Metal
subclass of: HHEAR_01387
notation: Mn
definition: MANGANESE is a trace element with atomic symbol Mn, atomic number 25, and atomic weight 54.94. It is concentrated in cell mitochondria, mostly in the pituitary gland, liver, pancreas, kidney, and bone, influences the synthesis of mucopolysaccharides, stimulates hepatic synthesis of cholesterol and fatty acids, and is a cofactor in many enzymes, including arginase and alkaline phosphatase in the liver. (From AMA Drug Evaluations Annual 1992, p2035)

biological_process
type: Class
subclass of: Thing
comment: Note that, in addition to forming the root of the biological process ontology, this term is recommended for use for the annotation of gene products whose biological process is unknown. When this term is used for annotation, it indicates that no information was available about the biological process of the gene product annotated as of the date the annotation was made; the evidence code 'no data' (ND), is used to indicate this.

Percentage of Fibroglandular Volume
type: Class
type: Quantity Variable
type: Node shape
subclass of: Physical And Mental Assessment
subclass of: percentage
subclass of: Restriction
  some values from: Total Breast Volume
  on property: STATO_0000259
subclass of: Restriction
  some values from: Breast Fibroglandular Tissue Volume
  on property: STATO_0000101
comment: The ratio of a breast's fibroglandular volume to its total breast tissue volume, expressed as a percentage

Liver Biopsy
type: Class
type: Node shape
subclass of: Biospecimen Collection
comment: The collection of sample tissue from a subject's liver

Asthma Limited Activity Most of the Time
type: Class
type: Quality Value
type: Node shape
subclass of: most of the time
subclass of: Asthma Induced Activity Limitation Response
comment: This class denotes Asthma Limited Activity Most of the Time
notation: 782

Marital Status
type: Class
type: Quality Variable
subclass of: SIO_000287
definition: A person's current conjugal status.
was approved by: PER-Jeanette-Stingone

Belarus
type: geographic region
comment: The country of Belarus
SIO_000313: Outside United States

Mitest not capped
type: Class
subclass of: comment
comment: This class denotes Mitest not capped

Chest tightness
type: Class
subclass of: wheezing or tightness in the chest or cough
comment: This class denotes Chest tightness

Finished Primary School
type: Class
type: Quality Value
type: Node shape
subclass of: Finished Elementary School
comment: Has completed primary school education level
notation: 638

San Diego, CA Site
type: Class
type: Quality Value
type: Node shape
subclass of: Population Group by Study Site
comment: This class denotes San Diego, CA Site
notation: 718

Asthma Limited Activity A Little of the Time
type: Class
type: Quality Value
type: Node shape
subclass of: some of the time
subclass of: Asthma Induced Activity Limitation Response
comment: This class denotes Asthma Limited Activity A Little of the Time
notation: 780

attention deficit hyperactivity disorder
type: Quality Value
notation: 424

N-Ace-S- (3, 4-Dihidxybutl)-L-Cys(ng/mL)
type: Class
subclass of: Volatile Organic Compound
comment: This class denotes N-Ace-S- (3, 4-Dihidxybutl)-L-Cys(ng/mL)
notation: VOCDHB
editorial note: To Do: align with CHEBI.

Light Bulb Count
type: Class
type: Quantity Variable
subclass of: Household Appliance Count
definition: Total Number of Lightbulbs in the Home
was approved by: PER-Jeanette-Stingone

Germany
type: geographic region
comment: The country of Germany
SIO_000313: Outside United States

Male Cousin
type: Class
type: Quality Value
type: Node shape
subclass of: Cousin
comment: A male child of one's aunt or uncle. (Source: NCI Thesaurus)
notation: 661

No FOL result; FOL = 8 ng/mL assumed
type: Class
subclass of: comment
comment: This class denotes No FOL result; FOL = 8 ng/mL assumed

Other Consenting Party
type: Class
type: Node shape
subclass of: Consenting Party
comment: A Consenting Party that is not Mother, Father or Legally Authorized Representative
complement of: Father

Interleukin-22
type: Class
type: Facet Value
subclass of: Protein
subclass of: HHEAR_01389
comment: This class denotes Interleukin-22
notation: IL22

Total Breast Volume
type: Class
type: Quantity Variable
type: Node shape
subclass of: Physical And Mental Assessment
subclass of: SIO_000049
subclass of: Restriction
  some values from: UBERON_0000310
  on property: SIO_000215
subclass of: Restriction
  some values from: Mammary Gland Tissue
  on property: SIO_000215
comment: The total volume of a human breast

Boston, MA Site
type: Class
type: Quality Value
type: Node shape
subclass of: Population Group by Study Site
subclass of: Restriction
  on property: SIO_000668
  has value: Q100
comment: This class denotes Boston, MA Site
notation: 717

Asthma Limited Activity Some of the Time
type: Class
type: Quality Value
type: Node shape
subclass of: some of the time
subclass of: Asthma Induced Activity Limitation Response
comment: This class denotes Asthma Limited Activity Some of the Time
notation: 783

Asthma Control Test Questionnaire
type: Class
type: Node shape
subclass of: Questionnaire
comment: A standardized rating scale developed by Nathan et al in 2004, which is used to identify patients with poorly controlled asthma. This questionnaire contains 5 items. (Source: NCI Thesaurus)

N-Ace-S-(2-Hydroxyethyl)-L-cys(ng/mL)
type: Class
subclass of: Volatile Organic Compound
comment: This class denotes N-Ace-S-(2-Hydroxyethyl)-L-cys(ng/mL)
notation: VOCHEM
editorial note: To Do: align with CHEBI.

Limit of Detection
type: Class
subclass of: concentration
definition: The lowest quantity of a substance that can be distinguished from the absence of that substance (a blank value) with a stated confidence level (generally 99%). The detection limit is estimated from the mean of the blank, the standard deviation of the blank and some confidence factor. Another consideration that affects the detection limit is the accuracy of the model used to predict concentration from the raw analytical signal.

Premenopausal
type: Class
type: Quality Value
type: Node shape
subclass of: NCIT C106541
comment: Prior to menopause. (Source: NCI Theasurus)
notation: 1061

Neighborhood Characteristic
type: Class
subclass of: Study Indicator
definition: Neighborhood Characteristic Indicator Class
was approved by: PER-Jeanette-Stingone

Saskatchewan, Canada
type: geographic region
comment: The state, province, or territory of Saskatchewan, Canada
SIO_000313: Canada

megakaryocyte-erythroid progenitor cell

Stillbirth
type: Class
type: Quality Value
type: Node shape
subclass of: Pregnancy Outcome By Fetal Status
comment: A fetus of at least 20 weeks gestation, or of a birth weight of at least 350 grams if the gestational age is unknown, that is born without signs of life at the time of delivery, and with an Apgar score of zero at both one and five minutes. (Source: NCI Thesaurus)
notation: 1084

Ages and Stages Communication Questionnaire
type: Class
type: Node shape
subclass of: Ages and Stages Questionnaire
comment: The "communication" section of the Ages and Stages Questionnaire

Asthma Induced Activity Limitation Response
type: Class
type: Node shape
subclass of: Discover Questionnaire Response
comment: This class denotes Asthma Induced Activity Limitation Response

Iceland
type: geographic region
comment: The country of Iceland
SIO_000313: Outside United States

Canada
type: geographic region
comment: The country of Canada
SIO_000313: Outside United States

N-A-S-(3-hydrxprpl-1-metl)-L-cys(ng/mL)
type: Class
subclass of: Volatile Organic Compound
comment: This class denotes N-A-S-(3-hydrxprpl-1-metl)-L-cys(ng/mL)
notation: VOCPMM
editorial note: To Do: align with CHEBI.

Quit Smoking Before Pregnancy
type: Class
type: Quality Value
subclass of: HHEAR_00419
subclass of: Pregnancy Characteristic
subclass of: HHEAR_00416
notation: 81
definition: A Previous Smoker who Quit Smoking Before Pregnancy

Intelligence Quotient
type: Class
type: Quantity Variable
subclass of: SIO_000052
subclass of: Physical And Mental Assessment
definition: A measure of intelligence
was approved by: PER-Jeanette-Stingone

Japan
type: geographic region
comment: The country of Japan
SIO_000313: Outside United States

Monthly Income SRD 15000+
type: Class
type: Node shape
subclass of: Household Income - Monthly - Suriname
subclass of:
  on property: SIO_000900
  has value: SIO_000429
comment: 15000+ Suriname Dollars [SRD]
notation: 825

Population Group by Recruitment Location
type: Class
type: Node shape
subclass of: Population Group
comment: This class denotes Population Group by Recruitment Location

Asthma Did Not Limit Activity
type: Class
type: Quality Value
type: Node shape
subclass of: never
subclass of: Asthma Induced Activity Limitation Response
comment: This class denotes Asthma Did Not Limit Activity
notation: 778

micromole per liter
type: unit of measurement
notation: µmol/L

N-Ac-S-(2-Hydrxy-3-butnyl)-L-Cys(ng/mL)
type: Class
subclass of: Volatile Organic Compound
comment: This class denotes N-Ac-S-(2-Hydrxy-3-butnyl)-L-Cys(ng/mL)
notation: VOCMB2
editorial note: To Do: align with CHEBI.

Landfill Proximity
type: Class
type: Quantity Variable
subclass of: built environment
definition: How close a household is to a landfill.
was approved by: PER-Jeanette-Stingone

Consenting Party
type: Class
type: Node shape
subclass of: HHEAR_00074
subclass of: Father
subclass of: Mother
subclass of: Legally Acceptable Representative
definition: The party who provides or is capabable of providing consent for another to have a medical treatment or procedure.

Medical Leave
type: Class
type: Quality Value
subclass of: ExO_0000034
comment: This class denotes Medical Leave
notation: 246

Hydroxycotinine (total)
type: Class
type: Facet Value
subclass of: Tobacco Metabolite
comment: This class denotes both Hydroxycotinine and Hydroxycotinine (total)
notation: HCOTT
notation: HCOT

High Performance Liquid Chromatography - Tandem Mass Spectrometer
type: Class
subclass of: Liquid Chromatography - Tandem Mass Spectrometer
subclass of: High-Performance Liquid Chromatography-Mass Spectrometry
definition: Liquid chromatography and tandem Mass Spectrometry. MS/MS (Tandem MS) is the combination of two mass analyzers in one mass spec instrument.
was approved by: PER-Jim-McCusker

In Vitro Fertilization
type: Class
type: Quality Value
subclass of: HHEAR_00173
comment: This class denotes In Vitro Fertilization
notation: 50

Microplate Reader
type: Class
subclass of: PhysicalInstrument
definition: Instruments which are used to detect biological, chemical or physical events of samples in microtiter plates. They are widely used in research, drug discovery, bioassay validation, quality control and manufacturing processes in the pharmaceutical and biotechnological industry and academic organizations. Sample reactions can be assayed in 6-1536 well format microtiter plates. The most common microplate format used in academic research laboratories or clinical diagnostic laboratories is 96-well (8 by 12 matrix) with a typical reaction volume between 100 and 200 µL per well. Higher density microplates (384- or 1536-well microplates) are typically used for screening applications, when throughput (number of samples per day processed) and assay cost per sample become critical parameters, with a typical assay volume between 5 and 50 µL per well. Common detection modes for microplate assays are absorbance, fluorescence intensity, luminescence, time-resolved fluorescence, and fluorescence polarization.
was approved by: PER-Jim-McCusker

Hepatic failure
type: Class
type: Quality Value
subclass of: phenotype
comment: This class denotes Hepatic failure
notation: 395

Bothered Me Very Much Today
type: Class
type: Quality Value
type: Node shape
subclass of: most of the time
subclass of: Asthma Induced Distress Response
comment: This class denotes Bothered Me Very Much Today
notation: 773

Monthly Income SRD 5000 - 9999
type: Class
type: Node shape
subclass of: Household Income - Monthly - Suriname
subclass of:
  on property: SIO_000900
  has value: SIO_000429
subclass of:
  on property: currency
  has value: SRD
subclass of:
  on property: minValue
  has value: 5000
subclass of:
  on property: maxValue
  has value: 9999
comment: 5000 to 9999 Suriname Dollars [SRD]
notation: 823

Bothered Me As Much As Possible Today
type: Class
type: Quality Value
type: Node shape
subclass of: always
subclass of: Asthma Induced Distress Response
comment: This class denotes Bothered Me As Much As Possible Today
notation: 775

medical role
type: Class
subclass of: Thing
comment: This class denotes medical role

Quit Smoking After Pregnancy
type: Class
type: Quality Value
subclass of: HHEAR_00419
subclass of: HHEAR_00417
subclass of: Pregnancy Characteristic
notation: 80
definition: Quit Smoking After Pregnancy

N-A-S-(1-HydrxMet)-2-Prpn)-L-Cys(ng/mL)
type: Class
subclass of: Volatile Organic Compound
comment: This class denotes N-A-S-(1-HydrxMet)-2-Prpn)-L-Cys(ng/mL)
notation: VOCMB1
editorial note: To Do: align with CHEBI.

Insurance
type: Class
type: Quality Value
type: Quality Variable
type: Facet
subclass of: Socioeconomic Status
subclass of: HHEAR_00074
comment: This class denotes Insurance
notation: 683

Medical History
type: Class
subclass of: Study Indicator
definition: Medical History Indicator Class
was approved by: PER-Jeanette-Stingone

Monthly Income SRD 10000 - 14999
type: Class
type: Node shape
subclass of: Household Income - Monthly - Suriname
subclass of:
  on property: currency
  has value: SRD
subclass of:
  on property: SIO_000900
  has value: SIO_000429
comment: 10000 to 14999 Suriname Dollars [SRD]
notation: 824

Does Not Receive Utility Assistance
type: Class
type: Quality Value
type: Node shape
subclass of: Does Not Receive Public Assistance
comment: A class that indicates a person or household does not utility housing assistance
notation: 712
disjoint with: Receives Utility Assistance

blood transfusion
type: Class
type: Quality Value
subclass of: medical procedure
comment: This class denotes blood transfusion
notation: 380

Lab confirmed result
type: Class
subclass of: comment
comment: This class denotes Lab confirmed result

2, 2', 3, 4, 4'-Pentabromodiphenyl ether
type: Class
type: Facet Value
subclass of: CHEBI_134094
comment: This class denotes 2, 2', 3, 4, 4'-Pentabromodiphenyl ether
notation: BDE85
editorial note: To Do: align with CHEBI.

Sonora, Mexico
type: geographic region
comment: The state, province, or territory of Sonora, Mexico
SIO_000313: Q96

FVC Percent Predicted Value (pre-bronchodilator administration)
type: Class
type: Node shape
subclass of: FVC Percent Predicted Value
subclass of: Forced Vital Capacity (pre-bronchodilator administration)
comment: The percent ratio of a patient's best FVC value divided by the expected or predicted FEV1 value prior to administering bronchodilator

unit per liter
type: unit of measurement
notation: U/l

Childhood Followup 4 Day 5
type: Class
type: Node shape
subclass of: Study Followup 4 Day 5
subclass of: Restriction
  some values from: Childhood Followup 4
  on property: intervalDuring
subclass of: Restriction
  some values from: HHEAR_01499
  on property: intervalAfter
comment: The fifth day of the fourth study followup activity for a study that occurs during a subject's childhood period

on property: currency
has value: USD

on property: currency
has value: USD

noninvasive positve-pressure ventilation
type: Class
subclass of: Medical History
subclass of: artificial respiration
comment: This class denotes noninvasive positve-pressure ventilation

2, 2', 4'-Tribromodiphenyl ether
type: Class
type: Facet Value
subclass of: CHEBI_134094
comment: This class denotes 2, 2', 4'-Tribromodiphenyl ether
notation: BDE17
editorial note: To Do: align with CHEBI.

FVC Percent Predicted Value (post-bronchodilator administration)
type: Class
type: Node shape
subclass of: FVC Percent Predicted Value
subclass of: HHEAR_02200
comment: The percent ratio of a patient's best FVC value divided by the expected or predicted FEV1 value after administering bronchodilator

unit per milliliter
type: unit of measurement
notation: U/ml

Uses Penicillin
type: Class
type: Quality Value
subclass of: Uses Antibiotics
notation: 632
definition: Has used or uses penicillin

on property: maxValue
has value: 64999

trans, trans -Muconic acid
type: Class
type: Facet Value
subclass of: Volatile Organic Compound
comment: This class denotes trans, trans -Muconic acid
notation: MU
editorial note: To Do: align with CHEBI.

FVC Best Value (pre-bronchodilator administration)
type: Class
type: Node shape
subclass of: FVC Best Value
subclass of: Forced Vital Capacity (pre-bronchodilator administration)
comment: Measured FVC best value prior to administration of bronchodilator

2, 2', 3, 3', 4, 4', 5, 5', 6, 6'-Decabromodiphenyl ether
type: Class
type: Facet Value
subclass of: CHEBI_134094
comment: This class denotes 2, 2', 3, 3', 4, 4', 5, 5', 6, 6'-Decabromodiphenyl ether
notation: BDE209
editorial note: To Do: align with CHEBI.

Lipemic
type: Class
subclass of: comment
comment: This class denotes Lipemic

Delaware, United States of America
type: geographic region
comment: The state, province, or territory of Delaware, United States of America
SIO_000313: Q1139046

Hepatic fibrosis
type: Class
type: Node shape
subclass of: phenotype
comment: The presence of excessive fibrous connective tissue in the liver. Fibrosis is a reparative or reactive process. (Source: Human Phenotype Ontology)

Study Followup 4 Day 7
type: Class
type: Node shape
subclass of: Study Activity
subclass of: Restriction
  some values from: Study Followup 4
  on property: intervalDuring
subclass of: Restriction
  some values from: Study Followup 4 Day 6
  on property: intervalAfter
comment: The seventh day of the fourth study followup activity for a study

invasive mechanical ventilation
type: Class
subclass of: Medical History
subclass of: artificial respiration
comment: This class denotes invasive mechanical ventilation

Heptyl paraben
type: Class
type: Facet Value
subclass of: CHEBI_85122
comment: This class denotes Heptyl paraben
notation: HePB

2, 2', 3, 4, 4', 5', 6-Heptabromodiphenyl ether
type: Class
type: Facet Value
subclass of: CHEBI_134094
comment: This class denotes 2, 2', 3, 4, 4', 5', 6-Heptabromodiphenyl ether
notation: BDE183
editorial note: To Do: align with CHEBI.

Laboratory Result
type: Class
subclass of: Indicator
definition: A measurement taken on a sample.

FVC Best Value (post-bronchodilator administration)
type: Class
type: Node shape
subclass of: FVC Best Value
subclass of: HHEAR_02200
comment: Measured FVC best value after administration of bronchodilator

Colorado, United States of America
type: geographic region
comment: The state, province, or territory of Colorado, United States of America
SIO_000313: Western United States

Strontium
type: Class
type: Facet Value
subclass of: Metal
subclass of: HHEAR_01387
notation: Sr
definition: STRONTIUM is an element of the alkaline earth family of metals. It has the atomic symbol Sr, atomic number 38, and atomic weight 87.62.

Study Followup 4 Day 8
type: Class
type: Node shape
subclass of: Study Activity
subclass of: Restriction
  some values from: Study Followup 4
  on property: intervalDuring
comment: The eighth day of the fourth study followup activity for a study

Some College
type: Class
type: Quality Value
subclass of: Post-Secondary Education
subclass of: Some College or Technical School
subclass of: High School or Some College
subclass of: HHEAR_01239
notation: 85
definition: Indicates that a person has attended college but that they did not receive any degree.
was approved by: PER-Jeanette-Stingone

FVC Predicted Value (pre-bronchodilator administration)
type: Class
type: Node shape
subclass of: FVC Predicted Value
subclass of: Forced Vital Capacity (pre-bronchodilator administration)
comment: The expected or predicted FVC value prior to administering bronchodilator

metalaxyl
type: Class
type: Node shape
type: Facet Value
subclass of: HHEAR_01374
comment: A racemate comprising equal amounts of (R)- and (S)-metalaxyl. A systemic fungicide, it is active against phytopathogens of the order Peronosporales and is used to conrtrol Pythium in a number of vegetable crops. Source: ChEBI
notation: MET

Washing Machine Count
type: Class
type: Quantity Variable
subclass of: Household Appliance Count
definition: Number of machines used for washing clothes in the home.
was approved by: PER-Jeanette-Stingone

Maryland, United States of America
type: geographic region
comment: The state, province, or territory of Maryland, United States of America
SIO_000313: Q1139046

vitamin B6
type: Class
subclass of: chemical entity
comment: This class denotes vitamin B6

AM-
type: Class
type: Quality Variable
type: Node shape
subclass of: Atopy
comment: This class denotes AM-
notation: 873

Study Followup 4 Day 5
type: Class
type: Node shape
subclass of: Study Activity
subclass of: Restriction
  some values from: Study Followup 4
  on property: intervalDuring
subclass of: Restriction
  some values from: HHEAR_01497
  on property: intervalAfter
comment: The fifth day of the fourth study followup activity for a study

FVC Predicted Value (post-bronchodilator administration)
type: Class
type: Node shape
subclass of: FVC Predicted Value
subclass of: HHEAR_02200
comment: The expected or predicted FVC value after administering bronchodilator

Weight for Height Z-Score
type: Class
type: Quantity Variable
subclass of: Z-Score
subclass of: SIO_001245
definition: Z-Score of the weight/height ratio at a given age.

t, t-Muconic acid(ng/mL)
type: Class
subclass of: Volatile Organic Compound
comment: This class denotes t, t-Muconic acid(ng/mL)
notation: VOCMUC
editorial note: To Do: align with CHEBI.

on property: minValue
has value: 1667

AM+
type: Class
type: Quality Variable
type: Node shape
subclass of: Atopy
comment: This class denotes AM+
notation: 874

Study Followup 4 Day 6
type: Class
type: Node shape
subclass of: Study Activity
subclass of: Restriction
  some values from: Study Followup 4 Day 5
  on property: intervalAfter
subclass of: Restriction
  some values from: Study Followup 4
  on property: intervalDuring
comment: The sixth day of the fourth study followup activity for a study

FEV1 Predicted Value (pre-bronchodilator administration)
type: Class
type: Node shape
subclass of: FEV1 Predicted Value
subclass of: HHEAR_02201
comment: The expected or predicted FEV1 value prior to administering bronchodilator

mono-isodecyl phthalate
type: Class
type: Facet Value
subclass of: Phthalate
comment: This class denotes mono-isodecyl phthalate
notation: mIDP

Asian Non-Hispanic
type: Class
type: Quality Value
subclass of: Non-Hispanic Ethnicity
subclass of: Asian
comment: This class denotes Asian Non-Hispanic
notation: 217

VCR Player Count
type: Class
type: Quantity Variable
subclass of: Household Appliance Count
definition: Number of devices that play VCRs in the home.
was approved by: PER-Jeanette-Stingone

Cardiovascular
type: Class
type: Node shape
type: Facet
subclass of: HHEAR_00549
comment: Pertaining to the heart or blood vessels. (Source: NCI Thesaurus)

Childhood Followup 3 Day 7
type: Class
type: Node shape
subclass of: Study Followup 3 Day 7
subclass of: Restriction
  some values from: Childhood Followup 3 Day 6
  on property: intervalAfter
subclass of: Restriction
  some values from: Childhood Followup 3
  on property: intervalDuring
comment: The seventh day of the third study followup activity for a study that occurs during a subject's childhood period

FEV1 Predicted Value (post-bronchodilator administration)
type: Class
type: Node shape
subclass of: FEV1 Predicted Value
subclass of: HHEAR_02202
comment: The expected or predicted FEV1 value after administering bronchodilator

American Indian Non-Hispanic
type: Class
type: Quality Value
subclass of: American Indian Or Alaskan Native
subclass of: Non-Hispanic Ethnicity
comment: This class denotes American Indian Non-Hispanic
notation: 218

Vacuum Cleaner Count
type: Class
type: Quantity Variable
subclass of: Household Appliance Count
definition: Number of appliances in home used for cleaning rugs.
was approved by: PER-Jeanette-Stingone

Non-Atopic
type: Class
type: Quality Variable
type: Node shape
subclass of: Atopy
comment: This class denotes Non-Atopic
notation: 872

Childhood Followup 3 Day 8
type: Class
type: Node shape
subclass of: Study Followup 3 Day 8
subclass of: Restriction
  some values from: Childhood Followup 3 Day 7
  on property: intervalAfter
subclass of: Restriction
  some values from: Childhood Followup 3
  on property: intervalDuring
comment: The eighth day of the third study followup activity for a study that occurs during a subject's childhood period

central venous cannula insertion
type: Class
subclass of: Medical History
subclass of: Activity
comment: This class denotes central venous cannula insertion

Autism Spectrum Disorder
type: Class
type: Quality Value
subclass of: developmental disorder of mental health
comment: This class denotes Autism Spectrum Disorder
notation: 151

on property: currency
has value: USD

Has Breastfed At Least Once
type: Class
type: Quality Value
type: Node shape
subclass of: Breast Feeding
comment: Child has breastfed at least once
notation: 566

Markedly hemolyzed
type: Class
subclass of: comment
comment: This class denotes Markedly hemolyzed

Monocyte
type: Class
subclass of: Lymphocyte
definition: Myeloid mononuclear recirculating leukocyte that can act as a precursor of tissue macrophages, osteoclasts and some populations of tissue dendritic cells.

parts per trillion
type: unit of measurement
notation: ppt

perfluoroundecanoic acid
type: Class
type: Node shape
subclass of: Targeted Analyte
comment: This class denotes perfluoroundecanoic acid
notation: PFUNDA

red blood cell distribution width
type: Class
type: Node shape
subclass of: red blood cell morphological measurement
comment: measure of the variation of red blood cell (RBC) volume (Source: Experimental Factor Ontology)

American Indian Or Alaskan Native
type: Class
type: Quality Value
type: Facet Value
subclass of: race
subclass of: HHEAR_00522
notation: 5
definition: A person having origins in any of the original peoples of North and South America (including Central America) and who maintains tribal affiliation or community attachment.
was approved by: PER-Jeanette-Stingone

Agree Street Traffic Makes It Dangerous To Walk Response
type: Class
type: Quality Value
type: Node shape
subclass of: Agree
subclass of: Street Traffic Makes It Dangerous To Walk Response
comment: This class denotes Agree Street Traffic Makes It Dangerous To Walk Response
notation: 484

Count of Food or Beverage Reheated in Plastic Consumption
type: Class
type: Quantity Variable
type: Node shape
subclass of: food packaging
comment: A count of the number of times a person has consumed a food or beverage that has been reheated in a plastic container during a given time interval

Probiotic Beverage
type: Class
type: Node shape
subclass of: beverage
comment: A beverage that contains probiotics
equivalent class: Class
  intersection of: beverage
  intersection of: Restriction
    some values from: Probiotic
    on property: SIO_000139
  equivalent class: Probiotic Beverage

Has Never Breastfed
type: Class
type: Quality Value
type: Node shape
subclass of: Does Not Breastfeed
comment: This class denotes has never breastfed
notation: 567
equivalent class: Class
  equivalent class: Has Never Breastfed

gastrointestinal system disease
type: Class
subclass of: Comorbidity Disease
comment: This class denotes gastrointestinal system disease

The Gambia
type: geographic region
comment: The country of The Gambia
SIO_000313: Outside United States

Antimalarial Use
type: Class
subclass of: medical intervention
subclass of: Pharmacotherapy
subclass of: Restriction
  some values from: SIO_000393
  on property: SIO_000291
definition: A subclass of medical intervention that characterizes a patient's experience with using an antimalarial. Subclasses detail the level to which a patient has used such a medication to prevent or treat malaria.

Liquid Chromotography-Multistage Mass Spectrometery
type: Class
subclass of: Mass Spectrometry
comment: This class denotes Liquid Chromotography-Multistage Mass Spectrometery

PCB170
type: Class
type: Facet Value
subclass of: Polychlorobiphenyl
comment: CAS Number: 35065-30-6
notation: PCB170

parts per billion
type: unit of measurement
notation: ppb

waist height ratio
type: Class
type: Node shape
subclass of: Anthropometry
subclass of: ratio
comment: A quantification of the waist-height WHtR - a measurement of body fat distribution.

Count of Canned Food Consumption
type: Class
type: Quantity Variable
type: Node shape
subclass of: food packaging
subclass of: Restriction
  some values from: Eats Canned Food
  on property: SIO_000215
comment: A count of the number of times a person has consumed canned food in a given time interval

Drinks Probiotic Beverage
type: Class
type: Node shape
subclass of: HHEAR_00062
subclass of: Eating or Drinking
subclass of: Restriction
  some values from: Probiotic Beverage
  on property: SIO_000230
comment: The act of drinking a probiotic beverage

Disagree Street Traffic Makes It Dangerous To Walk Response
type: Class
type: Quality Value
type: Node shape
subclass of: Disagree
subclass of: Street Traffic Makes It Dangerous To Walk Response
comment: This class denotes Disagree Street Traffic Makes It Dangerous To Walk Response
notation: 485

Market
type: Class
type: Quality Value
type: Node shape
subclass of: Workplace
comment: A part of an ecosystem where people gather for the purchase and sale of provisions, livestock, and other goods. As with campgrounds and fairgrounds, land use is the key differentia here. The regularity of marketplace activities may provide a differentia for further growth of this branch. (Source: Environment Ontology)
notation: 977

Nucleated Red Blood Cell Count
type: Class
type: Node shape
subclass of: Physical And Mental Assessment
subclass of: SIO_000794
comment: The determination of the number of nucleated red blood cells present in a sample. (Source: NCI Thesaurus)

Smokes 36-44 Cigarettes Per Day
type: Class
type: Node shape
subclass of: EFO_0006525
subclass of: Restriction
  some values from: Class
    intersection of: SIO_001113
    intersection of: Restriction
      on property: SIO_000300
      has value: 36
  on property: SIO_000216
subclass of: Restriction
  some values from: Class
    intersection of: SIO_001114
  on property: SIO_000216
subclass of: Restriction
  on property: SIO_000221
  has value: cigarettes per day
comment: The act of smoking between 36 and 44 cigarettes per day

glucose
type: Class
subclass of: HHEAR_00034
subclass of: HHEAR_00548
definition: An aldohexose used as a source of energy and metabolic intermediate.

trans-Permethrin
type: Class
type: Node shape
subclass of: carboxylic ester
comment: A pyrethroid insecticide commonly used in the treatment of LICE INFESTATIONS and SCABIES. (Source MeSH Ontology)
notation: TPERM

Perfluorobutanoic acid
type: Class
type: Facet Value
subclass of: Perfluoroakyl and Polyfluoroalkyl Substance
comment: This class denotes Perfluorobutanoic acid
notation: PFBA

Count of Plastic Packaged Food Consumption
type: Class
type: Quantity Variable
type: Node shape
subclass of: food packaging
subclass of: Restriction
  some values from: HHEAR_00906
  on property: SIO_000215
comment: A count of the number of times a person has consumed food packaged in plastic during a given time interval

gram per milliliter
type: unit of measurement
notation: g/ml

Perfluoro-n-pentanoic acid
type: Class
type: Facet Value
subclass of: Perfluoroakyl and Polyfluoroalkyl Substance
comment: This class denotes Perfluoro-n-pentanoic acid
notation: PFPeA

millimole
type: unit of measurement
notation: mmol

One Year After Menarche
type: Class
type: Node shape
subclass of: time interval
subclass of: Restriction
  some values from: Menarche
  on property: intervalAfter
comment: A time interval that begins one year after menarche

nanogram per gram
type: Class
type: unit of measurement
type: Node shape
subclass of: concentration unit
comment: The unit of measure nanogram per gram
notation: ng/g

Node shape
type: Class
subclass of: Thing
comment: A node shape is a shape that specifies constraint that need to be met with respect to focus nodes.

Smokes 45+ Cigarettes Per Day
type: Class
type: Quality Value
type: Node shape
subclass of: EFO_0006525
subclass of: Restriction
  some values from: Class
    intersection of: SIO_001113
    intersection of: Restriction
      on property: SIO_000300
      has value: 45
  on property: SIO_000216
subclass of: Restriction
  on property: SIO_000221
  has value: cigarettes per day
comment: The act of smoking 45 or more cigarettes per day
notation: 595

East Timor
type: geographic region
comment: The country of East Timor
SIO_000313: Outside United States

Mass Spectrometer
type: Class
subclass of: PhysicalInstrument
definition: Mass spectrometry (MS) is an analytical technique that ionizes chemical species and sorts the ions based on their mass-to-charge ratio. In simpler terms, a mass spectrum measures the masses within a sample. Mass spectrometry is used in many different fields and is applied to pure samples as well as complex mixtures.
was approved by: PER-Jim-McCusker

Strongly Agree Street Traffic Makes It Dangerous To Walk Response
type: Class
type: Quality Value
type: Node shape
subclass of: Strongly Agree
subclass of: Street Traffic Makes It Dangerous To Walk Response
comment: This class denotes Strongly Agree Street Traffic Makes It Dangerous To Walk Response
notation: 486

Perfluorohexanoic acid
type: Class
type: Facet Value
subclass of: Perfluoroakyl and Polyfluoroalkyl Substance
comment: This class denotes Perfluorohexanoic acid
notation: PFHxA

parts per quadrillion
type: unit of measurement
notation: ppq

Two Years After Menarche
type: Class
type: Node shape
subclass of: time interval
comment: A time interval that begins two years after menarche

Count of Plastic Packaged Beverage Consumption
type: Class
type: Quantity Variable
type: Node shape
subclass of: food packaging
subclass of: Restriction
  some values from: HHEAR_00908
  on property: SIO_000215
comment: A count of the number of times a person has consumed a beverage packaged in plastic during a given time interval

Stepmother
type: Class
type: Quality Value
type: Node shape
subclass of: Mother
subclass of: NCIT C166116
comment: A female who is married to a spouse with children whom are not biologically related to her. (Source: NCI Thesaurus)
notation: 656

Gabon
type: geographic region
comment: The country of Gabon
SIO_000313: Outside United States

Lipemic sample, clarified before running
type: Class
subclass of: comment
comment: This class denotes Lipemic sample, clarified before running

beverage
type: Class
type: Node shape
subclass of: beverage food product
comment: A liquid prepared for consumption

gram per liter
type: unit of measurement
notation: g/L

picomole
type: unit of measurement
notation: pmol

Test of variables of attention
type: Class
subclass of: Research or Clinical Assessment Tool
comment: This class denotes Test of variables of attention

Second Hand Smoke Exposure by Location
type: Class
type: Quality Variable
type: Node shape
subclass of: environmental tobacco smoke exposure measurement
comment: A class to indicate where a person was exposed to second hand smoke; subclasses of this class detail where a person may have been exposed to second hand smoke.

Uses Azithromycin
type: Class
type: Quality Value
subclass of: Uses Antibiotics
subclass of: Restriction
  some values from: azithromycin
  on property: SIO_000139
notation: 635
definition: Has used or uses azithromycin

Perfluorooctanesulfonic acid
type: Class
type: Facet Value
subclass of: Perfluoroakyl and Polyfluoroalkyl Substance
notation: PFOS
definition: Perfluoroalkyls are stable, synthetic chemicals. Perfluoroalkyls are unique because they repel oil, grease, and water. The two perfluoroalkyls made in the largest amounts in the U. S. areperflurooctanoic acid (PFOA) and perfluorooctane sulfonic acid (PFOS). Perfluoroalkyls have been used in surface protection products such as carpet and clothing treatments and coating for paper and cardboard packaging. They have also been used in fire-fighting foams.

Lipemic and turbid
type: Class
subclass of: comment
comment: This class denotes Lipemic and turbid

3,5,6-trichloropyridine-2-one
type: Class
subclass of: HHEAR_00548
definition: A pyridone that is pyridin-2(1H)-one substituted by chloro groups at positions 3, 5 and 6. It is a metabolite of the agrochemical chlorpyrifos.

kilogram per liter
type: unit of measurement
notation: kg/L

Seven Days Prior to Baseline
type: Class
type: Node shape
subclass of: time interval
subclass of: Restriction
  some values from: Study Baseline
  on property: SIO_000668
comment: Seven days prior to a study baseline

nanomole
type: unit of measurement
notation: nmol

surgical procedure
type: Class
type: Quality Variable
subclass of: medical procedure
comment: This class denotes surgical procedure

kilocalories per day
type: Class
type: unit of measurement
subclass of: rate unit
comment: This class denotes kilocalories per day
notation: kcal/day

Ohio, United States of America
type: geographic region
comment: The state, province, or territory of Ohio, United States of America
SIO_000313: Q186545

hematopoietic system disease
type: Class
subclass of: Comorbidity Disease
comment: This class denotes hematopoietic system disease

Millions Per Cubic Millimeter
type: Class
type: Node shape
subclass of: cell concentration unit
comment: A unit of concentration typically used for expressing the count of millions of cells appearing within one cubic millimeter volume of plasma

Liquid Chromotography-Mass Spectrometery
type: Class
subclass of: Mass Spectrometry
comment: This class denotes Liquid Chromotography-Mass Spectrometery

experimentally modified cell in vitro
type: Class
subclass of: Cell
comment: This class denotes experimentally modified cell in vitro

(15Z)-tetracosenoic acid
type: Class
type: Facet Value
subclass of: Fatty Acid
notation: C241N9
definition: A tetracosenoic acid having a cis-double bond at position 15.

unit per volume unit
type: Class
subclass of: Thing
comment: "A concentration unit which is a standard measure of the number of units, as an agreed arbitrary amount, of a given substance per a specific volume of solution." [Webmd:Webmd]

attomole
type: unit of measurement
notation: amol

Uses Cloxacillin
type: Class
type: Quality Value
subclass of: Uses Antibiotics
subclass of: Restriction
  some values from: cloxacillin
  on property: SIO_000139
notation: 633
definition: Has used or uses cloxacillin

Kingdom of Denmark
type: geographic region
comment: The country of Kingdom of Denmark
SIO_000313: Outside United States

Nasal congestion
type: Class
type: Node shape
subclass of: HHEAR_00904
comment: Reduced ability to pass air through the nasal cavity often leading to mouth breathing.

neutrophil count
type: Class
type: Node shape
subclass of: SIO_000794
comment: The number of granulocytes (polymorphonuclear leukocytes) in a specified volume of blood, usually 1 cubic millimeter. Is a quantification of neutrophils in blood. (Source: Experimental Factor Ontology)

Liquid Chromotography -tandem mass spectrometry
type: Class
subclass of: Mass Spectrometry
comment: This class denotes Liquid Chromotography -tandem mass spectrometry

Thousands Per Cubic Millimeter
type: Class
type: Node shape
subclass of: cell concentration unit
comment: A unit of concentration typically used for expressing the count of thousands of cells appearing within a one cubic millimeter volume of plasma

Imidaclothiz
type: Class
type: Node shape
type: Facet Value
subclass of: HHEAR_01374
comment: This class denotes Imidaclothiz
notation: IMZ

femtomole
type: unit of measurement
notation: fmol

milligram per milliliter
type: unit of measurement
notation: mg/ml

Uses Erythromycin A
type: Class
type: Quality Value
subclass of: Uses Antibiotics
subclass of: Restriction
  some values from: CHEBI_42355
  on property: SIO_000139
notation: 634
definition: Has used or uses erythromycin A

Disagree Major Barriers Or Dangers To Walking Response
type: Class
type: Quality Value
type: Node shape
subclass of: Disagree
subclass of: Major Barriers Or Dangers To Walking Response
comment: This class denotes Disagree Major Barriers Or Dangers To Walking Response
notation: 481

Smokes 15-24 Cigarettes Per Day
type: Class
type: Quality Value
type: Node shape
subclass of: EFO_0006525
subclass of: Restriction
  some values from: Class
    intersection of: SIO_001114
  on property: SIO_000216
subclass of: Restriction
  some values from: Class
    intersection of: SIO_001113
    intersection of: Restriction
      on property: SIO_000300
      has value: 15
  on property: SIO_000216
subclass of: Restriction
  on property: SIO_000221
  has value: cigarettes per day
comment: The act of smoking between 15 and 24 cigarettes per day
notation: 578

Fetal Disorder
type: Class
type: Node shape
subclass of: Pediatric Disorder
comment: A non-neoplastic or neoplastic disorder which occurs in the fetus. (Source: NCI Thesaurus)

PCB138 + PCB158
type: Class
type: Facet Value
subclass of: Polychlorobiphenyl
comment: CAS Number: 35065-28-2_74472-42-7
notation: PCB138_PCB158

Boron
type: Class
subclass of: Metal
notation: B
definition: A trace element with the atomic symbol B, atomic number 5, and atomic weight [10.806; 10.821]. Boron-10, an isotope of boron, is used as a neutron absorber in BORON NEUTRON CAPTURE THERAPY.

developmental disorder of mental health
type: Class
type: Quality Value
subclass of: Disease
comment: A disease of mental health that occur during a child's developmental period between birth and age 18 resulting in retarding of the child's psychological or physical development. (Source: Disease Ontology)
notation: 341

Zileuton (Zyflo)
type: Class
subclass of: Asthma Controller Medication
comment: This class denotes Zileuton (Zyflo)

Smokes 25-35 Cigarettes Per Day
type: Class
type: Quality Value
type: Node shape
subclass of: EFO_0006525
subclass of: Restriction
  on property: SIO_000221
  has value: cigarettes per day
subclass of: Restriction
  some values from: Class
    intersection of: SIO_001114
  on property: SIO_000216
subclass of: Restriction
  some values from: Class
    intersection of: SIO_001113
  on property: SIO_000216
comment: The act of smoking between 25 and 35 cigarettes per day
notation: 592

Strongly Disagree Major Barriers Or Dangers To Walking Response
type: Class
type: Quality Value
type: Node shape
subclass of: Strongly Disagree
subclass of: Major Barriers Or Dangers To Walking Response
comment: This class denotes Strongly Disagree Major Barriers Or Dangers To Walking Response
notation: 483

PCB28
type: Class
type: Facet Value
subclass of: Polychlorobiphenyl
comment: This class denotes PCB28
notation: PCB28

Bottle Feeding
type: Class
type: Node shape
subclass of: Feeding Method
comment: Provision of liquid nutrition via a closed container system with a rubber like mouthpiece resembling a nipple. [Definition Source: NCI]

PCB146 + PCB161
type: Class
type: Facet Value
subclass of: Polychlorobiphenyl
comment: CAS Number: 51908-16-8_74472-43-8
notation: PCB146_PCB161

Central African Republic
type: geographic region
comment: The country of Central African Republic
SIO_000313: Outside United States

Smokes 1-4 Cigarettes Per Day
type: Class
type: Quality Value
type: Node shape
subclass of: EFO_0006525
subclass of: Restriction
  some values from: Class
  on property: SIO_000216
subclass of: Restriction
  on property: SIO_000221
  has value: cigarettes per day
subclass of: Restriction
  some values from: Class
    intersection of: SIO_001113
    intersection of: Restriction
      on property: SIO_000300
      has value: 1
  on property: SIO_000216
comment: The act of smoking between 1 and 4 cigarettes per day
notation: 579

NFGS Blinded Population Group #9
type: Class
type: Quality Value
type: Node shape
subclass of: NFGS Blinded Population Group
comment: NICHD Fetal Growth Study blinded population group #9
notation: 562

Strongly Agree Major Barriers Or Dangers To Walking Response
type: Class
type: Quality Value
type: Node shape
subclass of: Strongly Agree
subclass of: Major Barriers Or Dangers To Walking Response
comment: This class denotes Strongly Agree Major Barriers Or Dangers To Walking Response
notation: 482

neighborhood
type: Class
type: Node shape
subclass of: Socioeconomic Status
subclass of: Housing Characteristic
subclass of: geographic region
comment: geographically localized community within a larger city, town or suburb (Source: wikidata.org)

anatomical entity
type: Class
subclass of: Thing
comment: This class denotes anatomical entity

Sulfluramid
type: Class
type: Node shape
subclass of: Perfluoroakyl and Polyfluoroalkyl Substance
comment: Sulfluramid is a sulfonamide obtained by the formal condensation of perfluorooctane-1-sulfonic acid with ethylamine. It has a role as an environmental contaminant, a xenobiotic, an acaricide and an insecticide. It is functionally related to a perfluorooctane-1-sulfonic acid and an ethylamine. (Source: Pubchem)
notation: ETFOSA

PCB128
type: Class
type: Facet Value
subclass of: Polychlorobiphenyl
comment: CAS Number: 38380-07-3
notation: PCB128

Philippines
type: geographic region
comment: The country of Philippines
SIO_000313: Outside United States

Mono-2-(carboxymethyl) hexyl phthalate
type: Class
type: Facet Value
subclass of: Phthalate
comment: This class denotes Mono-2-(carboxymethyl) hexyl phthalate
notation: MCMHP

Agree Major Barriers Or Dangers To Walking Response
type: Class
type: Quality Value
type: Node shape
subclass of: Agree
subclass of: Major Barriers Or Dangers To Walking Response
comment: This class denotes Agree Major Barriers Or Dangers To Walking Response
notation: 480

Smokes 5-14 Cigarettes Per Day
type: Class
type: Quality Value
type: Node shape
subclass of: EFO_0006525
subclass of: Restriction
  on property: SIO_000221
  has value: cigarettes per day
subclass of: Restriction
  some values from: Class
    intersection of: SIO_001113
    intersection of: Restriction
      on property: SIO_000300
      has value: 5
  on property: SIO_000216
comment: The act of smoking between 5 and 14 cigarettes per day
notation: 577

Second Hand Smoke Exposure by Household Member
type: Class
type: Quality Variable
type: Node shape
subclass of: environmental tobacco smoke exposure measurement
comment: A class used to indicate the level of second hand smoke exposure that occurs in a person's household

evidence
type: Class
subclass of: Thing
comment: This class denotes evidence

Coahuila y Tejas, Mexico
type: geographic region
comment: The state, province, or territory of Coahuila y Tejas, Mexico
SIO_000313: Q96

PCB137
type: Class
type: Facet Value
subclass of: Polychlorobiphenyl
comment: CAS Number: 35694-06-5
notation: PCB137

food calorie intake measurement
type: Class
subclass of: Thing
comment: This class denotes food calorie intake measurement

Uses Amoxicillin
type: Class
type: Quality Value
subclass of: Uses Antibiotics
notation: 631
definition: Has used or uses amoxicillin

NFGS Blinded Population Group #7
type: Class
type: Quality Value
type: Node shape
subclass of: NFGS Blinded Population Group
comment: NICHD Fetal Growth Study blinded population group #7
notation: 560

Often Feels Stressed
type: Class
type: Node shape
subclass of: most of the time
subclass of: Child Stress Assessment
comment: This class denotes Often Feels Stressed

Lahu Na
type: Class
type: Quality Value
type: Node shape
subclass of: Asian Non-Hispanic
comment: The ethnic group of Southeast Asians that speak the Lahu Na (or Black Lahu) language
notation: 1228

PCB114 + PCB122
type: Class
type: Facet Value
subclass of: Polychlorobiphenyl
comment: CAS Number: 74472-37-0_76842-07-4
notation: PCB114_PCB122

Cameroon
type: geographic region
comment: The country of Cameroon
SIO_000313: Outside United States

Western United States
type: Node shape
type: Facet
type: geographic region
comment: This resource denotes the Western United States
SIO_000313: United States of America

Strongly Disagree Local Streets Have Usable Footpaths Response
type: Class
type: Quality Value
type: Node shape
subclass of: Strongly Disagree
subclass of: Local Streets Have Usable Footpaths Response
comment: This class denotes Strongly Disagree Local Streets Have Usable Footpaths Response
notation: 479

Major Barriers Or Dangers To Walking Response
type: Class
type: Quality Variable
type: Node shape
subclass of: Preschool-age Children's Physical Activity Questionnaire Response
comment: A response to the questionnaire statement "There are major barriers or dangers to walking with my child in my neighborhood that make it hard to get from place to place (e.g., major roads, railway lines, storm water drains or rivers)."

Hormone Therapy
type: Class
type: Node shape
subclass of: Pharmacotherapy
comment: Various treatment modalities that produce the desired therapeutic effect by means of change of hormone/hormones level. (Source: NCI Thesaurus)

NFGS Blinded Population Group #8
type: Class
type: Quality Value
type: Node shape
subclass of: NFGS Blinded Population Group
comment: NICHD Fetal Growth Study blinded population group #8
notation: 561

Always Feels Stressed
type: Class
type: Node shape
subclass of: always
subclass of: Child Stress Assessment
comment: This class denotes Always Feels Stressed

Hepatic Steatosis
type: Class
type: Node shape
subclass of: Steatosis
comment: A morphologic finding indicating intracytoplasmic fat accumulation in the liver parenchyma. (Source: NCI Thesaurus)

Immature Granulocyte Count
type: Class
type: Quantity Variable
type: Node shape
subclass of: SIO_000794
subclass of: Immature Granulocytes Measurement
comment: The determination of the amount of immature granulocytes present in a sample.

Administrative Claims, Healthcare
type: Class
type: Node shape
subclass of: medical health record
comment: Information relating to itemized coding of procedures and costs associated with healthcare delivery, used as a means for tracking healthcare utilization, patterns of care, and treatment outcomes. (Source: Medical Subject Headings Ontology)

PCB118 + PCB106
type: Class
type: Facet Value
subclass of: Polychlorobiphenyl
comment: CAS Number: 31508-00-6_70424-69-0
notation: PCB118_PCB106

on property: currency
has value: USD

Kaufman ABC Sequence Subscale
type: Class
subclass of: HHEAR_00198
definition: Subscale of Kaufman ABC designed to measure the ability to solve problems by remembering and using an ordered series of images or ideas

Lahu Nyi
type: Class
type: Quality Value
type: Node shape
subclass of: Asian Non-Hispanic
comment: The ethnic group of Southeast Asians that speak the Lahu Nyi (or Red Lahu) language
notation: 1229

Infectious Disorder
type: Class
type: Facet
subclass of: Disease
comment: This class denotes Infectious Disorder

Detached House
type: Class
type: Quality Value
type: Node shape
subclass of: Residential Building
subclass of: Living Quarters
comment: houses that stand apart with no walls in common with other structures (Source: Wikidata)
notation: 785

blood segmented neutrophil count to total leukocyte count ratio
type: Class
type: Quantity Variable
subclass of: Physical And Mental Assessment
comment: This class denotes blood segmented neutrophil count to total leukocyte count ratio

Rarely Feels Stressed
type: Class
type: Node shape
subclass of: some of the time
subclass of: Child Stress Assessment
comment: This class denotes Rarely Feels Stressed

Guinea
type: geographic region
comment: The country of Guinea
SIO_000313: Outside United States

Completed Middle School
type: Class
type: Quality Value
type: Node shape
subclass of: Some Middle School
comment: Indicates that a subject has completed middle school.
notation: 1221

community species diversity
type: Class
subclass of: SIO_000052
comment: This class denotes community species diversity

Fourth
type: Class
subclass of: Ordinal Position
comment: Following the third position in an ordering or series; coming next after the third and just before the fifth in position. (Source: NCI Thesaurus)

Guinea-Bissau
type: geographic region
comment: The country of Guinea-Bissau
SIO_000313: Outside United States

NFGS Blinded Population Group #5
type: Class
type: Quality Value
type: Node shape
subclass of: NFGS Blinded Population Group
comment: NICHD Fetal Growth Study blinded population group #5
notation: 558

Uses Multiflora
type: Class
type: Quality Value
subclass of: HHEAR_01232
subclass of: Restriction
  some values from: Multiflora
  on property: SIO_000139
comment: This class denotes Uses Multiflora
notation: 629

Agree Local Streets Have Usable Footpaths Response
type: Class
type: Quality Value
type: Node shape
subclass of: Agree
subclass of: Local Streets Have Usable Footpaths Response
comment: This class denotes Agree Local Streets Have Usable Footpaths Response
notation: 476

Does Not Use Probiotic Supplements
type: Class
type: Quality Value
type: Node shape
subclass of: nutrition intake
comment: Does not (currently or during a specified time period) use a probiotic supplement
notation: 630
disjoint with: HHEAR_01232

medical intervention
type: Class
type: Quality Variable
subclass of: medical procedure
comment: This class denotes medical intervention

Sometimes Feels Stressed
type: Class
type: Node shape
subclass of: some of the time
subclass of: Child Stress Assessment
comment: This class denotes Sometimes Feels Stressed

mono(2-ethylhexyl) phthalate
type: Class
type: Facet Value
subclass of: Phthalate
notation: MEHP
definition: PHYSICAL DESCRIPTION: Clear colorless to cloudy white viscous liquid. (NTP, 1992)

Thai Yai
type: Class
type: Quality Value
type: Node shape
subclass of: Asian Non-Hispanic
comment: The ethnic group of Thai Yai people, also known as Shan-Gyi or "Greater Shan," who are a large ethnic group of Tai origin primarily inhabiting the Shan State of Myanmar, as well as areas of northern Thailand, Yunnan province in China, and Assam in India.
notation: 1224

PCB110
type: Class
type: Facet Value
subclass of: Polychlorobiphenyl
comment: CAS Number: 38380-03-9
notation: PCB110

Cyclohexane-1,2-dicarboxylic mono carboxyisooctyl ester
type: Class
type: Quality Value
type: Node shape
subclass of: Phthalate
comment: This class denotes Cyclohexane-1,2-dicarboxylic mono carboxyisooctyl ester
notation: CXMINCH

Ivory Coast
type: geographic region
comment: The country of Ivory Coast
SIO_000313: Outside United States

Fifth
type: Class
subclass of: Ordinal Position
comment: Following the fourth position in an ordering or series; coming next after the fourth and just before the sixth in position. (Source: NCI Thesaurus)

Disagree Local Streets Have Usable Footpaths Response
type: Class
type: Quality Value
type: Node shape
subclass of: Disagree
subclass of: Local Streets Have Usable Footpaths Response
comment: This class denotes Disagree Local Streets Have Usable Footpaths Response
notation: 477

Blood Segmented Neurophil Count
type: Class
type: Quantity Variable
subclass of: Physical And Mental Assessment
subclass of: SIO_000794
comment: This class denotes Blood Segmented Neurophil Count

NFGS Blinded Population Group #6
type: Class
type: Quality Value
type: Node shape
subclass of: NFGS Blinded Population Group
comment: NICHD Fetal Growth Study blinded population group #6
notation: 559

3-(4-(1-(4-(2,3-Epoxypropoxy)phenyl)-1-methylethyl)phenoxy)propane-1,2-diol
type: Class
type: Node shape
type: Facet Value
subclass of: HHEAR_01385
comment: This class denotes 3-(4-(1-(4-(2,3-Epoxypropoxy)phenyl)-1-methylethyl)phenoxy)propane-1,2-diol
notation: BADGEH2O

Brunei
type: geographic region
comment: The country of Brunei
SIO_000313: Outside United States

mono-carboxy isononyl phthalate
type: Class
type: Facet Value
subclass of: Phthalate
comment: This class denotes mono-carboxy isononyl phthalate
notation: mCINP

Less than High School
type: Class
type: Quality Value
subclass of: High School or Less
comment: This class denotes Less than High School
notation: 215

Tibia
type: Class
subclass of: biological entity
definition: The major preaxial endochondral bone in the posterior zeugopod.

Unknown Race
type: Class
type: Quality Value
subclass of: race
notation: 48
definition: Unknown Race

Selenium
type: Class
type: Facet Value
subclass of: Metal
subclass of: HHEAR_01387
notation: Se
definition: An element with the atomic symbol Se, atomic number 34, and atomic weight 78.96. It is an essential micronutrient for mammals and other animals but is toxic in large amounts. Selenium protects intracellular structures against oxidative damage. It is an essential component of GLUTATHIONE PEROXIDASE.

Sixth
type: Class
type: Node shape
subclass of: Ordinal Position
comment: Following the fifth position in an ordering or series; coming next after the fifth and just before the seventh in position. (Source: NCI Thesaurus)

Childhood Followup 3 Day 5
type: Class
type: Node shape
subclass of: Study Followup 3 Day 5
subclass of: Restriction
  some values from: Childhood Followup 3 Day 4
  on property: intervalAfter
subclass of: Restriction
  some values from: Childhood Followup 3
  on property: intervalDuring
comment: The fifth day of the third study followup activity for a study that occurs during a subject's childhood period

window air conditioner
type: Class
type: Node shape
subclass of: HHEAR_01876
comment: air conditioner mounted in a window (Source: Wikidata)

triglyceride
type: Class
type: Node shape
type: Facet Value
subclass of: HHEAR_01391
comment: This class denotes triglyceride
notation: TG

Black Non-Hispanic
type: Class
type: Quality Value
subclass of: Non-Hispanic Ethnicity
subclass of: Black or African American
comment: This class denotes Black Non-Hispanic
notation: 216

Unmarried
type: Class
type: Quality Value
subclass of: Marital Status
notation: 46
definition: Indicates a person not currently joined in a legally binding matrimonial union.

mono-carboxy isooctyl phthalate
type: Class
type: Facet Value
subclass of: Phthalate
comment: This class denotes mono-carboxy isooctyl phthalate
notation: mCIOP

Peabody picture vocabulary test
type: Class
subclass of: Research or Clinical Assessment Tool
comment: This class denotes Peabody picture vocabulary test

milk
type: Class
type: Facet
subclass of: UBERON_0006314
subclass of: mammary gland fluid/secretion
comment: This class denotes milk
notation: BR
IAO_0000115: An emulsion of fat globules within a fluid that is secreted by the mammary gland during lactation.

malathion
type: Class
type: Node shape
subclass of: carboxylic ester
comment: A racemate comprising equimolar amounts of (R) and (S)-malathion. It is a broad spectrum organophosphate proinsecticide used to control a wide range of pests including Coleoptera, Diptera, fruit flies, mosquitos and spider mites. (Source: ChEBI Ontology)
notation: MALATH

Childhood Followup 3 Day 6
type: Class
type: Node shape
subclass of: Study Followup 3 Day 6
subclass of: Restriction
  some values from: Childhood Followup 3 Day 5
  on property: intervalAfter
subclass of: Restriction
  some values from: Childhood Followup 3
  on property: intervalDuring
comment: The sixth day of the third study followup activity for a study that occurs during a subject's childhood period

Coma
type: Class
type: Quality Value
subclass of: phenotype
subclass of: HP_0000001
notation: 124
definition: Complete absence of wakefulness and content of conscience, which manifests itself as a lack of response to any kind of external stimuli.

folates
type: Class
type: Node shape
type: Facet Value
subclass of: HHEAR_01390
comment: An N-acyl-L-α-amino acid anion obtained by deprotonation of any folic acid. (Source: ChEBI)
notation: FOL

mono-2-heptyl phthalate
type: Class
type: Facet Value
subclass of: Phthalate
comment: This class denotes mono-2-heptyl phthalate
notation: mHpP

Difference of Z-Scores
type: Class
type: Quantity Variable
subclass of: Physical And Mental Assessment
subclass of: HHEAR_00054
subclass of: Restriction
  some values from: Class
  on property: SIO_000008
subclass of: Restriction
  some values from: Class
    intersection of: Minuend
    intersection of: Z-Score
  on property: SIO_000008
definition: The arithmetic difference of two Z-Scores

Full Time Employment
type: Class
type: Quality Value
subclass of: ExO_0000034
notation: 64
definition: Employed for a standard number of hours of working time, at least 50% or 20 hours per week.

Vitamin D
type: Class
type: Facet Value
subclass of: Biomolecule
subclass of: HHEAR_00053
subclass of: HHEAR_01390
notation: VITD
definition: Vitamin D is a group of fat-soluble prohormones, which can be obtained from sun exposure, food and supplements. Vitamin D is biologically inactive and converted to the biologically active calcitriol via double hydroxylation in the body.

on property: currency
has value: USD

time interval
type: Class
subclass of: Thing
comment: This class denotes time interval

malathion diacid
type: Class
type: Node shape
type: Facet Value
subclass of: HHEAR_01374
comment: This class denotes malathion diacid
notation: MDA

Earth
type: Quality Value
type: NamedIndividual
type: geographic region
comment: third planet from the Sun in the Solar System
notation: 182

White Non-Hispanic
type: Class
type: Quality Value
subclass of: White
comment: This class denotes White Non-Hispanic
notation: 214

Study Followup 3 Day 8
type: Class
type: Node shape
subclass of: Study Activity
subclass of: Restriction
  some values from: Study Followup 3
  on property: intervalDuring
subclass of: Restriction
  some values from: Study Followup 3 Day 7
  on property: intervalAfter
comment: The eighth day of the third study followup activity for a study

Never Smoked
type: Class
type: Quality Value
subclass of: Smoking Status
notation: 56
definition: The quality of never smoking in the past.
was approved by: PER-Jeanette-Stingone

Subtrahend
type: Class
type: Quantity Variable
subclass of: SIO_000052
definition: In a difference expression, the subtrahend is the quantity or number to be subtracted from another.

granulomatosis with polyangiitis
type: Class
subclass of: Disease
comment: This class denotes granulomatosis with polyangiitis

PCB167
type: Class
type: Facet Value
subclass of: Polychlorobiphenyl
comment: CAS Number: 52663-72-6
notation: PCB167

Tanzania
type: geographic region
comment: The country of Tanzania
SIO_000313: Outside United States

Minuend
type: Class
type: Quantity Variable
subclass of: SIO_000052
definition: In a difference expression, the minuend is the quantity or number from which another is to be subtracted.

Vanadium
type: Class
type: Facet Value
subclass of: Metal
subclass of: HHEAR_01387
notation: V
definition: A metallic element with the atomic symbol V, atomic number 23, and atomic weight 50.94. It is used in the manufacture of vanadium steel. Prolonged exposure can lead to chronic intoxication caused by absorption usually via the lungs.

mono (2-ethyl-5-oxohexyl) phthalate
type: Class
type: Facet Value
subclass of: Phthalate
comment: This class denotes mono (2-ethyl-5-oxohexyl) phthalate
notation: MEOHP

Perfluoroheptanesulfonic acid
type: Class
type: Node shape
type: Facet Value
subclass of: Perfluoroakyl and Polyfluoroalkyl Substance
comment: This class denotes Perfluoroheptanesulfonic acid
notation: PFHpS

alpha-linolenic acid
type: Class
type: Facet Value
subclass of: Fatty Acid
notation: C183N3
definition: A linolenic acid with cis-double bonds at positions 9, 12 and 15. Shown to have an antithrombotic effect.

Asian
type: Class
type: Quality Value
type: Facet Value
subclass of: race
subclass of: HHEAR_00522
notation: 6
definition: A person having origins in any of the original peoples of the Far East, Southeast Asia, or the Indian subcontinent, including for example, Cambodia, China, India, Japan, Korea, Malaysia, Pakistan, the Philippine Islands, Thailand, and Vietnam.
was approved by: PER-Jeanette-Stingone

Restriction
on property: SIO_000300
has value: 7

Street Traffic Makes It Dangerous To Walk Response
type: Class
type: Quality Variable
type: Node shape
subclass of: Preschool-age Children's Physical Activity Questionnaire Response
comment: A response to the questionnaire statement "There is so much traffic along the streets that it makes it difficult or dangerous to walk with my child in my neighborhood."

Spirometry
type: Class
type: Node shape
subclass of: Pulmonary Function Test
comment: Measurement of the breathing capacity of the lung by means of a spirometer. (Source: NCI Thesaurus)

Indoor Air
type: Class
subclass of: air
comment: This class denotes Indoor Air

PCB156
type: Class
type: Facet Value
subclass of: Polychlorobiphenyl
comment: CAS Number: 38380-08-4
notation: PCB156

Gender
type: Class
type: Quality Variable
type: Facet
subclass of: Demographic
comment: This class denotes Gender

Mullen scales of early learning
type: Class
subclass of: Research or Clinical Assessment Tool
comment: This class denotes Mullen scales of early learning

Beclomethasone HFA
type: Class
subclass of: Asthma Controller Medication
comment: This class denotes Beclomethasone HFA

Outdoor Air
type: Class
subclass of: air
subclass of: Restriction
  some values from: ExO_0000020
  on property: SIO_000128
comment: This class denotes Outdoor Air

Vitamin B6 or Vitamin B7 or B Complex Vitamin Supplement
type: Class
type: Quality Value
type: Node shape
subclass of: Vitamin
comment: This is the union of B6 Vitamin Supplement, B7 Vitamin Supplement, or B Complex Vitamin Supplement.
notation: 1212
equivalent class: Class
  union of: B6 Vitamin Supplement
  union of: B7 Vitamin Supplement
  union of: B Complex Vitamin Supplement
  equivalent class: Vitamin B6 or Vitamin B7 or B Complex Vitamin Supplement

PCB157
type: Class
type: Facet Value
subclass of: Polychlorobiphenyl
comment: CAS Number: 69782-90-7
notation: PCB157

on property: currency
has value: ZAR

Arsenic
type: Class
type: Facet Value
subclass of: Metal
subclass of: HHEAR_01387
notation: As
definition: A shiny gray element with atomic symbol As, atomic number 33, and atomic weight 75. It occurs throughout the universe, mostly in the form of metallic arsenides. Most forms are toxic. According to the Fourth Annual Report on Carcinogens (NTP 85-002, 1985), arsenic and certain arsenic compounds have been listed as known carcinogens. (From Merck Index, 11th ed)

Dipropyl hydrogen phosphate
type: Class
type: Node shape
type: Facet Value
subclass of: HHEAR_01372
comment: This class denotes Dipropyl hydrogen phosphate
notation: DPRP

Hemoglobin Genotype AS
type: Class
type: Quality Value
subclass of: genotype
subclass of: SCD Genotype
comment: This class denotes Hemoglobin Genotype AS
notation: 347

Physical Activity
type: Class
type: Quantity Variable
subclass of: Physical Activity and Fitness
comment: This class denotes Physical Activity

mono(7-carboxyheptyl)phthalate
type: Class
type: Facet Value
subclass of: Phthalate
comment: This class denotes mono(7-carboxyheptyl)phthalate
notation: mCHpP

Stress Frequency
type: Class
type: Quality Variable
subclass of: HHEAR_00194
subclass of: biological quality
definition: How frequently a person gets stressed.
was approved by: PER-Jeanette-Stingone
editorial note: Again, we might want to link this to a specific assessment?

Does Not Use Corticosteroid Inhaler
type: Class
type: Quality Value
type: Node shape
subclass of: Corticosteroid Inhaler Use
comment: Indicates that a subject does not use a corticosteroid inhaler to control asthma symptoms.
notation: 733
disjoint with: Uses Corticosteroid Inhaler

Hypotonia
type: Class
type: Quality Value
type: Node shape
subclass of: phenotype
comment: Hypotonia is an abnormally low muscle tone (the amount of tension or resistance to movement in a muscle). Even when relaxed, muscles have a continuous and passive partial contraction which provides some resistance to passive stretching. Hypotonia thus manifests as diminished resistance to passive stretching. Hypotonia is not the same as muscle weakness, although the two conditions can co-exist. Hypotonia can be caused by abnormalities of the central nervous system, any element of the motor unit (including the lower motoneuron), or both. Hypotonia is not a specific diagnosis, but can be observed in hundreds of genetic and other diseases. The first distinction to make when assessing a child with hypotonia is whether decreased muscle tone is a result of an abnormality of the central nervous system (CNS), peripheral neuromuscular system, or a combined abnormality involving both. Clinical findings suggestive of an abnormality of the CNS may include hyperreflexia, cognitive developmental delay, and seizures. In contrast, physical findings pointing towards a neuromuscular origin may include weakness, lack of antigravity movements, muscle atrophy, fasciculations, and/or diminished reflexes, most often in the context of normal cognitive function. The HPO term does not distinguish between these etiologies. Additional HPO terms should be used as required to describe associated features. (Source: Human Phenotype Ontology)
notation: 1018

Study Followup 3 Day 5
type: Class
type: Node shape
subclass of: Study Activity
subclass of: Restriction
  some values from: Study Followup 3
  on property: intervalDuring
comment: The fifth day of the third study followup activity for a study

Inorganic Mercury (Hg2+)
type: Class
subclass of: Mercury Species
comment: This class denotes Inorganic Mercury (Hg2+)
notation: Hg2

New York, United States of America
type: geographic region
comment: The state, province, or territory of New York, United States of America
SIO_000313: Q24460

eclampsia
type: Class
type: Quality Value
subclass of: Eclampsia or Severe Pre-eclampsia
comment: This class denotes eclampsia
notation: 582

Toaster Count
type: Class
type: Quantity Variable
subclass of: Household Appliance Count
definition: Number of appliances used to toast bread.
was approved by: PER-Jeanette-Stingone

allele
type: Class
type: Node shape
subclass of: allele
subclass of: genomic feature
comment: One of a set of sequence features known to exist at a particular genomic location.

Does Not Use Other Asthma Medication
type: Class
type: Quality Value
type: Node shape
subclass of: Other Asthma Medication Use
comment: Does not use some other asthma medication besides Albuterol or an inhaled corticosteroid (ex. Cromolyn and Nedocromil, Oral Leukotriene Modifiers, Oral Theophylline, Oral Corticosteroids).
notation: 734
disjoint with: Uses Other Asthma Medication

alpha-beta T cell activation
type: Class
subclass of: Thing
comment: This class denotes alpha-beta T cell activation

Study Followup 3 Day 6
type: Class
type: Node shape
subclass of: Study Activity
subclass of: Restriction
  some values from: Study Followup 3
  on property: intervalDuring
subclass of: Restriction
  some values from: Study Followup 3 Day 5
  on property: intervalAfter
comment: The sixth day of the third study followup activity for a study

food product organismal source
type: Class
subclass of: biological entity
comment: This class denotes food product organismal source

on property: maxValue
has value: 1666

Quantity Variable
type: Class
subclass of: Thing
comment: This class denotes Quantity Variable

Unemployment
type: Class
type: Quality Value
subclass of: ExO_0000034
subclass of: Employment Status
notation: 67
definition: The state of not having a job.

Other Asthma Medication Use
type: Class
type: Node shape
subclass of: Asthma Controller Use
comment: Indicates whether or not a subject uses or does not use asthma control medication other than an Albuterol or corticosteroid inhaler (ex. Cromolyn and Nedocromil, Oral Leukotriene Modifiers, Oral Theophylline, Oral Corticosteroids).

tracheostomy
type: Class
subclass of: medical procedure
comment: This class denotes tracheostomy

Housing Characteristic
type: Class
subclass of: Study Indicator
definition: Housing Characteristic Indicator Class
was approved by: PER-Jeanette-Stingone

Soil Floor
type: Class
type: Quality Value
subclass of: Floor Covering By Type
notation: 84
definition: The flooring is made of soil.
was approved by: PER-Jeanette-Stingone

mono (6-COOH-2-methylheptyl) phthalate
type: Class
type: Facet Value
subclass of: Phthalate
comment: This class denotes mono (6-COOH-2-methylheptyl) phthalate
notation: MCOMHP

Breast Fibroglandular Tissue
type: Class
type: Node shape
subclass of: Mammary Gland Tissue
comment: Breast tissue that contains glandular epithelial and fibrous tissue. (Source: NCI Thesaurus)

on property: minValue
has value: 45000

Seizures
type: Class
type: Quality Value
subclass of: phenotype
subclass of: HP_0000001
notation: 125
definition: Seizures are an intermittent abnormality of the central nervous system due to a sudden, excessive, disorderly discharge of cerebral neurons and characterized clinically by some combination of disturbance of sensation, loss of consciousness, impairment of psychic function, or convulsive movements. The term epilepsy is used to describe chronic, recurrent seizures.

Childhood Followup 2 Day 7
type: Class
type: Node shape
subclass of: Study Followup 2 Day 7
subclass of: Restriction
  some values from: HHEAR_00670
  on property: intervalDuring
subclass of: Restriction
  some values from: Childhood Followup 2 Day 6
  on property: intervalAfter
comment: The seventh day of the second study followup activity for a study that occurs during a subject's childhood period

Part Time Employment
type: Class
type: Quality Value
subclass of: ExO_0000034
notation: 65
definition: Employment involving less than the standard or customary working time.

artificial respiration
type: Class
subclass of: medical intervention
comment: This class denotes artificial respiration

mono (7-COOH-2-methyloctyl) phthalate
type: Class
type: Facet Value
subclass of: Phthalate
comment: This class denotes mono (7-COOH-2-methyloctyl) phthalate
notation: MCOMOP

Does Not Use Albuterol Inhaler
type: Class
type: Quality Value
type: Node shape
subclass of: Albuterol Inhaler Use
comment: Indicates that a subject does not use an Albuterol inhaler to control acute asthma symptoms.
notation: 732
disjoint with: Uses Albuterol Inhaler

Uses Steroid Treatment
type: Class
type: Quality Value
subclass of: Pharmacotherapy
subclass of: Restriction
  some values from: CHEBI_35341
  on property: SIO_000139
notation: 28
definition: Had a form of treatment which uses steroids.
was approved by: PER-Jeanette-Stingone

N-(6-Chloro-3-pyridylmethyl)-N'-cyano-acetamidine
type: Class
type: Node shape
type: Facet Value
subclass of: HHEAR_01374
comment: This class denotes N-(6-Chloro-3-pyridylmethyl)-N'-cyano-acetamidine
notation: NDMA

duration
type: Class
subclass of: Thing
comment: This class denotes duration; A process quality inhering in a bearer by virtue of the bearer's magnitude of the temporal extent between the starting and ending point. (Source: PATO Ontology)

Childhood Followup 2 Day 8
type: Class
type: Node shape
subclass of: Study Followup 2 Day 8
subclass of: Restriction
  some values from: Childhood Followup 2 Day 7
  on property: intervalAfter
subclass of: Restriction
  some values from: HHEAR_00670
  on property: intervalDuring
comment: The eighth day of the second study followup activity for a study that occurs during a subject's childhood period

Student
type: Class
type: Quality Value
subclass of: ExO_0000034
subclass of: Education
comment: This class denotes Student
notation: 66

Albuterol Inhaler Use
type: Class
type: Node shape
subclass of: Asthma Controller Use
comment: Indicates whether or not a subject uses or does not use an Albuterol inhaler for asthma

Annual Income $40,001 to $70,000
type: Class
type: Quality Value
subclass of: HHEAR_02320
subclass of:
  on property: minValue
  has value: 40001
subclass of:
  on property: maxValue
  has value: 70000
subclass of:
  on property: SIO_000900
  has value: year
comment: This class denotes Annual Income $40,001 to $70,000
notation: 207

Small Molecule
type: Class
subclass of: Biomolecule
definition: A small molecule is a low molecular weight (< 900 daltons) organic compound that may help regulate a biological process, with a size on the order of 1 nm. Most drugs are small molecules.

dimethylphosphate
type: Class
type: Facet Value
subclass of: Dialkyl Phosphate Pesticide Metabolite
comment: This class denotes dimethylphosphate
notation: DMP
editorial note: To Do: align with CHEBI.

SIO_000554
type: Quality Value
notation: 134

Attached Umbilical Cord Width
type: Class
type: Quantity Variable
type: Node shape
subclass of: Umbilical Cord Measurement
subclass of: Class
comment: This class denotes Attached Umbilical Cord Width

Childhood Followup 2 Day 5
type: Class
type: Node shape
subclass of: HHEAR_01629
subclass of: Restriction
  some values from: Childhood Followup 2 Day 4
  on property: intervalAfter
comment: The fifth day of the second study followup activity for a study that occurs during a subject's childhood period

Insulin
type: Class
subclass of: Protein
subclass of: HHEAR_00548
definition: A peptide hormone produced in the pancreas and involved in regulating the metabolism of carbohydrates (particularly glucose) and fats. Commonly thought of as a protein, it consists of two petide chains, one containing 21 amino acid residues and the other containing 30; the chains are joined together by 2 disulfide bonds. Recombinant insulin is identical to human insulin, but is synthesised by inserting the human insulin gene into E. coli, which then produces insulin for human use. It is used in the treatment of type I and type II diabetes.

Corticosteroid Inhaler Use
type: Class
type: Node shape
subclass of: Asthma Controller Use
comment: Indicates whether or not a subject uses or does not use a corticosteroid inhaler for asthma

dimethylthiophosphate
type: Class
type: Facet Value
subclass of: Dialkyl Phosphate Pesticide Metabolite
comment: This class denotes dimethylthiophosphate
notation: DMTP
editorial note: To Do: align with CHEBI.

Annual Income More Than $70,001
type: Class
type: Quality Value
subclass of: HHEAR_01116
subclass of:
  on property: currency
  has value: USD
subclass of:
  on property: minValue
  has value: 70001
subclass of:
  on property: SIO_000900
  has value: year
subclass of:
  on property: maxValue
comment: This class denotes Annual Income More Than $70,001
notation: 208

Smoker
type: Class
type: Quality Value
subclass of: Smoking Status
notation: 105
definition: The quality of smoking cigarettes.

liver cirrhosis
type: Class
type: Quality Value
subclass of: phenotype
comment: This class denotes liver cirrhosis
notation: 756

institute
type: Class
subclass of: Thing
comment: This class denotes institute

Childhood Followup 2 Day 6
type: Class
type: Node shape
subclass of: Study Followup 2 Day 6
subclass of: Restriction
  some values from: Childhood Followup 2 Day 5
  on property: intervalAfter
subclass of: Restriction
  some values from: HHEAR_00670
  on property: intervalDuring
comment: The sixth day of the second study followup activity for a study that occurs during a subject's childhood period

Employment
type: Class
type: Quality Value
subclass of: ExO_0000034
subclass of: Employment Status
comment: The state of being engaged in an activity or service for wages or salary. (Source: NCI Thesaurus)
notation: 245

Asthma Related Clinic Visit
type: Class
type: Quantity Variable
subclass of: Asthma Related Health Encounter
comment: This class denotes Asthma Related Clinic Visit

food packaging
type: Class
type: Node shape
type: Facet
subclass of: HHEAR_00062
comment: A food contact material which encloses the food and can be in the type of a container, packaging or wrapping. (Source: Food Ontology)

Annual Income $10,001 to $20,000
type: Class
type: Quality Value
subclass of: Annual Income $20,000 or Less
subclass of:
  on property: currency
  has value: USD
subclass of:
  on property: maxValue
  has value: 20000
subclass of:
  on property: minValue
  has value: 10001
subclass of:
  on property: SIO_000900
  has value: year
comment: This class denotes Annual Income $10,001 to $20,000
notation: 205

Relative
type: Class
subclass of: SIO_000016
subclass of: SIO_000287
definition: Broadly, kinship patterns may be considered to include people related by both descent – i.e. social relations during development – and by marriage. Human kinship relations through marriage are commonly called "affinity" in contrast to the relationships that arise in one's group of origin, which may be called one's descent group. In some cultures, kinship relationships may be considered to extend out to people an individual has economic or political relationships with, or other forms of social connections. Within a culture, some descent groups may be considered to lead back to gods or animal ancestors (totems). This may be conceived of on a more or less literal basis.
was approved by: PER-Jeanette-Stingone

diethylthiophosphate
type: Class
type: Facet Value
subclass of: Dialkyl Phosphate Pesticide Metabolite
comment: This class denotes diethylthiophosphate
notation: DETP
editorial note: To Do: align with CHEBI.

ribonucleic acid
type: Class
subclass of: Macromolecule
comment: This class denotes ribonucleic acid

Umbilical Cord Measurement
type: Class
type: Node shape
subclass of: Clinical Measurement
comment: This class denotes Umbilical Cord Measurement

Study Followup 2 Day 7
type: Class
type: Node shape
subclass of: Study Activity
subclass of: Restriction
  some values from: Study Followup 2
  on property: intervalDuring
subclass of: Restriction
  some values from: Study Followup 2 Day 6
  on property: intervalAfter
comment: The seventh day of the second study followup activity for a study

dimethyldithiophosphate
type: Class
type: Facet Value
subclass of: Dialkyl Phosphate Pesticide Metabolite
comment: This class denotes dimethyldithiophosphate
notation: DMDP
editorial note: To Do: align with CHEBI.

Annual Income $20,001 to $40,000
type: Class
type: Quality Value
subclass of: Annual Income $20,000 to $50,000
subclass of:
  on property: SIO_000900
  has value: year
subclass of:
  on property: minValue
  has value: 20001
subclass of:
  on property: currency
  has value: USD
comment: This class denotes Annual Income $20,001 to $40,000
notation: 206

Severe Malarial Anemia
type: Class
type: Quality Value
subclass of: Anemia
notation: 127
definition: In holoendemic transmission areas, Severe Malarial Anemia (SMA) is the primary clinical manifestation of severe childhood malaria, with cerebral malaria occurring only in rare cases. Mortality rates from SMA can exceed 30% in pediatric populations residing in holoendemic transmission areas. The pathophysiological processes that contribute to SMA involve direct and indirect destruction of parasitized and non-parasitized red blood cells (RBCs), inefficient and/or suppression of erythropoiesis, and dyserythropoiesis.

Attached Umbilical Cord Length
type: Class
type: Quantity Variable
type: Node shape
subclass of: Umbilical Cord Measurement
comment: This class denotes Attached Umbilical Cord Length

Study Followup 2 Day 8
type: Class
type: Node shape
subclass of: Study Activity
subclass of: Restriction
  some values from: Study Followup 2
  on property: intervalDuring
subclass of: Restriction
  some values from: Study Followup 2 Day 7
  on property: intervalAfter
comment: The eighth day of the second study followup activity for a study

Composite Score
type: Class
type: Quality Variable
subclass of: Physical And Mental Assessment
subclass of: score
definition: A single value that is calculated from multiple scores. This composite score can then be used as a single variable in further analysis and comparison. [def-source: NCI]

Uses Prenatal Vitamins
type: Class
type: Quality Value
type: Node shape
subclass of: HHEAR_00525
comment: Indicates that a subject uses or has used prenatal vitamins prior to pregnancy.
notation: 1219

Child Stress Assessment
type: Class
type: Node shape
subclass of: Physical And Mental Assessment
subclass of: Assessment
subclass of: Restriction
  some values from: CAO_00518
  on property: SIO_000215
subclass of: Restriction
  some values from: Child
  on property: SIO_000139
comment: A qualitative assessment of the level of stress experienced by a child.

Interfering substances present
type: Class
subclass of: comment
comment: This class denotes Interfering substances present

minValue
type: Property
comment: The lower value of some characteristic or property.

Uses Biogaia
type: Class
type: Quality Value
subclass of: HHEAR_01232
subclass of: Restriction
  some values from: Biogaia
  on property: SIO_000139
comment: This class denotes Uses Biogaia
notation: 627

azithromycin
type: Class
type: Node shape
subclass of: chemical entity
comment: A macrolide antibiotic useful for the treatment of bacterial infections.

NFGS Blinded Population Group #3
type: Class
type: Quality Value
type: Node shape
subclass of: NFGS Blinded Population Group
comment: NICHD Fetal Growth Study blinded population group #3
notation: 556

Nauru
type: geographic region
comment: The country of Nauru
SIO_000313: Outside United States

Never Feels Stressed
type: Class
type: Node shape
subclass of: never
subclass of: Child Stress Assessment
comment: This class denotes Never Feels Stressed

Initial concentration higher than the highest standard, insufficient volume for repeat analysis (93, 18)
type: Class
subclass of: comment
comment: This class denotes Initial concentration higher than the highest standard, insufficient volume for repeat analysis (93, 18)

Completed Primary School
type: Class
type: Quality Value
type: Node shape
subclass of: High School or Less
comment: Indicates that a subject has completed primary school.
notation: 1220

http://rdf.ncbi.nlm.nih.gov/pubchem/compound/18134
type: Class
type: Node shape
type: Facet Value
subclass of: Perfluoroakyl and Polyfluoroalkyl Substance
comment: This class denotes N-Ethyl-N-[(heptadecafluorooctyl)sulphonyl]glycine
notation: NETFOSAA

Strongly Agree Local Streets Have Usable Footpaths Response
type: Class
type: Quality Value
type: Node shape
subclass of: Strongly Agree
subclass of: Local Streets Have Usable Footpaths Response
comment: This class denotes Strongly Agree Local Streets Have Usable Footpaths Response
notation: 478

NFGS Blinded Population Group #4
type: Class
type: Quality Value
type: Node shape
subclass of: NFGS Blinded Population Group
comment: NICHD Fetal Growth Study blinded population group #4
notation: 557

Uses Biolactus
type: Class
type: Quality Value
subclass of: HHEAR_01232
subclass of: Restriction
  some values from: Biolactus
  on property: SIO_000139
comment: This class denotes Uses Biolactus
notation: 628

Kaufman ABC
type: Class
subclass of: HHEAR_00198
definition: culturally fair, cognitive ability test for children

on property: currency
has value: USD

Household
type: Class
subclass of: SIO_000016
subclass of: Housing Characteristic
definition: A household consists of one or more people who live in the same dwelling and also share meals or living accommodation, and may consist of a single family or some other grouping of people. A single dwelling will be considered to contain multiple households if either meals or living space are not shared. The household is the basic unit of analysis in many social, microeconomic and government models, and is important to the fields of economics and inheritance.

NFGS Blinded Population Group #1
type: Class
type: Quality Value
type: Node shape
subclass of: NFGS Blinded Population Group
comment: NICHD Fetal Growth Study blinded population group #1
notation: 554

mass density unit
type: Class
type: unit of measurement
subclass of: Thing
comment: "A density unit which is a standard measure of the mass of a substance in a given volume." [UOC:GVG]
notation: mdu

Uses Bio-flora
type: Class
type: Quality Value
subclass of: HHEAR_01232
subclass of: Restriction
  some values from: Bio-flora
  on property: SIO_000139
comment: This class denotes Uses Bio-flora
notation: 625

Palau
type: geographic region
comment: The country of Palau
SIO_000313: Outside United States

Menopause
type: Class
type: Node shape
subclass of: time interval
subclass of: biological_process
comment: The permanent cessation of menses, usually defined by 6 to 12 months of amenorrhea in a woman over 45 years of age. (Source: NCI Thesaurus)

Irregular result, no concentration reported
type: Class
subclass of: comment
comment: This class denotes Irregular result, no concentration reported

NFGS Blinded Population Group #2
type: Class
type: Quality Value
type: Node shape
subclass of: NFGS Blinded Population Group
comment: NICHD Fetal Growth Study blinded population group #2
notation: 555

kilogram per meter
type: unit of measurement
notation: kg/m

concentration unit
type: Class
subclass of: Thing
comment: This class denotes concentration unit

Methyl mercury (CH3Hg+)
type: Class
subclass of: Mercury Species
comment: This class denotes Methyl mercury (CH3Hg+)
notation: CH3Hg

Uses Lactil
type: Class
type: Quality Value
subclass of: HHEAR_01232
subclass of: Restriction
  some values from: Lactil
  on property: SIO_000139
comment: This class denotes Uses Lactil
notation: 626

Respiratory distress
type: Class
subclass of: biological quality
comment: This class denotes Respiratory distress

Rhode Island, United States of America
type: geographic region
comment: The state, province, or territory of Rhode Island, United States of America
SIO_000313: Q24460

dimethyl phthalate
type: Class
type: Node shape
subclass of: Phthalate
comment: CAS: 131-11-3
notation: DMPH

Inductively Coupled Plasma Mass Spectrometry
type: Class
subclass of: Mass Spectrometry
comment: This class denotes Inductively Coupled Plasma Mass Spectrometry

FEV1 Percent Predicted Value (pre-bronchodilator administration)
type: Class
type: Node shape
subclass of: FEV1 Percent Predicted Value
subclass of: HHEAR_02201
comment: The percent ratio of a patient's best FEV1 value divided by the expected or predicted FEV1 value prior to administering bronchodilator

Finding
type: Class
type: Node shape
subclass of: evidence
comment: Clinical, laboratory or molecular evidence, or absence of evidence of disease. (Source: NCI Thesaurus)

area density unit
type: Class
type: unit of measurement
subclass of: Thing
comment: "A density unit which is a standard measure of the mass exerting an influence on a given area." [Wikipedia:Wikipedia]
notation: adu

percent
type: unit of measurement
notation: %

Uses Vivera
type: Class
type: Quality Value
subclass of: HHEAR_01232
subclass of: Restriction
  some values from: HHEAR_01273
  on property: SIO_000139
comment: This class denotes Uses Vivera
notation: 623

Homemaker
type: Class
type: Quality Value
subclass of: ExO_0000034
notation: 68
definition: A person who manages a home as their main daily activity.

spinal cord disease
type: Class
type: Node shape
subclass of: Neurological Issues with Spinal Cord
comment: This class denotes spinal cord disease

Icteric
type: Class
subclass of: comment
comment: This class denotes Icteric

FEV1 Percent Predicted Value (post-bronchodilator administration)
type: Class
type: Node shape
subclass of: FEV1 Percent Predicted Value
subclass of: HHEAR_02202
comment: The percent ratio of a patient's best FEV1 value divided by the expected or predicted FEV1 value after administering bronchodilator

Tooth
type: Class
type: Facet
subclass of: tissue
definition: Skeletal element within the mouth (or in some species, upper part of the digestive tract) that is composed of dentine and is used in procuring or masticating food. [database_cross_reference: http://orcid.org/0000-0002-6601-2165][database_cross_reference: http://en.wikipedia.org/wiki/Tooth_(animal)]

Allergic rhinitis
type: Class
type: Quality Value
type: Node shape
subclass of: Allergy
comment: It is characterized by one or more symptoms including sneezing, itching, nasal congestion, and rhinorrhea.
notation: 596

Uses Vintix
type: Class
type: Quality Value
subclass of: HHEAR_01232
subclass of: Restriction
  some values from: HHEAR_01274
  on property: SIO_000139
comment: This class denotes Uses Vintix
notation: 624

Water Tank
type: Class
type: Quality Value
type: Node shape
subclass of: Water Source
comment: A container for storing water. (Source: wikidata.org)
notation: 992

Tobacco Metabolite
type: Class
type: Facet
subclass of: Targeted Analyte
comment: This class denotes Tobacco Metabolite
notation: USMOKE

on property: maxValue
has value: 5000

FEV1 Best Value (pre-bronchodilator administration)
type: Class
type: Node shape
subclass of: FEV1 Best Value
subclass of: HHEAR_02201
comment: Measured FEV1 best value prior to administration of bronchodilator

on property: maxValue
has value: 30000

Initial concentration higher than the highest standard
type: Class
subclass of: comment
comment: This class denotes Initial concentration higher than the highest standard

Number of Years of Education
type: Class
type: Quantity Variable
type: Node shape
subclass of: Demographic
subclass of: SIO_000794
comment: The number of education years that a subject has competed. (Source: NCI Thesaurus)

count unit
type: unit of measurement
notation: count

Supper
type: Class
type: Node shape
subclass of: Meal
comment: The evening meal, usually the main meal of the day.

Study Followup 3 Day 7
type: Class
type: Node shape
subclass of: Study Activity
subclass of: Restriction
  some values from: Study Followup 3 Day 6
  on property: intervalAfter
subclass of: Restriction
  some values from: Study Followup 3
  on property: intervalDuring
comment: The seventh day of the third study followup activity for a study

Ultra High Performance Liquid Chromatography Instrument
type: Class
subclass of: High-Performance Liquid Chromatography
definition: Modern HPLC systems have been improved to work at much higher pressures, and therefore are able to use much smaller particle sizes in the columns (<2 μm). These "Ultra High Performance Liquid Chromatography" systems or UHPLCs can work at up to 120 MPa (17, 405 lbf/in^2), or about 1200 atmospheres.
was approved by: PER-Jim-McCusker

assay
type: Class
subclass of: AnalyticalMethod
comment: This class denotes assay

Infrared Multiphoton Dissociation (IRMPD)
type: Class
subclass of: Tandem Mass Spectrometry
comment: This class denotes Infrared Multiphoton Dissociation (IRMPD)

FEV1 Best Value (post-bronchodilator administration)
type: Class
type: Node shape
subclass of: FEV1 Best Value
subclass of: HHEAR_02202
comment: Measured FEV1 best value after administration of bronchodilator

Lunch
type: Class
type: Node shape
subclass of: Meal
comment: A midday meal sometimes also called dinner.

body fat morphological measurement
type: Class
subclass of: Thing
comment: Measurement of adipose tissue in entire body or region of body of an organism. (Source: Clinical Measurement Ontology)

Uses Perenteryl
type: Class
type: Quality Value
subclass of: HHEAR_01232
subclass of: Restriction
  some values from: HHEAR_01272
  on property: SIO_000139
comment: This class denotes Uses Perenteryl
notation: 622

NHLBI
type: Class
type: Facet
subclass of: Funding Institute
comment: This class denotes NHLBI

Strongly Agree Neighborhood Is Safe Response
type: Class
type: Quality Value
type: Node shape
subclass of: Strongly Agree
subclass of: Neighborhood Is Safe Response
comment: This class denotes Strongly Agree Neighborhood Is Safe Response
notation: 474

School Breakfast
type: Class
type: Node shape
subclass of: Breakfast
subclass of: Restriction
  some values from: school
  on property: SIO_000061
comment: Breakfast meal prepared by, and served at school.

Unknown if Any Household Members Currently Smoke
type: Class
type: Quality Value
type: Node shape
subclass of: Second Hand Smoke Exposure by Household Member
comment: This class denotes Unknown if Any Household Members Currently Smoke
notation: 553

B Complex Vitamin Supplement
type: Class
type: Quality Value
subclass of: Vitamin B6 or Vitamin B7 or B Complex Vitamin Supplement
comment: This class denotes B Complex Vitamin Supplement
notation: 1211

Second
type: Class
subclass of: Ordinal Position
comment: Coming next after the first in position in space or time or degree or magnitude (Source: NCI Thesaurus)

Histopathologic Examination
type: Class
type: Node shape
subclass of: Medical Examination
comment: The microscopic study of characteristic tissue abnormalities by employing various cytochemical and immunocytochemical stains. (Source: NCI Thesaurus)

Agree Neighborhood Is Safe Response
type: Class
type: Quality Value
type: Node shape
subclass of: Agree
subclass of: Neighborhood Is Safe Response
comment: This class denotes Agree Neighborhood Is Safe Response
notation: 472

Quality Variable
type: Class
subclass of: Thing
comment: This class denotes Quality Variable

School Lunch
type: Class
type: Node shape
subclass of: Lunch
subclass of: Restriction
  some values from: school
  on property: SIO_000061
comment: Lunch meal prepared by, and served at school.

NFGS Blinded Population Group
type: Class
type: Quality Variable
type: Node shape
subclass of: Population Group
comment: A class detailing the NICHD Fetal Growth Study blinded population groups; the class contains exactly nine subclasses, one for each of blinded sites at which subjects were onboarded to the study.

Fatty Acid
type: Class
type: Facet
subclass of: Targeted Analyte
notation: PFACID
definition: Any aliphatic monocarboxylic acid derived from or contained in esterified form in an animal or vegetable fat, oil or wax.

on property: minValue
has value: 2084

unit of measurement
type: Class
subclass of: Thing
comment: This class denotes unit of measurement

type 1 diabetes mellitus
type: Class
type: Quality Value
subclass of: diabetes mellitus
comment: This class denotes type 1 diabetes mellitus
notation: 180

Very Poorly Controlled Asthma
type: Class
type: Quality Value
subclass of: HHEAR_00549
subclass of: DOID 2841
subclass of: very poor quality
comment: This class denotes Very Poorly Controlled Asthma
notation: 295

Number of Days With Cough Not From a Cold
type: Class
type: Quantity Variable
type: Node shape
subclass of: Physical And Mental Assessment
subclass of: SIO_000794
comment: The total number of days (in some time period) when a subject experienced coughing that was not due to a cold

Family history
type: Class
type: Quality Variable
subclass of: Medical History
comment: This class denotes Family history

sequence_attribute
type: Class
type: Node shape
subclass of: SIO_000030
comment: This class denotes sequence_attribute

Bhutan
type: geographic region
comment: The country of Bhutan
SIO_000313: Outside United States

Cuban
type: Class
type: Quality Value
type: Node shape
subclass of: NCIT C17459
comment: A person of Cuban culture or origin, regardless of race. (Source: NCI Thesaurus)
notation: 671

tri-2-ethylhexyl trimellitate
type: Class
type: Node shape
subclass of: carboxylic ester
comment: CAS: 3319-31-1
notation: TOTM

Preschool-age Children's Physical Activity Questionnaire Response
type: Class
type: Node shape
subclass of: Questionnaire Response
subclass of: built environment
comment: A response to a questionnaire on perceptions of neighborhood safety for child outdoor activity

Menarche
type: Class
type: Node shape
subclass of: time interval
subclass of: biological_process
comment: Onset of menses. (Source: NCI Thesaurus)

Perfluoroheptanoic acid
type: Class
type: Facet Value
subclass of: Perfluoroakyl and Polyfluoroalkyl Substance
comment: This class denotes Perfluoroheptanoic acid
notation: PFHPA

Exposed to Second Hand Smoke at Outdoor Public Place and Other Place
type: Class
type: Quality Value
type: Node shape
subclass of: HHEAR_01131
subclass of: Exposed to Second Hand Smoke in Other Area
comment: This class denotes Exposed to Second Hand Smoke at Outdoor Public Place and Other Place
notation: 551
equivalent class: Class
  intersection of: HHEAR_01131
  intersection of: Exposed to Second Hand Smoke in Other Area
  equivalent class: Exposed to Second Hand Smoke at Outdoor Public Place and Other Place

Multiflora
type: Class
type: Node shape
subclass of: Probiotic
comment: A name brand probiotic supplement

Canned Food Product
type: Class
type: Node shape
subclass of: food product
subclass of: Restriction
  some values from: FOODON_03490151
  on property: SIO_000128
comment: This class denotes Canned Food Product
equivalent class: Class
  equivalent class: HHEAR_00905
  equivalent class: Canned Food Product

Perimenopausal
type: Class
type: Quality Value
type: Node shape
subclass of: NCIT C106541
comment: Describes the time in a woman's life as she approaches menopause. This is usually three to five years before menopause and is often marked by irregular menstrual periods and many of the symptoms of menopause, including hot flashes, mood swings, night sweats, vaginal dryness, trouble concentrating, and infertility. (Source: NCI Theasurus)
notation: 1063

Childhood Spirometry Testing
type: Class
type: Node shape
subclass of: Spirometry Testing
subclass of: Restriction
  some values from: Childhood Period
  on property: intervalDuring
comment: An occurrence of Spirometry Testing that takes place during some Childhood Period

mathematical entity
type: Class
subclass of: Thing
comment: This class denotes mathematical entity

Triferdine
type: Class
type: Node shape
subclass of: Vitamin
comment: Drug information IODINE+FOLIC+IRON (TRIFERDINE) GPO Each 1 tablet contains: -Potassium Iodine 196 mcg (Iodine 0.15 mg) -Ferrous Fumarate 185 mg (Iron 60.81 mg) -Folic Acid 0.400 mg Source: http://www.pharmbma.com/drug-list/t/669-triferdine-eng

Angola
type: geographic region
comment: The country of Angola
SIO_000313: Outside United States

Other Hispanic or Latino(a)
type: Class
type: Quality Value
type: Node shape
subclass of: NCIT C17459
comment: A person of Spanish culture or origin, but not Cuban, Mexican, Puerto Rican, South or Central American, regardless of race. (Source: NCI Thesaurus)
notation: 674

Eats School Lunch
type: Class
type: Node shape
subclass of: Eating or Drinking
subclass of: HHEAR_00053
subclass of: Restriction
  some values from: School Lunch
  on property: SIO_000230
comment: The act of eating a school prepared lunch.

Exposed to Second Hand Smoke at Other Parent's House, in Other Car, in Outdoor Public Place, at Relative's House, and in Other Area
type: Class
type: Quality Value
type: Node shape
subclass of: HHEAR_01128
subclass of: HHEAR_01130
subclass of: HHEAR_01131
subclass of: HHEAR_01132
subclass of: Exposed to Second Hand Smoke in Other Area
comment: This class denotes Exposed to Second Hand Smoke at Other Parent's House, in Other Car, in Outdoor Public Place, at Relative's House, and in Other Area
notation: 552

Neighborhood Is Safe Response
type: Class
type: Quality Variable
type: Node shape
subclass of: Preschool-age Children's Physical Activity Questionnaire Response
comment: A response to the question "Is my child's neighborhood safe?"

Barn
type: Class
type: Quality Value
type: Node shape
subclass of: Workplace
comment: An agricultural building used for crop storage or animal husbandry. (Source: Environment Ontology)
notation: 966

on property: maxValue
has value: 2500

B7 Vitamin Supplement
type: Class
type: Quality Value
subclass of: Vitamin B6 or Vitamin B7 or B Complex Vitamin Supplement
comment: This class denotes B7 Vitamin Supplement
notation: 1210

Histopathology Result
type: Class
type: Node shape
subclass of: Pathology Result
comment: A finding resulting from the examination of a tissue sample under light or electron microscopy. (Source: NCI Thesaurus)

One Year Prior to Childhood Spirometry Testing
type: Class
type: Node shape
subclass of: time interval
subclass of: Restriction
  some values from: Childhood Spirometry Testing
  on property: intervalMeets
comment: The time period that begins one year prior to a Childhood Spirometry Testing event and ends at the commencement of the testing event.

vascular malformation
type: Class
subclass of: HP_0000118
comment: This class denotes vascular malformation

Eukaryota
type: Class
type: Node shape
subclass of: organism
comment: Organism or cells with a nucleus separated from the cytoplasm by a two membrance nuclear envelope and compartmentalization of function into distinct cytoplasmic organelles. (Source: NCI Thesaurus)

Biogaia
type: Class
type: Node shape
subclass of: Probiotic
comment: A name brand probiotic supplement

BPA Free Plastic Container
type: Class
type: Node shape
subclass of: plastic container
comment: A plastic container that does not contain BPA (Bisphenol A).
equivalent class: Class
  intersection of: plastic container
  equivalent class: BPA Free Plastic Container

Colima, Mexico
type: geographic region
comment: The state, province, or territory of Colima, Mexico
SIO_000313: Q96

Visit of Sample Collection
type: Class
type: Node shape
subclass of: time interval
subclass of: Physical And Mental Assessment
comment: This attribute identifies the visit at which a bio-sample was collected from a subject.

Hemolyzed (covers all three levels), lipemic, and icteric
type: Class
subclass of: comment
comment: This class denotes Hemolyzed (covers all three levels), lipemic, and icteric

brain ischemia
type: Class
subclass of: phenotype
subclass of: Stroke, Cerebral Ischemia, or Cerebral infarction
comment: This class denotes brain ischemia

Breakfast
type: Class
type: Node shape
subclass of: Meal
comment: The first meal of the day (usually in the morning).

I Often Felt Unable To Manage Things In My Life Response
type: Class
type: Quality Value
type: Node shape
subclass of: most of the time
subclass of: HHEAR_01007
comment: This class denotes I Often Felt Unable To Manage Things In My Life Response
notation: 469

Exposed to Second Hand Smoke in Outdoor Public Place and at Friend's House
type: Class
type: Quality Value
type: Node shape
subclass of: HHEAR_01131
subclass of: HHEAR_01133
comment: This class denotes Exposed to Second Hand Smoke in Outdoor Public Place and at Friend's House
notation: 549

Biolactus
type: Class
type: Node shape
subclass of: Probiotic
comment: A name brand probiotic supplement

Exposed to Second Hand Smoke in Other Area
type: Class
type: Quality Value
type: Node shape
subclass of: Second Hand Smoke Exposure by Location
comment: This class denotes Exposed to Second Hand Smoke in Other Area
notation: 550

2, 5-Dichlorophenol
type: Class
type: Facet Value
subclass of: CHEBI_33853
notation: DCP25
definition: PHYSICAL DESCRIPTION: Prisms (from benzene, petroleum ether) or white crystals. Odor threshold 30 µg/L at 68-72°F; 33 µg/L at 86°F. Taste threshold 0.5 µg/L. (NTP, 1992)

Uses BPA Free Plastic Containers for Food Or Beverage Storage
type: Class
type: Quality Value
type: Node shape
subclass of: Uses Plastic Containers for Food Or Beverage Storage
comment: The act of using BPA free plastic containers to store food or beverages.
notation: 594

Japanese American
type: Class
type: Quality Value
type: Node shape
subclass of: Asian Non-Hispanic
comment: A person who is of Japanese American ethnicity
notation: 1204

Household Does Not Have a Video or DVD Player
type: Class
type: Quality Value
type: Node shape
subclass of: DVD Player Count
comment: Indicates that a household does not have at least one video or DVD player.
notation: 1143
disjoint with: HHEAR_02209

Hemolyzed (covers all three levels) and lipemic
type: Class
subclass of: comment
comment: This class denotes Hemolyzed (covers all three levels) and lipemic

on property: currency
has value: USD

Budesonide/formoterol (Symbicort)
type: Class
subclass of: Asthma Controller Medication
comment: This class denotes Budesonide/formoterol (Symbicort)

Meal
type: Class
type: Node shape
subclass of: Activity
comment: Any of the occasions for eating food that occur by custom or habit at more or less fixed times.

I Always Felt Unable To Manage Things In My Life Response
type: Class
type: Quality Value
type: Node shape
subclass of: always
subclass of: HHEAR_01007
comment: This class denotes I Always Felt Unable To Manage Things In My Life Response
notation: 467

Healthy
type: Class
type: Quality Value
subclass of: HHEAR_00549
comment: This class denotes Healthy
notation: 138

NIOSH
type: Class
type: Facet
subclass of: Funding Institute
comment: This class denotes NIOSH

Consumes Food Or Beverage Reheated in Plastic
type: Class
type: Quality Value
type: Node shape
subclass of: food packaging
subclass of: Restriction
  some values from: HHEAR_00909
  on property: SIO_000230
comment: The act of consuming food (or beverages) that have been reheated in a plastic container.
notation: 565

on property: minValue
has value: 75001

Asthma Therapy Assessment Questionnaire
type: Class
type: Node shape
subclass of: Questionnaire
comment: The Asthma Therapy Assessment Questionnaire (ATAQ) for children and adolescents was developed to assist clinicians and health plans to identify children at risk for adverse outcomes of asthma. ATAQ is a brief, 20-item parent-completed questionnaire that generates indicators of potential care problems in several categories, including symptom control, behavior and attitude barriers, self-efficacy barriers, and communication gaps. Source: Skinner EA, Diette GB, Algatt-Bergstrom PJ, et al. The asthma therapy assessment questionnaire (ATAQ) for children and adolescents. Disease Management. 2004; 7(4): 305-313. https://doi.org/10.1089/dis.2004.7.305

enzyme unit
type: unit of measurement
notation: enzyme unit

Exposed to Second Hand Smoke in Other Car, at Relative's House, and at Friend's House
type: Class
type: Quality Value
type: Node shape
subclass of: HHEAR_01130
subclass of: HHEAR_01132
subclass of: HHEAR_01133
comment: This class denotes Exposed to Second Hand Smoke in Other Car, at Relative's House, and at Friend's House
notation: 547
equivalent class: Class
  equivalent class: Exposed to Second Hand Smoke in Other Car, at Relative's House, and at Friend's House

Bio-flora
type: Class
type: Node shape
subclass of: Probiotic
comment: A name brand probiotic supplement

Dibenzyl phosphate
type: Class
type: Node shape
type: Facet Value
subclass of: HHEAR_01372
comment: This class denotes Dibenzyl phosphate
notation: DBZP

Perfluorobutanesulfonic acid
type: Class
type: Facet Value
subclass of: Perfluoroakyl and Polyfluoroalkyl Substance
comment: This class denotes Perfluorobutanesulfonic acid
notation: PFBS

Uses Plastic Containers for Food Or Beverage Storage
type: Class
type: Node shape
subclass of: food packaging
subclass of: Restriction
  some values from: plastic container
  on property: SIO_000230
comment: The act of using plastic containers to store food or beverages.

Papua New Guinea
type: geographic region
comment: The country of Papua New Guinea
SIO_000313: Outside United States

Children's Health Survey for Asthma
type: Class
type: Node shape
subclass of: Questionnaire
comment: To assess the functional status and well-being of children with chronic conditions. The development of a measure for children between 5 and 12 years of age with asthma serves as a template for the development of measures for other conditions and is the focus of this paper.The domains addressed in the asthma measure include physical symptoms; the child's physical activity; the child's social activity; the family's social activity; the emotional impact on the child; the emotional impact on the family; and health care utilization. Each domain is represented by a subscale in the measure. Source: Sullivan SA, Olson LM. Developing condition-specific measures of functional status and well-being for children. Clin Perform Qual Health Care. 1995 Jul-Sep;3(3):132-9. PMID: 10151163.

High Performance Liquid Chromatography
type: Class
subclass of: Chromatography
comment: This class denotes High Performance Liquid Chromatography

Intellectual disability
type: Class
type: Node shape
subclass of: Neurodevelopmental abnormality
subclass of: HHEAR_00903
comment: Subnormal intellectual functioning which originates during the developmental period. Intellectual disability, previously referred to as mental retardation, has been defined as an IQ score below 70. This term should be used for children at least five years old. For younger children, consider the term Global developmental delay (HP:0001263).

Exposed to Second Hand Smoke in Outdoor Public Place and at Relative's House
type: Class
type: Quality Value
type: Node shape
subclass of: HHEAR_01131
subclass of: HHEAR_01132
comment: This class denotes Exposed to Second Hand Smoke in Outdoor Public Place and at Relative's House
notation: 548
equivalent class: Class
  intersection of: HHEAR_01131
  intersection of: HHEAR_01132
  equivalent class: Exposed to Second Hand Smoke in Outdoor Public Place and at Relative's House

Lactil
type: Class
type: Node shape
subclass of: Probiotic
comment: A name brand probiotic supplement

I Sometimes Felt Unable To Manage Things In My Life Response
type: Class
type: Quality Value
type: Node shape
subclass of: some of the time
subclass of: HHEAR_01007
comment: This class denotes I Sometimes Felt Unable To Manage Things In My Life Response
notation: 471

Cognitive Task
type: Class
subclass of: HHEAR_00198
comment: This class denotes Cognitive Task

Cis-Chlordane
type: Class
type: Facet Value
subclass of: HHEAR_01375
comment: This class denotes Cis-Chlordane
notation: CCHL

microgram per cubic meter
type: Class
type: unit of measurement
type: Node shape
subclass of: mass density unit
comment: Microgram per cubic meter; a unit of mass density.
notation: µg/m3

corticosteroid
type: Class
subclass of: chemical entity
comment: This class denotes corticosteroid

CASI Controller Treatment Score
type: Class
type: Quantity Variable
subclass of: Asthma Severity Index Composite Score (CASI)
comment: This class denotes CASI Controller Treatment Score

diethyldithiophosphate
type: Class
type: Facet Value
subclass of: Dialkyl Phosphate Pesticide Metabolite
comment: This class denotes diethyldithiophosphate
notation: DEDP
editorial note: To Do: align with CHEBI.

on property: minValue
has value: 30001

Pregnancy Followup 2 Sample Collection
type: Class
type: Node shape
subclass of: HHEAR_00042
subclass of:
  intersection of: Restriction
    some values from: Pregnancy Followup 1 Sample Collection
    on property: intervalAfter
definition: A point in a study that occurs after followup sample collection 1 of the pregnancy at which sample 2 is taken.

adrenic acid
type: Class
type: Facet Value
subclass of: Fatty Acid
comment: This class denotes adrenic acid
notation: C224N6

Adiponectin
type: Class
type: Node shape
type: Facet Value
subclass of: HHEAR_01390
comment: This class denotes Adiponectin
notation: ADIPO

Annual Maximum Concentration
type: Class
type: Quantity Variable
subclass of: SIO_001114
subclass of: concentration
comment: This class denotes Annual Maximum Concentration

diethylphosphate
type: Class
type: Facet Value
subclass of: Dialkyl Phosphate Pesticide Metabolite
comment: This class denotes diethylphosphate
notation: DEP
editorial note: To Do: align with CHEBI.

Annual Income $5,001 to $10,000
type: Class
type: Quality Value
subclass of: HHEAR_00539
subclass of: Annual Income $10,000 or Less
subclass of:
  on property: maxValue
  has value: 10000
subclass of:
  on property: currency
  has value: USD
comment: This class denotes Annual Income $5,001 to $10,000
notation: 204

Trans-Chlordane
type: Class
type: Facet Value
subclass of: HHEAR_01375
comment: This class denotes Trans-Chlordane
notation: TCHL

California
type: Quality Value
type: NamedIndividual
type: geographic region
comment: state of the United States of America
notation: 185

Bis(2-methylphenyl) hydrogen phosphate
type: Class
type: Node shape
type: Facet Value
subclass of: HHEAR_01372
comment: This class denotes Bis(2-methylphenyl) hydrogen phosphate
notation: DOCP

all-cis-icosa-8, 11, 14-trienoic acid
type: Class
type: Facet Value
subclass of: Fatty Acid
notation: C203N6
definition: An icosatrienoic acid having three cis double bonds at positions 8, 11 and 14.

Pregnancy Followup 3 Sample Collection
type: Node shape
type: Class
subclass of: HHEAR_00042
subclass of:
  intersection of: Restriction
    some values from: Pregnancy
    on property: intervalDuring
definition: A point in a study that occurs after followup sample collection 2 of the pregnancy at which sample 3 is taken.

cohort
type: Class
subclass of: Demographic
comment: This class denotes cohort

Study Followup 2 Day 6
type: Class
type: Node shape
subclass of: Study Activity
subclass of: Restriction
  some values from: HHEAR_01629
  on property: intervalAfter
comment: The sixth day of the second study followup activity for a study

year
type: Class
subclass of: Demographic
comment: This class denotes year

urine
type: Class
type: Facet
subclass of: UBERON_0006314
definition: Excretion that is the output of a kidney [database_cross_reference: http://en.wikipedia.org/wiki/Urine][database_cross_reference: https://github.com/geneontology/go-ontology/issues/11025]

CASI Lung Function Score
type: Class
type: Quantity Variable
subclass of: Asthma Severity Index Composite Score (CASI)
comment: This class denotes CASI Lung Function Score

chemical entity
type: Class
subclass of: Thing
comment: This class denotes chemical entity

Annual Mean Concentration
type: Class
type: Quality Variable
subclass of: HHEAR_00527
comment: This class denotes Annual Mean Concentration

PCB105 + PCB127
type: Class
type: Facet Value
subclass of: Polychlorobiphenyl
comment: CAS Number: 32598-14-4_39635-33-1
notation: PCB105_PCB127

Pregnancy Baseline Sample Collection
type: Class
type: Node shape
subclass of: HHEAR_00042
comment: A time interval at which a baseline sample is collected from a study participant that occurs during pregnancy

Vaginal Birth
type: Class
type: Quality Value
subclass of: birthing
subclass of: Pregnancy Characteristic
subclass of: Route Of Delivery
notation: 24
definition: Had a birthing occur via the vagina.
editorial note: Again, can we add a delivery class

Adulthood Period
type: Class
subclass of: Adult
definition: Time period that begins after adolesence and continues until death

CASI Nighttime Asthma Symptoms Score
type: Class
type: Quantity Variable
subclass of: Asthma Severity Index Composite Score (CASI)
comment: This class denotes CASI Nighttime Asthma Symptoms Score

stroke
type: Class
subclass of: phenotype
subclass of: Stroke, Cerebral Ischemia, or Cerebral infarction
comment: This class denotes stroke

Garden
type: Class
type: Quality Value
type: Node shape
subclass of: Workplace
comment: An enclosure for displaying selected plant or animal life. (Source: Environment Ontology)
notation: 971

proton pump inhibitor agent therapy
type: Class
type: Node shape
subclass of: Pharmacotherapy
comment: This class denotes proton pump inhibitor agent therapy

(7Z, 10Z, 13Z, 16Z, 19Z)-docosapentaenoic acid
type: Class
type: Facet Value
subclass of: Fatty Acid
notation: C225N3
definition: The all-cis-isomer of a C22 polyunsaturated fatty acid having five double bonds in the 7-, 10-, 13-, 16- and 19-positions.

Pregnancy Followup 1 Sample Collection
type: Class
type: Node shape
subclass of: HHEAR_00042
subclass of:
  intersection of: Restriction
    some values from: Pregnancy Baseline Sample Collection
    on property: intervalAfter
definition: A point in a study that occurs after the initial baseline sample collection of the pregnancy at which another sample is taken.

collection of organisms
type: Class
subclass of: collection
comment: This class denotes collection of organisms

Three months
type: Class
type: Node shape
subclass of: duration
subclass of: Class
  intersection of: time interval
comment: This class denotes Three months

Local Streets Have Usable Footpaths Response
type: Class
type: Quality Variable
type: Node shape
subclass of: Preschool-age Children's Physical Activity Questionnaire Response
comment: A response to the questionnaire statement "There are useable footpaths on most of the streets in my local area."

Fluticasone/salmeterol DPI (Advair Diskus)
type: Class
subclass of: Asthma Controller Medication
comment: This class denotes Fluticasone/salmeterol DPI (Advair Diskus)

tissue
type: Class
subclass of: HHEAR_00177
subclass of: UBERON_0000479
comment: This class denotes tissue

Air Pollutant
type: Class
type: Quality Variable
type: Facet
subclass of: HHEAR_00062
comment: This class denotes Air Pollutant

CASI Daytime Asthma Symptoms Score
type: Class
type: Quantity Variable
subclass of: Asthma Severity Index Composite Score (CASI)
comment: This class denotes CASI Daytime Asthma Symptoms Score

Number of Days When Wheezing Prevented Speaking More Than One or Two Words Between Breaths
type: Class
type: Quantity Variable
type: Node shape
subclass of: Physical And Mental Assessment
subclass of: SIO_000794
comment: The total number of days (in some time period) when a subject could only speak one or two words at a time between breaths due to wheezing from asthma

Mali
type: geographic region
comment: The country of Mali
SIO_000313: Outside United States

CASI Exacerbation Score
type: Class
type: Quantity Variable
subclass of: Asthma Severity Index Composite Score (CASI)
comment: This class denotes CASI Exacerbation Score

organ
type: Class
subclass of: biological entity
comment: An organ is a collection of tissues joined in structural unit to serve a common function. (Source SIO Ontology)

Some College or Technical School
type: Class
type: Quality Value
subclass of: Education
comment: This class denotes Some College or Technical School
notation: 203

measurement value
type: Class
subclass of: Thing
comment: This class denotes measurement value

Number of Days of Rescue Inhaler Use
type: Class
type: Quantity Variable
type: Node shape
subclass of: Physical And Mental Assessment
subclass of: SIO_000794
comment: The total number of days (in some time period) when a subject used a rescue inhaler at least once

Arkansas, United States of America
type: geographic region
comment: The state, province, or territory of Arkansas, United States of America
SIO_000313: Southwestern United States

Laboratory Biomarker Analysis
type: Class
type: Node shape
subclass of: procedure
comment: This class denotes Laboratory Biomarker Analysis

Reheating Food or Beverage in a Plastic Container
type: Class
type: Node shape
subclass of: food reheating
subclass of: Restriction
  on property: SIO_000230
comment: Reheating food (including beverages) in a plastic container; the food may have been placed in the plastic container for the purposes of reheating, or it may have been packaged in plastic as a single product unit.

Disagree Neighborhood Is Safe Response
type: Class
type: Quality Value
type: Node shape
subclass of: Disagree
subclass of: Neighborhood Is Safe Response
comment: This class denotes Disagree Neighborhood Is Safe Response
notation: 473

organism
label: A biological organisn is a biological entity that consists of one or more cells and is capable of genomic replication (independently or not).
type: Class
subclass of: biological entity

Child behavior checklist
type: Class
subclass of: Physical And Mental Assessment
subclass of: COGPO_00049
subclass of: Questionnaire
comment: The Child Behavior Checklist (CBCL) obtains reports from parents, relatives, and-or guardians about competencies and behavioral or emotional problems relating to social relations and school performance. This metric is intended for ages 6 through 18, and measures anxiety, depression, somatic complaints, social problems, thought and attention problems, and rule-breaking and aggressive behavior.

Scaled Score
type: Class
type: Node shape
subclass of: score
comment: Conversion of a raw score on a test to a common scale that allows for a numerical comparison. (Source: NCI Thesaurus)

Mexico
type: Quality Value
type: NamedIndividual
type: geographic region
comment: country in North America
notation: 183
SIO_000313: Q2

Not Well Controlled Asthma
type: Class
type: Quality Value
subclass of: HHEAR_00549
subclass of: DOID 2841
subclass of: poor quality
comment: This class denotes Not Well Controlled Asthma
notation: 296

Number of Days With Asthma Symptoms after Running or Climbing Stairs
type: Class
type: Quantity Variable
type: Node shape
subclass of: Physical And Mental Assessment
subclass of: SIO_000794
comment: The total number of days (in some time period) when a subject experienced coughing, wheezing, or chest tightness after running or going up stairs

Pediatric Disorder
type: Class
type: Node shape
subclass of: phenotype
comment: A non-neoplastic or neoplastic disorder which occurs during infancy, childhood, or adolescence. (Source: NCI Thesaurus)

Ferrous Fumarate or Ferrous Sulfate
type: Class
type: Quality Value
type: Node shape
subclass of: Dietary Supplement
comment: This is the union of ferrous fumarate or ferrous sulfate.
notation: 1213

Eats School Breakfast
type: Class
type: Node shape
subclass of: Eating or Drinking
subclass of: HHEAR_00053
subclass of: Restriction
  some values from: School Breakfast
  on property: SIO_000230
comment: The act of eating a school prepared breakfast.

symptom days (max) - general symptoms, nocturnal symptoms, and days of slowed activity
type: Class
type: Node shape
subclass of: HHEAR_01744
comment: This class denotes symptom days (max) - general symptoms, nocturnal symptoms, and days of slowed activity

Strongly Disagree Neighborhood Is Safe Response
type: Class
type: Quality Value
type: Node shape
subclass of: Strongly Disagree
subclass of: Neighborhood Is Safe Response
comment: This class denotes Strongly Disagree Neighborhood Is Safe Response
notation: 475

Well Controlled Asthma
type: Class
type: Quality Value
subclass of: HHEAR_00549
subclass of: DOID 2841
subclass of: good quality
comment: This class denotes Well Controlled Asthma
notation: 297

Interleukin-27 subunit alpha
type: Class
type: Facet Value
subclass of: Protein
subclass of: HHEAR_01389
comment: This class denotes Interleukin-27 subunit alpha
notation: IL27

Obimin
type: Class
type: Quality Value
type: Node shape
subclass of: Dietary Supplement
comment: This nutritional supplement has vitamins and minerals to help provide adequate supply of essential nutrients during pregnancy and lactation. (Source: https://www.unilab.com.ph/products/obimin)
notation: 1214

Number of Days When Asthma Symptoms Impacted Play or Other Activities
type: Class
type: Quantity Variable
type: Node shape
subclass of: Physical And Mental Assessment
subclass of: SIO_000794
comment: The total number of days (in some time period) when a subject had to slow down or stop his/her activities while at home or playing with other children because of asthma symptoms

Sandwich ELISA
type: Class
subclass of: HHEAR_00164
definition: Sandwich ELISAs involve attachment of a capture antibody to a solid phase support. Samples containing known or unknown antigen are then added in a matrix or buffer that will minimize attachment to the solid phase. An enzyme-labeled antibody is then added for detection.

Income Assistance
type: Class
type: Node shape
subclass of: Public Assistance
comment: This class denotes Income Assistance

Malawi
type: geographic region
comment: The country of Malawi
SIO_000313: Outside United States

Eclampsia or Severe Pre-eclampsia
type: Class
type: Quality Value
type: Node shape
subclass of: pre-eclampsia
subclass of: Class
  union of: eclampsia
  union of: severe pre-eclampsia
comment: This class denotes Eclampsia or Severe Pre-eclampsia
notation: 578
equivalent class: Class
  equivalent class: Eclampsia or Severe Pre-eclampsia

watt per square meter
type: unit of measurement
notation: W/m2

Bismuth
type: Class
type: Facet Value
subclass of: Metal
subclass of: HHEAR_01387
notation: Bi
definition: BISMUTH is a metallic element that has the atomic symbol Bi, atomic number 83 and atomic weight 208.98.

milligram
type: unit of measurement
notation: mg

Utility Assistance
type: Class
type: Node shape
subclass of: Public Assistance
comment: This class denotes Utility Assistance

3, 4-Dihydroxy benzoic acid
type: Class
type: Facet Value
subclass of: CHEBI_33853
comment: This class denotes 3, 4-Dihydroxy benzoic acid
notation: DHB34

blood total cholesterol level
type: Class
subclass of: Thing
comment: Measurement of the entire amount of cholesterol, a eukaryotic sterol that in higher animals is the precursor of bile acids and steroid hormones and a key constituent of cell membranes, without taking into account any association with other molecules such as lipoproteins, in a specified volume of blood, the fluid that circulates through the heart, arteries, capillaries and veins carrying nutrients and oxygen to the body tissues and metabolites away from them. (Source: Clinical Measurements Ontology)

gram
type: unit of measurement
notation: g

Superimposed Pre-eclampsia
type: Class
type: Node shape
subclass of: pre-eclampsia
comment: Superimposed preeclampsia refers to women with chronic arterial hypertension (primary or secondary) who develop preeclampsia (PE). Source: Guedes-Martins L. Superimposed Preeclampsia. Adv Exp Med Biol. 2017;956:409-417. doi: 10.1007/5584_2016_82. PMID: 27722963.

Residence
type: Class
type: Node shape
subclass of: Housing Characteristic
comment: Any address at which a person dwells more than temporarily. (Source: NCI Theasurus)

on property: minValue
has value: 100000

Rainwater
type: Class
type: Quality Value
type: Node shape
subclass of: Surface Water
comment: surface water that fell from the sky as rain (Source: wikidata.org)
notation: 990

chemical entity
type: Class
subclass of: Entity
comment: A chemical entity is a physical entity of interest in chemistry including molecular entities, parts thereof, and chemical substances. (Source: CHEBI Ontology)

Religion
type: Class
type: Quality Variable
subclass of: Demographic
definition: Religious Belief

Ages and Stages Problem Solving Questionnaire
type: Class
type: Node shape
subclass of: Ages and Stages Questionnaire
comment: The "problem solving" section of the Ages and Stages Questionnaire

Not Woken Up By Asthma Overnight
type: Class
type: Quality Value
type: Node shape
subclass of: never
subclass of: Asthma Induced Sleeplessness Response
comment: This class denotes Not Woken Up By Asthma Overnight
notation: 758

4-(tert-Butoxycarbonyl)benzoic acid
type: Class
type: Node shape
type: Facet Value
subclass of: Phthalate
comment: This class denotes 4-(tert-Butoxycarbonyl)benzoic acid
notation: MTBTP

brominated flame retardant
type: Class
type: Node shape
type: Facet
subclass of: flame retardant
comment: Any organobromine compound that is used as a flame retardant. These chemicals are widely incorporated as additives in consumer products such as electronics, vehicles, polyurethane foams etc, to make them less flammable. (Source: CHEBI)
notation: PBFR

nanogram
type: unit of measurement
notation: ng

p-Xylene*
type: Class
type: Facet Value
subclass of: Volatile Organic Compound
notation: PXY
definition: P-xylene is a colorless watery liquid with a sweet odor. Less dense than water. Insoluble in water. Irritating vapor. Freezing point is 56°F. (USCG, 1999)

Bronchopulmonary Dysplasia
type: Class
type: Quality Value
type: Node shape
subclass of: lung disease
comment: Chronic lung disease requiring treatment with oxygen for at least 28 days and with a spectrum of severity from mild to severe, that predominantly affects premature infants. While the radiologic pattern is typical in the closer to term patient, the pattern in the small preterm infant is very non-discrete and variable. (Source: NCI Thesaurus)
notation: 1175

Route Of Delivery
type: Class
type: Quality Variable
subclass of: HHEAR_00049
comment: This class denotes Route Of Delivery

extracorporeal membrane oxygenation
type: Class
subclass of: medical procedure
subclass of: ventilator supporting therapy
comment: This class denotes extracorporeal membrane oxygenation

chlorpyrifos
type: Class
type: Node shape
subclass of: Targeted Analyte
subclass of: organic heterocyclic compound
comment: An organic thiophosphate that is O,O-diethyl hydrogen phosphorothioate in which the hydrogen of the hydroxy group has been replaced by a 3,5,6-trichloropyridin-2-yl group. (Source: ChEBI Ontology)
notation: CHLPYR

Housing Assistance
type: Class
type: Node shape
subclass of: Public Assistance
comment: This class denotes Housing Assistance

Woken Up By Asthma Once Overnight
type: Class
type: Quality Value
type: Node shape
subclass of: some of the time
subclass of: Asthma Induced Sleeplessness Response
comment: This class denotes Woken Up By Asthma Once Overnight
notation: 759

einstein per square meter per second
type: unit of measurement
notation: einstein/sm2

microgram
type: unit of measurement
notation: µg

Zambia
type: geographic region
comment: The country of Zambia
SIO_000313: Outside United States

Ages and Stages Gross Motor Questionnaire
type: Class
type: Node shape
subclass of: Ages and Stages Questionnaire
comment: The "gross motor" section of the Ages and Stages Questionnaire

Mexican
type: Class
type: Quality Value
type: Node shape
subclass of: NCIT C17459
comment: Denotes a person from or of Mexico. (Source: NCI Thesaurus)
notation: 670

Discover Questionnaire Response
type: Class
type: Node shape
subclass of: Physical And Mental Assessment
subclass of: Questionnaire Response
comment: This class denotes Discover Questionnaire Response

3-methipurc acd, 4-methipurc acd(ng/mL)
type: Class
subclass of: Volatile Organic Compound
comment: This class denotes 3-methipurc acd, 4-methipurc acd(ng/mL)
notation: VOC34M
editorial note: To Do: align with CHEBI.

Quadrapole Time-of-Flight Liquid Chromotography-Mass Spectrometry
type: Class
subclass of: Liquid Chromotography-Mass Spectrometery
comment: This class denotes Quadrapole Time-of-Flight Liquid Chromotography-Mass Spectrometry

Childhood
type: Class
type: Quality Value
type: Facet
subclass of: Demographic
subclass of: Developmental Quality
subclass of: Life Stage
notation: 11
definition: A time period that begins at the beginning of the human embryonic stage and continues until the end of adolescence.
was approved by: PER-Jeanette-Stingone

Child behavior checklist-anxiety problems
type: Class
type: Quantity Variable
subclass of: Behavioral Experimental Paradigm Condition
comment: This class denotes Child behavior checklist-anxiety problems

on property: minValue
has value: 0

femtogram
type: unit of measurement
notation: fg

Site 3
type: Class
type: Quality Value
type: Node shape
subclass of: SEARCH Population Group
comment: Jensen Blinded Population Group #3
notation: 803

vegetative amoebae
type: Class
type: Node shape
subclass of: SIO_010376
comment: This class denotes vegetative amoebae

First Year of the Common Era
type: NamedIndividual

Ages and Stages Personal Social Questionnaire
type: Class
type: Node shape
subclass of: Ages and Stages Questionnaire
comment: The "personal social" section of the Ages and Stages Questionnaire

3-phenoxybenzoic acid
type: Class
type: Facet Value
subclass of: HHEAR_01374
comment: This class denotes 3-phenoxybenzoic acid
notation: PBA
editorial note: To Do: align with CHEBI.

Puerto Rican
type: Class
type: Quality Value
type: Node shape
subclass of: NCIT C17459
comment: A person of Puerto Rican culture or origin, regardless of race. (Source: NCI Thesaurus)
notation: 672

Asthma Induced Sleeplessness Response
type: Class
type: Node shape
subclass of: Discover Questionnaire Response
comment: This class denotes Asthma Induced Sleeplessness Response

Reichert AR200 Handheld Digital Refractometer
type: Class
subclass of: Refractometer
definition: Lightweight digital refractometer designed for the food, beverage, agricultural, industrial-fluid, chemical, petrochemical, pharmaceutical, medical, and plastic industries.
was approved by: PER-Jim-McCusker

Room
type: Class
type: Quality Value
subclass of: Human Dwelling
comment: This class denotes Room
notation: 249

Child behavior checklist-affective problems
type: Class
type: Quantity Variable
subclass of: Behavioral Experimental Paradigm Condition
comment: This class denotes Child behavior checklist-affective problems

picogram
type: unit of measurement
notation: pg

watt per steradian per square meter
type: unit of measurement
notation: W/sr/m2

Theophylline
type: Class
subclass of: Asthma Controller Medication
comment: This class denotes Theophylline

Multiple Hispanic
type: Class
type: Quality Value
type: Node shape
subclass of: NCIT C17459
comment: A person living in the United States of Mexican, Puerto Rican, Cuban, Central or South American, or other Spanish culture or origin. The concept does not include Brazilian Americans or Portuguese Americans. (Source: NCI Thesaurus)
notation: 673

Ages and Stages Questionnaire
type: Class
type: Node shape
subclass of: Physical And Mental Assessment
subclass of: Questionnaire
comment: This class denotes the Ages and Stages Questionnaire. Reference: https://agesandstages.com/

Greater than 4 Foci Under 20x Magnification
type: Class
type: Quality Value
type: Node shape
subclass of: Level of Hepatic Lobular Inflammation
comment: This class denotes Greater than 4 Foci Under 20x Magnification
notation: 741

PCB138
type: Class
type: Facet Value
subclass of: Polychlorobiphenyl
comment: This class denotes PCB138
notation: PCB138

Child behavior checklist-attention deficit hyperactivity
type: Class
type: Quantity Variable
subclass of: Behavioral Experimental Paradigm Condition
comment: This class denotes Child behavior checklist-attention deficit hyperactivity

3, 5, 6-trichloro-2-pyridinol
type: Class
type: Facet Value
subclass of: HHEAR_01374
comment: This class denotes 3, 5, 6-trichloro-2-pyridinol
notation: TCP
editorial note: To Do: align with CHEBI.

Pregnancy Complication
type: Class
type: Quality Value
subclass of: Pregnancy Characteristic
comment: This class denotes Pregnancy Complication
notation: 75

microsecond
type: unit of measurement
notation: µs

Monopropyl Phthalate
type: Class
type: Node shape
type: Facet Value
subclass of: Phthalate
comment: This class denotes Monopropyl Phthalate
notation: MPRP

Atopy
type: Class
subclass of: phenotype
comment: A genetic predisposition to form IgE antibodies in response to exposure to allergens and therefore, for the development of immediate (type I) hypersensitivity and atopic conditions, such as allergic rhinitis; bronchial asthma, atopic dermatitis, and food allergy. Mutations of specific alleles on the long arm of chromosome 5 have been associated with higher levels of IL-4 and IgE and are known as IL-4 promoter polymorphisms. [Definition Source: NCI]
notation: 361

Site 1
type: Class
type: Quality Value
type: Node shape
subclass of: SEARCH Population Group
comment: Jensen Blinded Population Group #1
notation: 930

Ages and Stages Fine Motor Questionnaire
type: Class
type: Node shape
subclass of: Ages and Stages Questionnaire
comment: The "fine motor" section of the Ages and Stages Questionnaire.

No Foci Present Under 20x Magnification
type: Class
type: Quality Value
type: Node shape
subclass of: Level of Hepatic Lobular Inflammation
comment: This class denotes No Foci Present Under 20x Magnification
notation: 739

3-Methylhippuric acid + 4-Methylhippuric acid
type: Class
type: Facet Value
subclass of: Volatile Organic Compound
comment: This class denotes 3-Methylhippuric acid + 4-Methylhippuric acid
notation: MHA34
editorial note: To Do: align with CHEBI.

Preterm Birth
type: Class
type: Quality Value
subclass of: Birth Outcome By Gestational Age
notation: 88
definition: Preterm birth, also known as premature birth, is the birth of a baby at fewer than 37 weeks gestational age.
was approved by: PER-Jim-McCusker
equivalent class: Class
  equivalent class: Preterm Birth
  complement of: Term Birth
disjoint with: Term Birth

millisecond
type: unit of measurement
notation: ms

mono-pentyl phthalate
type: Class
type: Facet Value
subclass of: Phthalate
comment: This class denotes mono-pentyl phthalate
notation: mPeP

Tennessee, United States of America
type: geographic region
comment: The state, province, or territory of Tennessee, United States of America
SIO_000313: Q1139046

degree Celsius
type: unit of measurement
notation: C

zeaxanthin
type: Class
type: Node shape
type: Facet Value
subclass of: HHEAR_01390
comment: This class denotes zeaxanthin
notation: ZEA

Midway Atoll, United States of America
type: geographic region
comment: The state, province, or territory of Midway Atoll, United States of America
SIO_000313: United States of America

Site 2
type: Class
type: Quality Value
type: Node shape
subclass of: SEARCH Population Group
comment: Jensen Blinded Population Group #2
notation: 802

juvenile rheumatoid arthritis
type: Class
subclass of: Disease
comment: This class denotes juvenile rheumatoid arthritis

ethnicity
type: Class
type: Quality Variable
type: Facet
subclass of: biological quality
subclass of: Race or Ethnicity Combined
comment: This class denotes ethnicity
was approved by: PER-Jeanette-Stingone

Chest Tube Placement
type: Class
subclass of: medical procedure
comment: This class denotes Chest Tube Placement

Duration of Hospital Admission
type: Class
type: Quantity Variable
type: Node shape
subclass of: Duration of Healthcare Facility Admission
subclass of: Restriction
  some values from: Hospital Admission
  on property: SIO_000215
comment: The length of time a patient is admitted into a hospital

Morocco
type: geographic region
comment: The country of Morocco
SIO_000313: Outside United States

childhood-onset asthma
type: Class
subclass of: Thing
comment: This class denotes childhood-onset asthma

Forty Eight Hours Prior to Followup 7
type: Class
type: Node shape
subclass of: duration
comment: This class denotes Forty Eight Hours Prior to Followup 7

Tellurium
type: Class
type: Facet Value
subclass of: Metal
subclass of: HHEAR_01387
notation: Te
definition: Tellurium. An element that is a member of the chalcogen family. TELLURIUM has the atomic symbol Te, atomic number 52, and atomic weight 127.60. It has been used as a coloring agent and in the manufacture of electrical equipment. Exposure may cause nausea, vomiting, and CNS depression.

Child behavior checklist-aggressive behavior
type: Class
type: Quantity Variable
subclass of: Behavioral Experimental Paradigm Condition
comment: This class denotes Child behavior checklist-aggressive behavior

PCB52 + PCB73
type: Class
type: Facet Value
subclass of: Polychlorobiphenyl
comment: CAS Number: 35693-99-3_74338-23-1
notation: PCB52_PCB73

Maternal Prenatal Stage
type: Class
type: Node shape
subclass of: Life Stage
comment: The stage in the life of a mother during which she is pregnant. (Source: NCI Thesaurus)

rate unit
type: Class
subclass of: Thing
comment: "A unit which represents a standard measurement occurrence of a process per unit time." [UOC:GVG]

Mozambique
type: geographic region
comment: The country of Mozambique
SIO_000313: Outside United States

Residential Yard
type: Class
type: Node shape
subclass of: domestic garden
comment: A subclass of domestic garden; a residential yard is an area attached or adjacent to a single family or multi-family house where domestic leisure activities typically occur.

Non-spontaneous Term Birth
type: Class
type: Node shape
subclass of: Term Birth
subclass of: Non-spontaneous Birth
subclass of: Class
  intersection of: Term Birth
  intersection of: Non-spontaneous Birth
comment: The birth of a child that occurs at term and as the result of a medical intervention
equivalent class: Class
  intersection of: Term Birth
  equivalent class: Non-spontaneous Term Birth

Annual Income $25,000 to $29,999
type: Class
type: Quality Value
type: Node shape
subclass of: Annual Income $25,000 to $34,999
subclass of: Annual Income $20,000 to $29,999
subclass of:
  on property: currency
  has value: USD
subclass of:
  on property: SIO_000900
  has value: year
comment: This class denotes Annual Income $25,000 to $29,999
notation: 592

Dibutyl phosphate
type: Class
type: Node shape
type: Facet Value
subclass of: HHEAR_01372
comment: Dibutyl phosphate is a pale-amber odorless liquid. Mp: -13 °C, bp: 135-138 °C. Density: 1.06 g cm-3. Moderately soluble in water (18 g / L at 20 °C). (Source: Pubchem)
notation: DBUP

age
type: Class
type: Quantity Variable
type: Facet
subclass of: Demographic
subclass of: duration
comment: This class denotes Age

catheterization associated UTI
type: Class
subclass of: hospital-acquired infection
subclass of: CAUTI or CLABSI or VAP
subclass of: urinary tract infection
subclass of: Restriction
  some values from: Catheterization
  on property: SIO_001157
comment: This class denotes catheterization associated UTI

injury
type: Class
type: Quality Value
subclass of: biological quality
comment: This class denotes injury
notation: 406

persistent moderate asthma
type: Class
type: Quality Value
subclass of: Asthma Severity
comment: This class denotes persistent moderate asthma
notation: 1115

Singapore
type: geographic region
comment: The country of Singapore
SIO_000313: Outside United States

Food Assistance
type: Class
type: Node shape
subclass of: Public Assistance
comment: United States federal food stamp program, also known as SNAP. Food or financial assistance for food given to those in need. (Source: MESH Ontology)

Duration of Pediatric ICU Admission
type: Class
type: Quantity Variable
type: Node shape
subclass of: Duration of Healthcare Facility Admission
comment: The length of time a patient is admitted into a pediatric intensive care unit

fluorene
type: Class
type: Node shape
subclass of: polycyclic hydrocarbon
comment: An ortho-fused tricyclic hydrocarbon that is a major component of fossil fuels and their derivatives (Source: ChEBI Ontology)
notation: FLUORENE

Forty Eight Hours Prior to Followup 8
type: Class
type: Node shape
subclass of: duration
subclass of: Restriction
  some values from: Study Followup 8
  on property: intervalMeets
comment: This class denotes Forty Eight Hours Prior to Followup 8

PCB70 + PCB76
type: Class
type: Facet Value
subclass of: Polychlorobiphenyl
comment: CAS Number: 32598-11-1_70362-48-0
notation: PCB70_PCB76

Immunocompromised
type: Class
type: Quality Value
subclass of: immune response
comment: This class denotes Immunocompromised
notation: 374

SCD Genotype
type: Class
subclass of: genotype
comment: This class denotes SCD Genotype

Private Residential Yard
type: Class
type: Node shape
subclass of: Residential Yard
comment: A back yard for a residential house that is not shared among multiple houses

Quotient
type: Class
subclass of: mathematical entity
comment: This class denotes Quotient

fluoranthene
type: Class
type: Node shape
subclass of: polycyclic hydrocarbon
comment: An ortho- and peri-fused polycyclic arene consisting of a naphthalene and benzene unit connected by a five-membered ring. (Source: ChEBI Ontology)
notation: FLUORANTH

persistent mild asthma
type: Class
type: Quality Value
subclass of: Asthma Severity
comment: This class denotes persistent mild asthma
notation: 1114

PCB49 + PCB43
type: Class
type: Facet Value
subclass of: Polychlorobiphenyl
comment: CAS Number: 41464-40-8_70362-46-8
notation: PCB49_PCB43

Uses Antibiotics
type: Class
type: Quality Value
subclass of: Pharmacotherapy
subclass of: Restriction
  some values from: CHEBI_33281
  on property: SIO_000139
notation: 379
definition: Had a form of treatment which uses antibiotics.
disjoint with: Does Not Use Antibiotics

Pediatric ICU Admission
type: Class
type: Node shape
subclass of: ICU Admission
comment: The admission into a pediatric ICU unit.

Child behavior checklist-externalizing problems
type: Class
type: Quantity Variable
subclass of: Behavioral Experimental Paradigm Condition
comment: This class denotes Child behavior checklist-externalizing problems

count per molar second
type: unit of measurement
notation: 1/Ms

Registeries
type: Class
type: Node shape
subclass of: data collection
comment: The systems and processes involved in the establishment, support, management, and operation of registers, e.g., disease registers. (Source: Medical Subject Headings Ontology)

8-iso Prostaglandin F2 alpha
type: Class
type: Facet Value
subclass of: HHEAR_01373
comment: This class denotes 8-iso Prostaglandin F2 alpha
notation: F2A8IP

Disagree Local Parks Are Too Dangerous For My Child
type: Class
type: Quality Value
type: Node shape
subclass of: Disagree
subclass of: Local Parks Are Too Dangerous For My Child
comment: This class denotes Disagree Local Parks Are Too Dangerous For My Child
notation: 501

Non-spontaneous Birth
type: Class
type: Node shape
subclass of: HHEAR_00036
comment: The birth of a child that does not occur spontaneously; the birth may be initiated by or aided by some medical intervention.
equivalent class: Class
  equivalent class: Non-spontaneous Birth
  complement of: Spontaneous Labor and Birth

Human Dwelling
type: Class
type: Quality Variable
subclass of: Housing Characteristic
comment: A self-contained constructed feature used by one or more households as a home, such as a house, apartment, mobile home, houseboat or other 'substantial' structure. A dwelling typically includes nearby outbuildings, sheds etc. within the curtilage of the property, excluding any 'open fields beyond'. It has significance in relation to search and seizure, conveyancing of real property, burglary, trespass, and land use planning. (Source: Environment Ontology)

Duration of Healthcare Facility Admission
type: Class
type: Quantity Variable
type: Node shape
subclass of: HHEAR_00074
subclass of: duration
subclass of: measurement value
subclass of: Restriction
  some values from: Healthcare Facility Admission
  on property: SIO_000215
comment: The duration of time a patient is admitted into a healthcare facility

race
type: Class
type: Quality Variable
type: Facet
subclass of: biological quality
subclass of: Race or Ethnicity Combined
comment: This class denotes race
was approved by: PER-Jeanette-Stingone

Mauritius
type: geographic region
comment: The country of Mauritius
SIO_000313: Outside United States

ICU Admission Requiring Tracheostomy
type: Class
type: Quality Value
subclass of: ICU Admission By Tracheostomy Status
subclass of: Restriction
  some values from: tracheostomy
  on property: SIO_000250
comment: An ICU Admission of a patient that requires a tracheostomy immediately upon admission.
notation: 377

intermittent asthma
type: Class
type: Quality Value
subclass of: Asthma Severity
comment: This class denotes intermittent asthma
notation: 1113

carboxylic ester
type: Class
subclass of: Targeted Analyte
comment: This class denotes carboxylic ester

Child behavior checklist-internalizing problems
type: Class
type: Quantity Variable
subclass of: Behavioral Experimental Paradigm Condition
comment: This class denotes Child behavior checklist-internalizing problems

PCB5 + PCB8
type: Class
type: Facet Value
subclass of: Polychlorobiphenyl
comment: CAS Number: 16605-91-7_34883-43-7
notation: PCB5_PCB8

count per nanomolar second
type: unit of measurement
notation: 1/nMs

Spontaneous Term Birth
type: Class
type: Node shape
subclass of: Term Birth
subclass of: Spontaneous Labor and Birth
subclass of: Class
  intersection of: Term Birth
  intersection of: Spontaneous Labor and Birth
comment: The birth of a child that occurs at term and without medical intervention
equivalent class: Class
  equivalent class: Spontaneous Term Birth

acenaphthylene
type: Class
type: Node shape
subclass of: Targeted Analyte
subclass of: CHEBI_51958
comment: A ortho- and peri-fused tricyclic hydrocarbon that occurs in coal tar. (Source ChEBI Ontology)
notation: ACENY

Strongly Disagree Local Parks Are Too Dangerous For My Child
type: Class
type: Quality Value
type: Node shape
subclass of: Strongly Disagree
subclass of: Local Parks Are Too Dangerous For My Child
comment: This class denotes Strongly Disagree Local Parks Are Too Dangerous For My Child
notation: 503

Abnormality of the respiratory system
type: Class
type: Quality Variable
subclass of: HHEAR_00549
comment: This class denotes Abnormality of the respiratory system

kilogram per square centimeter
type: Class
type: Node shape
subclass of: area density unit
comment: This class denotes kilogram per square centimeter

St. Louis
type: Quality Value
type: NamedIndividual
type: geographic region
comment: independent city in Missouri, United States
notation: 1199
SIO_000313: Missouri, United States of America

ratio
type: Class
subclass of: dimensionless quantity
comment: A ratio is a relationship between two numbers of the same kind expressed arithmetically as a dimensionless quotient of the two which explicitly indicates how many times the first number contains the second. (Source: SIO Ontology)

Hospital Admission By Admission Source
type: Class
type: Quality Variable
type: Node shape
subclass of: Hospital Admission
comment: A subclass of Hospital Admission; this class is used to differentiate between admissions that originate from the ER department of the study hospital versus those that do not.

Tamaulipas State, Mexico
type: geographic region
comment: The state, province, or territory of Tamaulipas State, Mexico
SIO_000313: Q96

count per nanomolar
type: unit of measurement
notation: 1/nM

Strongly Agree Local Parks Are Too Dangerous For My Child
type: Class
type: Quality Value
type: Node shape
subclass of: Strongly Agree
subclass of: Local Parks Are Too Dangerous For My Child
comment: This class denotes Strongly Agree Local Parks Are Too Dangerous For My Child
notation: 502

dose
type: Class
subclass of: Thing
comment: This class denotes dose

New Onset Postpartum Hypertension
type: Class
type: Quality Value
type: Node shape
subclass of: NCIT C35802
comment: This class denotes New Onset Postpartum Hypertension
notation: 581

data item
type: Class
subclass of: SIO_000052
comment: This class denotes data item

1-hydroxynaphthalene
type: Class
type: Facet Value
subclass of: polycyclic hydrocarbon
comment: This class denotes 1-hydroxynaphthalene
notation: NAP1

Mauritania
type: geographic region
comment: The country of Mauritania
SIO_000313: Outside United States

Uses Muscle Relaxants
type: Class
type: Quality Value
subclass of: Pharmacotherapy
subclass of: Restriction
  some values from: muscle relaxant
  on property: SIO_000139
notation: 688
definition: Had a form of treatment which uses muscle relaxants.

PCB47 + PCB48 + PCB75
type: Class
type: Facet Value
subclass of: Polychlorobiphenyl
comment: This class denotes a polychlorobiphenyl compound identified by the CAS Number: 2437-79-8_70362-47-9_32598-12-2
notation: PCB47_48_75

Hospital Admission Not From Study Emergency Department
type: Class
type: Quality Value
type: Node shape
subclass of: Hospital Admission By Admission Source
comment: An admission into a hospital where a clinical study is being conducted, and the subject was not previously in the study hospital's emergency department.
notation: 436
disjoint with: Hospital Admission From Study Emergency Department

Agree Local Parks Are Too Dangerous For My Child
type: Class
type: Quality Value
type: Node shape
subclass of: Agree
subclass of: Local Parks Are Too Dangerous For My Child
comment: This class denotes Agree Local Parks Are Too Dangerous For My Child
notation: 500

nanosecond
type: unit of measurement
notation: ns

Indicated Birth
type: Class
type: Quality Value
type: Node shape
subclass of: Non-spontaneous Birth
comment: A birth in which medical intervention is necessitated by the medical condition of the mother or fetus.
notation: 586

Urine Collection
type: Class
type: Quality Value
type: Node shape
subclass of: Biospecimen Collection
subclass of: Restriction
  some values from: urine
  on property: RO_0004009
comment: An event in which urine is collected in order to be measured or analyzed
notation: 924

State-Trait Anxiety Inventory
type: Class
type: Node shape
subclass of: Questionnaire
subclass of: Research or Clinical Assessment Tool
comment: An instrument for measuring anxiety. It is designed to differentiate between temporary "state anxiety" and general, long-standing "trait anxiety". (Copyright Mind Garden, Inc.) (Source: NCI Thesaurus)

Required Home Medical Technology Prior to Hospital Admission
type: Class
type: Quality Value
type: Node shape
subclass of: Hospital Admission By Prior Home Medical Technology Use
comment: Denotes hospital admissions in which the patient required the use of home medical technology prior to admission.
notation: 433
equivalent class: Class
  intersection of: Hospital Admission
  equivalent class: Required Home Medical Technology Prior to Hospital Admission
disjoint with: Did Not Require Home Medical Technology Prior to Hospital Admission

foot candle
type: unit of measurement
notation: ft-c

picometer
type: unit of measurement
notation: pm

Superimposed, severe, or mild preeclampsia
type: Class
type: Quality Value
type: Node shape
subclass of: pre-eclampsia
subclass of: Class
  union of: Superimposed Pre-eclampsia
  union of: severe pre-eclampsia
comment: This class denotes Superimposed, severe, or mild preeclampsia
notation: 579

Carotid-Femoral Pulse Wave Velocity
type: Class
type: Node shape
subclass of: cardiovascular disease biomarker measurement
comment: This class denotes Carotid-Femoral Pulse Wave Velocity

Did Not Require Home Medical Technology Prior to Hospital Admission
type: Class
type: Quality Value
type: Node shape
subclass of: Hospital Admission By Prior Home Medical Technology Use
subclass of: Class
  complement of: Restriction
    some values from: Home Medical Technology
    on property: SIO_000249
comment: Denotes hospital admissions in which the patient did not require the use of home medical technology prior to admission.
notation: 434
equivalent class: Class
  equivalent class: Did Not Require Home Medical Technology Prior to Hospital Admission
disjoint with: Required Home Medical Technology Prior to Hospital Admission

Oxybenzone
type: Class
type: Facet Value
subclass of: CHEBI_33853
notation: OXB
definition: Oxybenzone is a benzophenone derivative used as a sunscreen agent. Oxybenzone absorbs UVB and UVA II rays, resulting in a photochemical excitation and absorption of energy. Upon return to ground state, the absorbed energy results in emission of longer wavelength radiation and decreased skin penetration of radiation which reduces the risk of DNA damage.

Research or Clinical Assessment Tool
type: Class
type: Node shape
subclass of: Physical And Mental Assessment
subclass of: Assessment
comment: Any evaluation or assessment tool used to ascertain a patient's condition or diagnosis. [Definition Source: NCI]

count per molar
type: unit of measurement
notation: 1/M

New Onset Antepartum Hypertension
type: Class
type: Quality Value
type: Node shape
subclass of: antepartum hypertension
comment: This class denotes New Onset Antepartum Hypertension
notation: 580

Local Parks Are Too Dangerous For My Child
type: Class
type: Quality Variable
type: Node shape
subclass of: Preschool-age Children's Physical Activity Questionnaire Response
comment: A response to the questionnaire statement "There are dangers (e.g., dogs or undesirable people) in the local park(s) so I avoid taking my child there."

Oxygen Treatment
type: Class
subclass of: medical intervention
subclass of: Home Medical Technology
subclass of: Restriction
  some values from: SIO_011007
  on property: SIO_000139
comment: A medical intervention in which a patient is treated with oxygen.

Human Dwelling With Scatter Rug and Tile Floor Coverings
type: Class
type: Node shape
subclass of: Human Dwelling By Floor Covering Type
comment: This class denotes Human Dwelling With Scatter Rug and Tile Floor Coverings
notation: 881
intersection of: Human Dwelling
intersection of: Restriction
  some values from: Scatter Rug
  on property: SIO_000053
intersection of: Restriction
  some values from: Tile
  on property: SIO_000053

deoxyribonucleic acid
type: Class
subclass of: Macromolecule
comment: This class denotes deoxyribonucleic acid

psychiatric disorder
type: Class
subclass of: Comorbidity Disease
comment: This class denotes psychiatric disorder

Eats Fried Fish
type: Class
type: Quality Value
subclass of: HHEAR_02335
subclass of: Restriction
  some values from: FOODON_03310717
  on property: SIO_000369
notation: 229
definition: The attribute of eating fried fish.

Zacatecas, Mexico
type: geographic region
comment: The state, province, or territory of Zacatecas, Mexico
SIO_000313: Q96

Forty Eight Hours Prior to Followup 3
type: Class
type: Node shape
subclass of: duration
subclass of: Restriction
  some values from: Study Followup 3
  on property: intervalMeets
comment: This class denotes Forty Eight Hours Prior to Followup 3

PCB44
type: Class
type: Facet Value
subclass of: Polychlorobiphenyl
comment: CAS Number: 41464-39-5
notation: PCB44

on property: maxValue
has value: 75000

Human Dwelling With Large Rug and Hardwood Floor Coverings
type: Class
type: Node shape
subclass of: Human Dwelling By Floor Covering Type
comment: This class denotes Human Dwelling With Large Rug and Hardwood Floor Coverings
notation: 882
intersection of: Human Dwelling

2-hydroxyfluorene
type: Class
type: Facet Value
subclass of: polycyclic hydrocarbon
comment: This class denotes 2-hydroxyfluorene
notation: FLUO2

allele
type: Class
subclass of: Thing
comment: This class denotes allele

Eats Shell Fish
type: Class
type: Quality Value
subclass of: HHEAR_02336
notation: 230
definition: The attribute of eating shell fish.

Forty Eight Hours Prior to Followup 4
type: Class
type: Node shape
subclass of: duration
subclass of: Restriction
  some values from: Study Followup 4
  on property: intervalMeets
comment: This class denotes Forty Eight Hours Prior to Followup 4

Steatosis
type: Class
type: Node shape
subclass of: phenotype
comment: Acumulation of adipose tissue in intracytoplasmic or extracellular spaces. (Source: NCI Thesaurus)

Fenton Weighted Z-Score
type: Class
type: Quantity Variable
subclass of: SIO_001245
subclass of: HHEAR_00036
subclass of: Birth Weight Z-Score
subclass of: Class
  intersection of: SIO_001245
  intersection of: Restriction
    some values from: HHEAR_00067
    on property: wasDerivedFrom
definition: Derived from Birth Weight, Gestational Age, and Child Sex
was approved by: PER-Jeanette-Stingone

ICU Discharge On Oxygen
type: Class
type: Quality Value
subclass of: ICU Discharge By Oxygen Use
subclass of: Restriction
  some values from: Oxygen Treatment
  on property: SIO_000250
comment: An event in which a patient is discharged from an intensive care unit and is given oxygen treatment.
notation: 372
equivalent class: Class
  equivalent class: ICU Discharge On Oxygen
disjoint with: ICU Discharge Not On Oxygen

Strongly Disagree Local Shops Are Walkable From Home
type: Class
type: Quality Value
type: Node shape
subclass of: Strongly Disagree
subclass of: Local Shops Are Walkable From Home
comment: This class denotes Strongly Disagree Local Shops Are Walkable From Home
notation: 499

Arsenocholine
type: Class
type: Facet Value
subclass of: Arsenic Species
comment: This class denotes Arsenocholine
notation: AsC

substitution
type: Class
type: Node shape
subclass of: sequence_alteration
comment: Any change in genomic DNA caused by a single event.

PCB37
type: Class
type: Facet Value
subclass of: Polychlorobiphenyl
comment: CAS Number: 38444-90-5
notation: PCB37

Eats Fresh Fish
type: Class
type: Quality Value
subclass of: HHEAR_02333
notation: 227
definition: The attribute of eating fresh fish.

Forty Eight Hours Prior to Followup
type: Class
type: Node shape
subclass of: duration
subclass of: Restriction
  some values from: HHEAR_00544
  on property: intervalMeets
comment: This class denotes Forty Eight Hours Prior to Followup

Laos
type: geographic region
comment: The country of Laos
SIO_000313: Outside United States

Hospital Discharge On Oxygen
type: Class
type: Quality Value
subclass of: Hospital Discharge By Oxygen Use
subclass of: Restriction
  some values from: Oxygen Treatment
  on property: SIO_000250
comment: An event in which a patient is discharged from a hospital and is given oxygen treatment.
notation: 370
equivalent class: Class
  intersection of: Hospital Discharge
  equivalent class: Hospital Discharge On Oxygen
disjoint with: Hospital Discharge Not On Oxygen

PCB41 + PCB64
type: Class
type: Facet Value
subclass of: Polychlorobiphenyl
comment: CAS Number: 52663-59-9_52663-58-8
notation: PCB41_PCB64

Eats Canned Fish
type: Class
type: Quality Value
subclass of: Eats Canned Food
subclass of: HHEAR_02334
subclass of: Restriction
  some values from: FOODON_03302764
  on property: SIO_000369
notation: 228
definition: The attribute of eating canned fish.

dinotefuran
type: Class
type: Node shape
type: Facet Value
subclass of: HHEAR_01374
comment: This class denotes dinotefuran
notation: DINF

Forty Eight Hours Prior to Followup 2
type: Class
type: Node shape
subclass of: duration
subclass of: Restriction
  some values from: Study Followup 2
  on property: intervalMeets
comment: This class denotes Forty Eight Hours Prior to Followup 2

record
type: Class
subclass of: Thing
comment: This class denotes record

ICU Admission Not Requiring Mechanical Ventilation
type: Class
type: Quality Value
type: Node shape
subclass of: ICU Admission By Mechanical Ventilation Status
subclass of: Class
  complement of: Restriction
    some values from: invasive mechanical ventilation
    on property: SIO_000250
comment: This class denotes ICU Admission Not Requiring Mechanical Ventilation
notation: 438
disjoint with: ICU Admission Requiring Mechanical Ventilation

diagnostic test
type: Class
subclass of: Thing
comment: This class denotes diagnostic test
equivalent class: NCIT C18020

temporal qualifier
type: Class
subclass of: Thing
comment: This class denotes temporal qualifier

Hospital Discharge
type: Class
type: Quality Variable
subclass of: HHEAR_00074
subclass of: Medical History
subclass of: Medical Discharge
subclass of: Restriction
  some values from: Hospital Admission
  on property: SIO_000249
comment: An event in which a person is discharged from a hospital.

CD4-positive, alpha-beta T cell activation
type: Class
subclass of: HHEAR_00034
subclass of: alpha-beta T cell activation
comment: This class denotes CD4-positive, alpha-beta T cell activation

Below Median Number of Th1 Activation Biomarkers Present
type: Class
type: Quality Value
type: Node shape
subclass of: Number of Th1 Activation Biomarkers
comment: This class denotes Below Median Number of Th1 Activation Biomarkers Present
notation: 1097
disjoint with: Above Median Number of Th1 Activation Biomarkers Present

pre-eclampsia
type: Class
type: Quality Value
subclass of: DOID_0050828
comment: This class denotes pre-eclampsia
notation: 177

PCB31 + PCB28
type: Class
type: Facet Value
subclass of: Polychlorobiphenyl
comment: CAS Number: 16606-02-3_7012-37-5
notation: PCB31_PCB28

non-alcoholic fatty liver disease
type: Class
type: Quality Value
subclass of: fatty liver disease
comment: A fatty liver disease characterized by the storing of excess fat in liver cells which is not caused by heavy alcohol use.
notation: 1205

Disagree Local Shops Are Walkable From Home
type: Class
type: Quality Value
type: Node shape
subclass of: Disagree
subclass of: Local Shops Are Walkable From Home
comment: This class denotes Disagree Local Shops Are Walkable From Home
notation: 497

ICU Discharge
type: Class
type: Quality Variable
subclass of: HHEAR_00074
subclass of: Medical History
subclass of: Medical Discharge
comment: An event in which a person is discharged from an intensive care unit.

Hospital Admission By Prior Home Medical Technology Use
type: Class
type: Quality Variable
type: Node shape
subclass of: Hospital Admission
comment: A subclass of Hospital Admission; differentiates hospital admissions by whether or not the patient required home medical technology use prior to admission.

Testing
type: Class
type: Node shape
subclass of: Activity
comment: A procedure for critical evaluation.

T-helper 1 cell activation
type: Class
subclass of: CD4-positive, alpha-beta T cell activation
comment: This class denotes T-helper 1 cell activation

all-cis-docosa-4, 7, 10, 13, 16, 19-hexaenoic acid
type: Class
type: Facet Value
subclass of: Fatty Acid
notation: C226N3
definition: A docosahexaenoic acid having six cis-double bonds at positions 4, 7, 10, 13, 16 and 19.

PCB33 + PCB20
type: Class
type: Facet Value
subclass of: Polychlorobiphenyl
comment: CAS Number: 38444-86-9_38444-84-7
notation: PCB33_PCB20

Bayley Testing
type: Class
subclass of: Study Activity
subclass of: Restriction
  some values from: Childhood Period
  on property: intervalDuring
subclass of: Restriction
  some values from: Bayley Scales of Infant and Toddler Development
  on property: SIO_000668
definition: The time period when the Bayley testing is administered to a subject.

Smoking Status - Asked During Pregnancy
type: Class
type: Quality Variable
type: Node shape
subclass of: Smoking Status
comment: This class denotes Smoking Status - Asked During Pregnancy

medical procedure
type: Class
type: Quality Variable
subclass of: Medical History
comment: This class denotes medical procedure

Healthcare Facility Admission
type: Class
subclass of: HHEAR_00074
subclass of: Activity
subclass of: Restriction
  some values from: NCIT C21541
  on property: SIO_000061
comment: An event in which a patient is admitted into a healthcare facility.

ICU Admission By Mechanical Ventilation Status
type: Class
type: Quality Variable
type: Node shape
subclass of: Medical History
subclass of: ICU Admission
comment: A subclass of ICU Admission; it is used to differentiate between when patients require a invasive mechanical ventilation (dialysis, nitric oxide ventilation, or ECMO) during their ICU admission versus when they do not.

T-helper 2 cell activation
type: Class
subclass of: CD4-positive, alpha-beta T cell activation
comment: This class denotes T-helper 2 cell activation

Number of Th1 Activation Biomarkers
type: Class
type: Node shape
subclass of: Number of Biomarkers
comment: This class denotes Number of Th1 Activation Biomarkers

linoleic acid
type: Class
type: Facet Value
subclass of: Fatty Acid
notation: C182N6
definition: An octadecadienoic acid in which the two double bonds are at positions 9 and 12 and have Z (cis) stereochemistry.

Pulsatility Index
type: Class
type: Node shape
subclass of: CMO_0000700
comment: A diagnostic indicator of vascular resistance that is calculated by dividing the difference between the peak systolic and minimum diastolic blood velocities by the mean velocity.

PCB209
type: Class
type: Facet Value
subclass of: Polychlorobiphenyl
comment: CAS Number: 2051-24-3
notation: PCB209

on property: maxValue
has value: 19999

2-(6-Hydroxy-2-propylheptoxy)carbonylbenzoic acid
type: Class
type: Node shape
type: Facet Value
subclass of: Phthalate
comment: This class denotes 2-(6-Hydroxy-2-propylheptoxy)carbonylbenzoic acid
notation: MPHHP

plasma direct bilirubin level
type: Class
subclass of: Clinical Measurement
comment: This class denotes plasma direct bilirubin level

Strongly Agree Local Shops Are Walkable From Home
type: Class
type: Quality Value
type: Node shape
subclass of: Strongly Agree
subclass of: Local Shops Are Walkable From Home
comment: This class denotes Strongly Agree Local Shops Are Walkable From Home
notation: 498

Agree Local Shops Are Walkable From Home
type: Class
type: Quality Value
type: Node shape
subclass of: Agree
subclass of: Local Shops Are Walkable From Home
comment: This class denotes Agree Local Shops Are Walkable From Home
notation: 496

never
type: Class
subclass of: Thing
comment: This class denotes never

Smoking Status - Asked After Pregnancy
type: Class
type: Quality Variable
type: Node shape
subclass of: Smoking Status
comment: This class denotes Smoking Status - Asked After Pregnancy

Medical Discharge
type: Class
subclass of: Activity
comment: An event in which a person is discharged from a medical facility.

ICU Admission Requiring Mechanical Ventilation
type: Class
type: Quality Value
type: Node shape
subclass of: ICU Admission By Mechanical Ventilation Status
subclass of: Restriction
  some values from: invasive mechanical ventilation
  on property: SIO_000250
comment: This class denotes ICU Admission Requiring Mechanical Ventilation
notation: 437
disjoint with: ICU Admission Not Requiring Mechanical Ventilation

Above Median Number of Th1 Activation Biomarkers Present
type: Class
type: Quality Value
type: Node shape
subclass of: Number of Th1 Activation Biomarkers
comment: This class denotes Above Median Number of Th1 Activation Biomarkers Present
notation: 1096
disjoint with: Below Median Number of Th1 Activation Biomarkers Present

PCB22
type: Class
type: Facet Value
subclass of: Polychlorobiphenyl
comment: CAS Number: 38444-85-8
notation: PCB22

Less than 2 Foci Under 20x Magnification
type: Class
type: Quality Value
type: Node shape
subclass of: Level of Hepatic Lobular Inflammation
comment: This class denotes Less than 2 Foci Under 20x Magnification
notation: 740

Togo
type: geographic region
comment: The country of Togo
SIO_000313: Outside United States

Florida, United States of America
type: geographic region
comment: The state, province, or territory of Florida, United States of America
SIO_000313: Q1139046

max exclusive: 25.0

Mercapturic acid of benzene
type: Class
type: Facet Value
subclass of: Volatile Organic Compound
comment: This class denotes Mercapturic acid of benzene
notation: SPMA

Perfume Use
type: Class
type: Quality Value
subclass of: Personal Product Use
comment: This class denotes Perfume Use
notation: 74
was approved by: PER-Jeanette-Stingone

tetradecanoic acid
type: Class
type: Facet Value
subclass of: Fatty Acid
notation: C140
definition: A straight-chain, fourteen-carbon, long-chain saturated fatty acid mostly found in milk fat.

angstrom
type: unit of measurement
notation: Ang

isoprostane
type: Class
subclass of: chemical entity
comment: Any icosanoid with a prostaglandin-like structure formed in vivo by non-enzymatic free radical-catalysed reactions involving peroxidation of essential fatty acids (mainly arachidonic acid but also other fatty acids with 3 or more double bonds). Isoprostanes are abundant in tissues and fluids and have immunomodulating activity. Their concentration is dependent on the amount of oxidative stress and may be upregulated in certain diseases such as cancer, cardiovascular and neurological disorders. (Source: CHEBI Ontology)

4, 4'-(1, 4-Phenylenediisopropylidene)bisphenol
type: Class
type: Facet Value
subclass of: HHEAR_01385
comment: This class denotes 4, 4'-(1, 4-Phenylenediisopropylidene)bisphenol
notation: BPP

Room with some house dust
type: Class
type: Quality Value
type: Node shape
subclass of: Human Dwelling - Room By Dust Level
subclass of: Restriction
  some values from: Room Dust
  on property: SIO_001304
comment: This class denotes Room with some house dust
notation: 887

Some College Bachelors Degree and more
type: Class
type: Quality Value
type: Node shape
subclass of: Demographic
subclass of: Socioeconomic Status
subclass of: Some College
comment: This class denotes Some College Bachelors Degree and more
notation: 801

tri-n-butyl phosphate/tri-iso-butyl phosphate
type: Class
type: Node shape
subclass of: HHEAR_01372
subclass of: Class
comment: This class denotes tri-n-butyl phosphate/tri-iso-butyl phosphate
equivalent class: Class
  intersection of: Restriction
    some values from: tributyl phosphate
    on property: SIO_000028
  equivalent class: tri-n-butyl phosphate/tri-iso-butyl phosphate

Between 2 and 4 Foci Under 20x Magnification
type: Class
type: Quality Value
type: Node shape
subclass of: Level of Hepatic Lobular Inflammation
comment: This class denotes Between 2 and 4 Foci Under 20x Magnification
notation: 742

on property: minValue
has value: 200000

Nicaragua
type: geographic region
comment: The country of Nicaragua
SIO_000313: Outside United States

Mercapturic acids of acrolein and crotonaldehyde
type: Class
subclass of: polycyclic hydrocarbon
comment: This class denotes Mercapturic acids of acrolein and crotonaldehyde
notation: AMA

2-thoxothazlidne-4-carbxylic acid(ng/mL)
type: Class
subclass of: Volatile Organic Compound
comment: This class denotes 2-thoxothazlidne-4-carbxylic acid(ng/mL)
notation: VOCTTC
editorial note: To Do: align with CHEBI.

Polymerase Chain Reaction
type: Class
subclass of: assay
comment: This class denotes Polymerase Chain Reaction

nanometer
type: unit of measurement
notation: nm

Room with a lot of dust
type: Class
type: Quality Value
type: Node shape
subclass of: Human Dwelling - Room By Dust Level
comment: This class denotes Room with a lot of dust
notation: 888

SEARCH Population Group
type: Class
type: Quality Variable
type: Node shape
subclass of: Population Group
comment: This class denotes SEARCH Population Group
note: These subsequent categories are blinded study sites that will be nested under "Population Group" Model similar to way blinded groups were done in study 2018-2537

defense response
type: Class
subclass of: Thing
comment: This class denotes defense response

Jordan
type: geographic region
comment: The country of Jordan
SIO_000313: Outside United States

Greater than 66% Hepatic Steatosis
type: Class
type: Quality Value
type: Node shape
subclass of: Grade of Steatosis in Liver
comment: This class denotes Greater than 66% Hepatic Steatosis
notation: 736

normality
type: Class
subclass of: Physical And Mental Assessment
comment: This class denotes normality

Life Stage
type: Class
type: Node shape
type: Facet Category
subclass of: time interval
subclass of: Physical And Mental Assessment
comment: A designation assigned to a particular period during a life cycle, generally defined by chronological parameters. (Source: NCI Thesaurus)

High-Performance Liquid Chromatography-Mass Spectrometry
type: Class
subclass of: High-Performance Liquid Chromatography
subclass of: Mass Spectrometer
subclass of: Liquid Chromatography–Mass Spectrometer
definition: Liquid chromatography–mass spectrometry (LC-MS) is an analytical chemistry technique that combines the physical separation capabilities of liquid chromatography (or HPLC) with the mass analysis capabilities of mass spectrometry (MS). Coupled chromatography - MS systems are popular in chemical analysis because the individual capabilities of each technique are enhanced synergistically. While liquid chromatography separates mixtures with multiple components, mass spectrometry provides structural identity of the individual components with high molecular specificity and detection sensitivity. This tandem technique can be used to analyze biochemical, organic, and inorganic compounds commonly found in complex samples of environmental and biological origin. Therefore, LC-MS may be applied in a wide range of sectors including biotechnology, environment monitoring, food processing, and pharmaceutical, agrochemical, and cosmetic industries.
was approved by: PER-Jim-McCusker

2-4 Residence Building
type: Class
type: Quality Value
subclass of: Multi Residence Building
notation: 232
definition: A residential building that contains between two and four apartments, town houses, condos, or other single family dwelling spaces.

2-Thioxothiazolidine-4-carboxylic acid
type: Class
type: Facet Value
subclass of: Volatile Organic Compound
comment: This class denotes 2-Thioxothiazolidine-4-carboxylic acid
notation: TTCA
editorial note: To Do: align with CHEBI.

Interleukin-25
type: Class
type: Facet Value
subclass of: Protein
subclass of: HHEAR_01389
comment: This class denotes Interleukin-25
notation: IL17EIL25

Oklahoma, United States of America
type: geographic region
comment: The state, province, or territory of Oklahoma, United States of America
SIO_000313: Southwestern United States

Bis(2-butoxyethyl) hydrogen phosphate
type: Class
type: Node shape
type: Facet Value
subclass of: HHEAR_01372
comment: This class denotes Bis(2-butoxyethyl) hydrogen phosphate
notation: BBOEP

Human Dwelling - Room By Dust Level
type: Class
type: Node shape
subclass of: Human Dwelling
comment: This class denotes Human Dwelling - Room By Dust Level

Some College Up To And Including Associates Degree
type: Class
type: Quality Value
type: Node shape
subclass of: Demographic
subclass of: Socioeconomic Status
subclass of: Some College
comment: This class denotes Some College Up To And Including Associates Degree
notation: 929

Lead
type: Class
type: Facet Value
subclass of: Metal
subclass of: HHEAR_01387
notation: Pb
definition: LEAD is a soft, grayish metal with poisonous salts; atomic number 82, atomic weight 207.19, symbol Pb. (Dorland, 28th)

Level of Hepatic Lobular Inflammation
type: Class
type: Quality Variable
type: Node shape
subclass of: Measurement
subclass of: Restriction
  some values from: HP_0033197
  on property: SIO_000215
comment: A measurement of the level or degree of lobular inflammation in the liver

on property: maxValue
has value: 5000

5-10 Residence Building
type: Class
type: Quality Value
subclass of: Multi Residence Building
notation: 233
definition: A residential building that contains between five and ten apartments, town houses, condos, or other single family dwelling spaces.

Ethylene thiourea
type: Class
type: Node shape
subclass of: HHEAR_01374
comment: This class denotes Ethylene thiourea
notation: ETU

2-amnothiazolne-4-carbxylic acid(ng/mL)
type: Class
subclass of: Volatile Organic Compound
comment: This class denotes 2-amnothiazolne-4-carbxylic acid(ng/mL)
notation: VOCATC
editorial note: To Do: align with CHEBI.

Liquid Chromatography - Tandem Mass Spectrometer
type: Class
subclass of: Tandem Mass Spectrometer
subclass of: Liquid Chromatography–Mass Spectrometer
definition: Liquid chromatography and tandem Mass Spectrometry. MS/MS is the combination of two mass analyzers in one mass spec instrument.
was approved by: PER-Jim-McCusker

Nucleic Acid Sequencing
type: Class
subclass of: assay
comment: This class denotes Nucleic Acid Sequencing

blood C-reactive protein level
type: Class
subclass of: Thing
comment: This class denotes blood C-reactive protein level

inflammatory response
type: Class
subclass of: HHEAR_00034
subclass of: defense response
comment: This class denotes inflammatory response

Room with no house dust
type: Class
type: Quality Value
type: Node shape
subclass of: Human Dwelling - Room By Dust Level
subclass of: Restriction
  some values from: Room Dust
  on property: SIO_001303
comment: This class denotes Room with no house dust
notation: 886

Bachelors Degree
type: Class
type: Quality Value
type: Node shape
subclass of: HHEAR_00043
comment: This class denotes Bachelors Degree
notation: 800

Arterial Stiffness Measured By Pulse Wave Velocity Above 6.767
type: Class
subclass of: Carotid-Femoral Pulse Wave Velocity
subclass of: EFO_0004517
subclass of: Class
comment: This class denotes Arterial Stiffness Measured By Pulse Wave Velocity Above 6.767
notation: 799
scope note: PWV (Pulse Wave Velocity) Definition: a measure of arterial stiffness; term exists in efo ontology has a term: efo:0004724. This term is study specific. In the data dictionary, label for the variable also includes information: cutpoint based on 90th percentile of 202 controls that are age 10 or older; as well as if pwvf_e < 6.767 then art_stiff = 0; if pwvf_e ≥ 6.767 then art_stiff = 1

Gas Chromatographer-Tandem Mass Spectrometer
type: Class
subclass of: Gas Chromatographer–Mass Spectrometer
subclass of: Tandem Mass Spectrometer
definition: MS/MS is the combination of two mass analyzers in one mass spec instrument.
was approved by: PER-Jim-McCusker

times per week
type: unit of measurement
type: SIO_000794
notation: times/week

2-Methylhippuric acid
type: Class
type: Facet Value
subclass of: Volatile Organic Compound
comment: This class denotes 2-Methylhippuric acid
notation: MHA2
editorial note: To Do: align with CHEBI.

Kuwait
type: geographic region
comment: The country of Kuwait
SIO_000313: Outside United States

immune response
type: Class
type: Quality Variable
subclass of: HHEAR_00034
subclass of: biological quality
comment: This class denotes immune response

Human Dwelling With Large Rug and Concrete Floor Coverings
type: Class
type: Node shape
subclass of: Human Dwelling By Floor Covering Type
comment: This class denotes Human Dwelling With Large Rug and Concrete Floor Coverings
notation: 885
intersection of: Human Dwelling
intersection of: Restriction
  some values from: Cement Floor
  on property: SIO_000053

Clinical Observations Severity
type: Class
subclass of: Thing
comment: The degree of something undesirable as determined by clinical observations. (Source: NCI Thesaurus)

Multi Residence Building
type: Class
type: Quality Value
subclass of: Residential Building
subclass of: Living Quarters
notation: 231
definition: A residential building that contains more than one apartment, town house, condo, or other single family dwelling space.

Graduated From High School
type: Class
type: Quality Value
subclass of: High School or Some College
notation: 32
definition: The quality of having graduated from High School
was approved by: PER-Jeanette-Stingone

2-Methylhippuric acid (ng/mL)
type: Class
subclass of: Volatile Organic Compound
comment: This class denotes 2-Methylhippuric acid (ng/mL)
notation: VOC2MH
editorial note: To Do: align with CHEBI.

thiamethoxam
type: Class
type: Node shape
type: Facet Value
subclass of: HHEAR_01374
comment: An oxadiazane that is tetrahydro-N-nitro-4H-1,3,5-oxadiazin-4-imine bearing (2-chloro-1,3-thiazol-5-yl)methyl and methyl substituents at positions 3 and 5 respectively. Source: ChEBI
notation: THX

Arizona, United States of America
type: geographic region
comment: The state, province, or territory of Arizona, United States of America
SIO_000313: Western United States

on property: maxValue
has value: 90000

school
type: Class
type: Node shape
subclass of: Organization
comment: An educational institution.

Room Dust
type: Class
subclass of: Allergen
comment: This class denotes Room Dust

Multiracial
type: Class
type: Quality Value
subclass of: race
subclass of: HHEAR_00522
notation: 54
definition: Having ancestors of several or various races.
was approved by: PER-Jeanette-Stingone
editorial note: Not part of current prov for Race. Should we remove this concept?

Arterial Stiffness Measured By Pulse Wave Velocity Below 6.767
type: Class
subclass of: Carotid-Femoral Pulse Wave Velocity
subclass of: EFO_0004517
comment: This class denotes Arterial Stiffness Measured By Pulse Wave Velocity Below 6.767
notation: 798
editorial note: change the label to be more informative of the intention
scope note: PWV (Pulse Wave Velocity) Definition: a measure of arterial stiffness; term exists in efo ontology has a term: efo:0004724. This term is study specific. In the data dictionary, label for the variable also includes information: cutpoint based on 90th percentile of 202 controls that are age 10 or older; as well as if pwvf_e < 6.767 then art_stiff = 0; if pwvf_e ≥ 6.767 then art_stiff = 1

Human Dwelling With Wall to Wall Carpet and Scatter Rug Floor Coverings
type: Class
type: Quality Value
type: Node shape
subclass of: Human Dwelling By Floor Covering Type
comment: This class denotes a Human Dwelling With Wall to Wall Carpet and Scatter Rug Floor Coverings
notation: 883
intersection of: Human Dwelling
intersection of: Restriction
  some values from: Human Dwelling With Wall to Wall Carpet
  on property: SIO_000053

Parity
type: Class
type: Quantity Variable
subclass of: SIO_000794
subclass of: Pregnancy Characteristic
definition: The number of time that a viviparous organism has given birth
was approved by: PER-Jeanette-Stingone

Forceps-Assisted Birth
type: Class
type: Quality Value
subclass of: Vaginal Birth
notation: 25
definition: A vaginal birth with the assistance of forceps to extract the baby.

Oily Fish
type: Class
subclass of: FOODON_03411222
definition: Oily fish are fish that contain at least 2% fat by weight. (Oily Fish. (n.d.) Segen's Medical Dictionary. (2011))

Forty Eight Hours Prior to Followup 5
type: Class
type: Node shape
subclass of: duration
subclass of: Restriction
  some values from: Study Followup 5
  on property: intervalMeets
comment: This class denotes Forty Eight Hours Prior to Followup 5

Tunisia
type: geographic region
comment: The country of Tunisia
SIO_000313: Outside United States

Human Dwelling With Large Rug and Tile Floor Coverings
type: Class
type: Node shape
subclass of: Human Dwelling By Floor Covering Type
comment: This class denotes Human Dwelling With Large Rug and Tile Floor Coverings
notation: 884
intersection of: Human Dwelling
intersection of: Restriction
  some values from: Large Rug
  on property: SIO_000053

Average Daily Total Saturated Fatty Acid Intake
type: Class
type: Quantity Variable
subclass of: SIO_001109
subclass of: HHEAR_00053
subclass of: UO_0000003
subclass of: ONS_0000026
comment: This class denotes Average Daily Total Saturated Fatty Acid Intake

Kyrgyzstan
type: geographic region
comment: The country of Kyrgyzstan
SIO_000313: Outside United States

Sustained Physical Activity
type: Class
type: Quality Variable
subclass of: Physical Activity
definition: Physical activity that is at least 30 minutes in duration.

Foster
type: Class
subclass of: Non-Biological Relative
definition: Fosterage, the practice of a family bringing up a child not their own, differs from adoption in that the child's parents, not the foster-parents, remain the acknowledged parents. In many modern western societies foster care can be organized by the state to care for children with troubled family backgrounds, usually on a temporary basis. In many pre-modern societies fosterage was a form of patronage, whereby influential families cemented political relationships by bringing up each other's children, similar to arranged marriages, also based on dynastic or alliance calculations.

on property: maxValue
has value: 1000

Forty Eight Hours Prior to Followup 6
type: Class
type: Node shape
subclass of: duration
comment: This class denotes Forty Eight Hours Prior to Followup 6

Questionnaire Administration
type: Class
type: Node shape
subclass of: data collection
comment: This class denotes Questionnaire Administration

Child behavior checklist-somatic complaints
type: Class
type: Quantity Variable
subclass of: Behavioral Experimental Paradigm Condition
comment: This class denotes Child behavior checklist-somatic complaints

Between 5% and 33% Hepatic Steatosis
type: Class
type: Quality Value
type: Node shape
subclass of: Grade of Steatosis in Liver
comment: This class denotes Between 5% and 33% Hepatic Steatosis
notation: 737

parts per hundred
type: unit of measurement
notation: pph

Child behavior checklist-withdrawn
type: Class
type: Quantity Variable
subclass of: Behavioral Experimental Paradigm Condition
comment: This class denotes Child behavior checklist-withdrawn

Child behavior checklist-anxious depressed
type: Class
type: Quantity Variable
subclass of: Behavioral Experimental Paradigm Condition
comment: This class denotes Child behavior checklist-anxious depressed

Between 34% and 66% Hepatic Steatosis
type: Class
type: Quality Value
type: Node shape
subclass of: Grade of Steatosis in Liver
comment: This class denotes Between 34% and 66% Hepatic Steatosis
notation: 738

hematologic disease
type: Class
type: Quality Value
subclass of: Disease
comment: This class denotes hematologic disease
notation: 404

antepartum hypertension
type: Class
type: Quality Value
type: Node shape
subclass of: hypertension
comment: This class denotes antepartum hypertension
notation: 691

Peabody picture vocabulary test-total score
type: Class
subclass of: Physical And Mental Assessment
subclass of: Restriction
  some values from: Peabody picture vocabulary test
  on property: SIO_000215
comment: This class denotes Peabody picture vocabulary test-total score

line graph
type: Class
subclass of: Thing
comment: This class denotes line graph

pyrimethanil
type: Class
type: Node shape
type: Facet Value
subclass of: HHEAR_01374
comment: A member of the class of aminopyrimidines that is N-phenylpyrimidin-2-amine carrying two additional methyl substituents at positions 4 and 6. A fungicide used to control grey mould on fruit, vegetables and ornamentals as well as leaf scab on pome fruit. Also commonly employed to control Botrytis cinerea throughout the winemaking process in grapes, must, fermenting must and wine. Source: ChEBI
notation: PYRM

2, 4, 5, 6-Tetrachlorophenol
type: Class
type: Facet Value
subclass of: CHEBI_33853
notation: TeCP2456
definition: PHYSICAL DESCRIPTION: Brown flakes or beige solid. Strong odor. (NTP, 1992)

Annual Income $25,000 to $50,000
type: Class
type: Quality Value
type: Node shape
subclass of: Annual Income $20,000 to $50,000
subclass of:
  on property: minValue
  has value: 25000
subclass of:
  on property: currency
  has value: USD
subclass of:
  on property: maxValue
  has value: 50000
comment: This class denotes Annual Income $25,000 to $50,000
notation: 939

Consumption of an Addictive Substance
type: Class
type: Node shape
subclass of: NBO_0001845
comment: Behavior related to the intake of addictive substances. (Source: Neuro Behavior Ontology)

year
type: unit of measurement
notation: y

Triclosan
type: Class
type: Facet Value
subclass of: CHEBI_33853
notation: TCS
definition: Triclosan is a diphenyl ether derivative used in cosmetics and toilet soaps as an antiseptic. It has some bacteriostatic and fungistatic action.

parts per million
type: unit of measurement
notation: ppm

Child behavior checklist-attention problems
type: Class
type: Quantity Variable
subclass of: Behavioral Experimental Paradigm Condition
comment: This class denotes Child behavior checklist-attention problems

Average daily total fat intake
type: Class
type: Quantity Variable
subclass of: SIO_001109
subclass of: HHEAR_00053
subclass of: UO_0000003
subclass of: ONS_0000025
comment: This class denotes Average daily total fat intake

beverage food product
type: Class
type: Node shape
subclass of: food product
comment: A liquid prepared for consumption, or a product that can be combined with water or milk to make one.

2-Aminothiazoline-4-carboxylic acid
type: Class
type: Facet Value
subclass of: Volatile Organic Compound
comment: This class denotes 2-Aminothiazoline-4-carboxylic acid
notation: ATCA
editorial note: To Do: align with CHEBI.

Hemoglobin Genotype SS
type: Class
type: Quality Value
subclass of: genotype
subclass of: SCD Genotype
comment: This class denotes Hemoglobin Genotype SS
notation: 346

Less than 5% Hepatic Steatosis
type: Class
type: Quality Value
type: Node shape
subclass of: Grade of Steatosis in Liver
comment: This class denotes Less than 5% Hepatic Steatosis
notation: 735

Class
intersection of: SIO_001113
intersection of: Restriction
  on property: SIO_000300
  has value: 0.0

Transfer
type: Class
type: Quality Value
subclass of: Destination
notation: 172
definition: The act of conveying or transporting from one place to another.

parts per thousand
type: unit of measurement
notation: ppth

month
type: unit of measurement
notation: m

Child behavior checklist-sleep problems
type: Class
type: Quantity Variable
subclass of: Behavioral Experimental Paradigm Condition
comment: This class denotes Child behavior checklist-sleep problems

3-(Diethylcarbamoyl)benzoic acid
type: Class
type: Node shape
type: Facet Value
subclass of: HHEAR_01374
comment: This class denotes 3-(Diethylcarbamoyl)benzoic acid
notation: DCBA

Number of Members of Household Except Subject
type: Class
type: Node shape
subclass of: Number of Members in Household
comment: The number of people residing in a household, except for the subject of the study

Descendant
type: Class
subclass of: Relative
subclass of: Restriction
  on property: SIO_000668
  all values from: Class
    intersection of: Restriction
      on property: SIO_000228
      all values from: Ancestor
    intersection of: SIO_000485
definition: The child of a human, or any grandchild, great-grandchild, and so on.
was approved by: PER-Jeanette-Stingone

2, 3', 4, 4'-Tetrabromodiphenyl ether
type: Class
type: Facet Value
subclass of: CHEBI_134094
comment: This class denotes 2, 3', 4, 4'-Tetrabromodiphenyl ether
notation: BDE66
editorial note: To Do: align with CHEBI.

immune system disease
type: Class
type: Quality Value
subclass of: Comorbidity Disease
comment: This class denotes immune system disease
notation: 405

micromole
type: unit of measurement
notation: µmol

nanograms per liter
type: unit of measurement
notation: ng/L

microampere
type: unit of measurement
notation: µA

Systolic blood pressure Z-Score
type: Class
type: Quantity Variable
subclass of: Physical And Mental Assessment
subclass of: Z-Score
subclass of: systolic blood pressure
definition: Z-Score of the systolic blood pressure.
editorial note: from 'AAP Clinical Practice Guidelines, 5th Report': as of 2017

Number of Members of Household Except Parents
type: Class
type: Node shape
subclass of: Number of Members in Household
comment: The number of people residing in a household, except for the parents of the study subject

2, 4, 4'-Tribromodiphenyl ether
type: Class
type: Facet Value
subclass of: CHEBI_134094
comment: This class denotes 2, 4, 4'-Tribromodiphenyl ether
notation: BDE28
editorial note: To Do: align with CHEBI.

Air Purifier
type: Class
type: Node shape
subclass of: device
comment: This class denotes Air Purifier

First
type: Class
subclass of: Ordinal Position
comment: Preceding all others in time or space or degree. (Source: NCI Thesaurus)

Car
type: Class
type: Quality Value
subclass of: Human Dwelling
comment: This class denotes Car
notation: 248

milliampere
type: unit of measurement
notation: mA

Diastolic blood pressure Z-Score
type: Class
type: Quantity Variable
subclass of: Physical And Mental Assessment
subclass of: Z-Score
subclass of: diastolic blood pressure
definition: Z-Score of the diastolic blood pressure.
editorial note: from 'AAP Clinical Practice Guidelines, 5th Report': as of 2017

Immature Granulocytes Measurement
type: Class
type: Node shape
subclass of: cell measurement
comment: This class denotes Immature Granulocytes Measurement

2, 2', 4, 4', 6-Pentabromodiphenyl ether
type: Class
type: Facet Value
subclass of: CHEBI_134094
comment: This class denotes 2, 2', 4, 4', 6-Pentabromodiphenyl ether
notation: BDE100
editorial note: To Do: align with CHEBI.

Benzo[a]pyrene tetraol
type: Class
type: Facet Value
subclass of: polycyclic hydrocarbon
comment: This class denotes Benzo[a]pyrene tetraol
notation: BAPT

Child behavior checklist-emotionally reactive
type: Class
type: Quantity Variable
subclass of: Behavioral Experimental Paradigm Condition
comment: This class denotes Child behavior checklist-emotionally reactive

picogram per milliliter
type: unit of measurement
notation: pg/mL

Tris(2-butoxyethyl) phosphate
type: Class
type: Node shape
type: Facet Value
subclass of: HHEAR_01372
comment: This class denotes Tris(2-butoxyethyl) phosphate
notation: TBOEP

Human Dwelling With Large Rug Floor Covering
type: Class
type: Node shape
subclass of: Human Dwelling By Floor Covering Type
comment: This class denotes Human Dwelling With Large Rug Floor Covering
notation: 879
intersection of: Human Dwelling

Outside United States
type: Node shape
type: Facet
type: geographic region
comment: This resource denotes the region outside of the United States
SIO_000313: Q2

Querétaro, Mexico
type: geographic region
comment: The state, province, or territory of Querétaro, Mexico
SIO_000313: Q96

N,N-diethyl-3-(hydroxymethyl)benzamide
type: Class
type: Node shape
type: Facet Value
subclass of: HHEAR_01374
comment: This class denotes N,N-diethyl-3-(hydroxymethyl)benzamide
notation: DHMB

Immature Granulocytes Per Unit Volume Measurement
type: Class
type: Node shape
subclass of: Immature Granulocytes Measurement
comment: The determination of the number of immature granulocytes per unit volume present in a sample.

Birth
type: Class
subclass of: time interval
subclass of: Beginning
subclass of: From Birth
definition: The ending of a pregnancy by one or more babies leaving a woman's uterus by vagina passage or c-section.
was approved by: PER-Jeanette-Stingone

2, 2', 4, 4'-Tetrabromodiphenyl ether
type: Class
type: Facet Value
subclass of: CHEBI_134094
comment: This class denotes 2, 2', 4, 4'-Tetrabromodiphenyl ether
notation: BDE47
editorial note: To Do: align with CHEBI.

Non-Neoplastic Lung Disorder
type: Class
subclass of: biological quality
comment: This class denotes Non-Neoplastic Lung Disorder

eosinophilic esophagitis
type: Class
subclass of: esophageal disease
comment: This class denotes eosinophilic esophagitis

Datatype
with restrictions:
  max inclusive: 10
on datatype: integer

on property: currency
has value: USD

Human Dwelling With Scatter Rug and Hardwood Floor Coverings
type: Class
type: Node shape
subclass of: Human Dwelling By Floor Covering Type
comment: This class denotes Human Dwelling With Scatter Rug and Hardwood Floor Coverings
notation: 880

Biomarker Validation
type: Class
type: Node shape
type: Facet
subclass of: HHEAR_00549
subclass of: NCIT C16237
subclass of: Restriction
  some values from: biomarker
  on property: SIO_000668
comment: This class denotes Biomarker Validation

Education
type: Class
type: Quality Variable
type: Facet
subclass of: Socioeconomic Status
subclass of: SIO_000026
definition: The act or process of imparting or acquiring knowledge.
was approved by: PER-Jeanette-Stingone

ICU Admission By Re-admission Status
type: Class
type: Quality Variable
type: Node shape
subclass of: ICU Admission
comment: A subclass of ICU Admission; this class is used to distinguish between admissions of patients for the first time versus when a patient is readmitted to the ICU after previously being discharged.

human cytomegalovirus infection
type: Class
type: Quality Value
subclass of: DOID 934
comment: This class denotes human cytomegalovirus infection
notation: 1103

Libya
type: geographic region
comment: The country of Libya
SIO_000313: Outside United States

Ohm
type: Class
type: Node shape
subclass of: NCIT C68787
comment: A unit of electrical resistance equal to the resistance between two points on a conductor when a potential difference of one volt between them produces a current of one ampere. Ohm is also used to measure impedance and reactance for complex resistance. A measurement in ohms is the reciprocal of a measurement in siemens. (Source: NCI Thesaurus)

ICU Admission
type: Class
subclass of: Healthcare Facility Admission
subclass of: Restriction
  some values from: Intensive Care Unit
  on property: SIO_000061
comment: The event of admitting some patient into the ICU.

Thallium
type: Class
type: Facet Value
subclass of: Metal
subclass of: HHEAR_01387
notation: Tl
definition: THALLIUM is a heavy, bluish white metal, atomic number 81, atomic weight [204.382; 204.385], symbol Tl.

PCB206
type: Class
type: Facet Value
subclass of: Polychlorobiphenyl
comment: CAS Number: 40186-72-9
notation: PCB206

Cigarettes Per Day Measurement - Asked During Pregnancy
type: Class
type: Quantity Variable
type: Node shape
subclass of: EFO_0006525
comment: This class denotes Cigarettes Per Day Measurement - Asked During Pregnancy

Strongly Disagree Crime Makes It Unsafe To Walk In Daytime
type: Class
type: Quality Value
type: Node shape
subclass of: Strongly Disagree
subclass of: Crime Makes It Unsafe To Walk In Daytime
comment: This class denotes Strongly Disagree Crime Makes It Unsafe To Walk In Daytime
notation: 495

Motor Vehicle
type: Class
type: Quality Value
type: Node shape
subclass of: Workplace
comment: A motor vehicle is a vehicle which is propelled by an engine or motor and that does not operate on rails. (Source: Environment Ontology)
notation: 978

ICU Readmission
type: Class
type: Quality Value
subclass of: ICU Admission By Re-admission Status
subclass of: Restriction
  some values from: ICU Discharge
  on property: SIO_000249
comment: The event of re-admitting some patient into an ICU after they had previously been discharged.
notation: 373
equivalent class: Class
  equivalent class: ICU Readmission
disjoint with: ICU First Admission

ICU First Admission
type: Class
type: Quality Value
type: Node shape
subclass of: ICU Admission By Re-admission Status
subclass of: Class
  complement of: Restriction
    some values from: ICU Discharge
    on property: SIO_000249
comment: This class denotes the first time a patient is admitted to an ICU.
notation: 432
equivalent class: Class
  intersection of: ICU Admission
  equivalent class: ICU First Admission
disjoint with: ICU Readmission

Hexachlorobenzene
type: Class
type: Facet Value
subclass of: HHEAR_01375
comment: This class denotes Hexachlorobenzene
notation: HCB

PCB208
type: Class
type: Facet Value
subclass of: Polychlorobiphenyl
comment: CAS Number: 52663-77-1
notation: PCB208

Departure
type: Class
type: Quality Value
subclass of: Destination
notation: 174
definition: The act of leaving a destination.

Local Shops Are Walkable From Home
type: Class
type: Quality Variable
type: Node shape
subclass of: Preschool-age Children's Physical Activity Questionnaire Response
comment: A response to the questionnaire statement "The local shop(s) are within easy walking distance of my home."

Cigarettes Per Day Measurement - Asked After Pregnancy
type: Class
type: Quantity Variable
type: Node shape
subclass of: EFO_0006525
comment: This class denotes Cigarettes Per Day Measurement - Asked After Pregnancy

Liberia
type: geographic region
comment: The country of Liberia
SIO_000313: Outside United States

ICU Admission Not Requiring Blood Transfusion
type: Class
type: Quality Value
type: Node shape
subclass of: ICU Admission By Blood Transfusion Status
comment: An ICU Admission of a patient that does not require a blood transfusion upon admission.
notation: 431
equivalent class: Class
  intersection of: ICU Admission
  equivalent class: ICU Admission Not Requiring Blood Transfusion
disjoint with: ICU Admission Requiring Blood Transfusion

organ morphological measurement
type: Class
subclass of: Thing
comment: A measurement of the physical form and structure of an organ. (Source: Clinical Measurement Ontology)

1,1-Bis(4-hydroxyphenyl)cyclohexane
type: Class
type: Facet Value
subclass of: HHEAR_01385
comment: This class denotes 1,1-Bis(4-hydroxyphenyl)cyclohexane
notation: BPZ

Agree Crime Makes It Unsafe To Walk In Daytime
type: Class
type: Quality Value
type: Node shape
subclass of: Agree
subclass of: Crime Makes It Unsafe To Walk In Daytime
comment: This class denotes Agree Crime Makes It Unsafe To Walk In Daytime
notation: 492

Live Birth
type: Class
type: Quality Value
type: Node shape
subclass of: Pregnancy Outcome By Fetal Status
comment: The complete expulsion or extraction from the mother of a fetus, irrespective of the duration of pregnancy, which, after such expulsion or extraction, breathes or shows any other evidence of life, such as beating of the heart, pulsation of the umbilical cord, or definite movement of voluntary muscles. (Source: NCI Thesaurus)
notation: 1074

Not Frequently Exposed to Second Hand Smoke
type: Class
type: Quality Value
type: Node shape
subclass of: Second Hand Smoke Exposure by Frequency
subclass of: HHEAR_01125
comment: This class denotes Not Frequently Exposed to Second Hand Smoke
notation: 569

medical health record
type: Class
subclass of: Thing
comment: This class denotes medical health record

persistent severe asthma
type: Class
type: Quality Value
subclass of: Asthma Severity
comment: This class denotes persistent severe asthma
notation: 1116

PCB202
type: Class
type: Facet Value
subclass of: Polychlorobiphenyl
comment: CAS Number: 2136-99-4
notation: PCB202

Hospital Readmission
type: Class
subclass of: Hospital Admission
subclass of: Restriction
  some values from: Hospital Discharge
  on property: SIO_000249
comment: The event of re-admitting some patient into a hospital after they had previously been discharged.

Hospital Admission By Admission Type
type: Class
type: Quality Variable
type: Node shape
subclass of: Hospital Admission
comment: A subclass of Hospital Admission; this class is used to differentiate the reasons for the hospital admission, Medical, Surgical, or Trauma.

Asthma Quality of Life Questionnaire
type: Class
type: Node shape
subclass of: Questionnaire
comment: A standardized rating scale developed by Juniper et al in 1992, which is used to measure the physical and emotional impacts on quality of life in patients with asthma. This questionnaire contains 32 items using a 7-point scale, and the items are grouped into four domains: activity limitations, symptoms, emotional function, and exposure to environmental stimuli. (Source: NCI Thesaurus)

microeinstein per square meter per second
type: unit of measurement
notation: µeinstein/sm2

Disagree Crime Makes It Unsafe To Walk In Daytime
type: Class
type: Quality Value
type: Node shape
subclass of: Disagree
subclass of: Crime Makes It Unsafe To Walk In Daytime
comment: This class denotes Disagree Crime Makes It Unsafe To Walk In Daytime
notation: 493

Second Hand Smoke Exposure by Indicator Status
type: Class
type: Quality Variable
type: Node shape
subclass of: environmental tobacco smoke exposure measurement
comment: A class to identify if a person has been exposed to second hand smoke or has not been exposed to second hand smoke during an implicit time period

bis(1-Chloropropan-2-yl) hydrogen phosphate
type: Class
type: Node shape
type: Facet Value
subclass of: HHEAR_01372
comment: This class denotes bis(1-Chloropropan-2-yl) hydrogen phosphate
notation: BCPP

ICU Admission By Blood Transfusion Status
type: Class
type: Quality Variable
type: Node shape
subclass of: ICU Admission
comment: A subclass of ICU Admission; it is used to differentiate between when patients require a blood transfusion during their ICU admission versus when they do not.

hypertonia
type: Class
type: Quality Value
type: Node shape
subclass of: phenotype
comment: A condition of increased muscle tone manifested by increased resistance of the muscle to passive stretching. (Source: NCI Thesaurus)
notation: 961

on property: maxValue
has value: 4166

mass percentage
type: unit of measurement
notation: w/w

Milk Collection
type: Class
type: Node shape
subclass of: Biospecimen Collection
comment: A time point after the birth of a child when a mother collects breast milk for analysis.

picosecond
type: unit of measurement
notation: ps

Lesotho
type: geographic region
comment: The country of Lesotho
SIO_000313: Outside United States

built environment
type: Class
type: Node shape
type: Facet
subclass of: HHEAR_00062
comment: Human-made surroundings that provide the setting for human activity, ranging in scale from personal shelter and buildings to neighborhoods and cite, and can often include their supporting infrastructure, such as water supply or energy networks. (Source: ExO Ontology)

container
type: Class
subclass of: Thing
comment: This class denotes container

Environmental Material
type: Class
subclass of: specimen
comment: This class denotes Environmental Material

ICU Admission Requiring Blood Transfusion
type: Class
type: Quality Value
type: Node shape
subclass of: ICU Admission By Blood Transfusion Status
subclass of: Restriction
  some values from: blood transfusion
  on property: SIO_000250
comment: An ICU Admission of a patient that requires a blood transfusion upon admission.
notation: 430
equivalent class: Class
  equivalent class: ICU Admission Requiring Blood Transfusion
disjoint with: ICU Admission Not Requiring Blood Transfusion

Strongly Agree Crime Makes It Unsafe To Walk In Daytime
type: Class
type: Quality Value
type: Node shape
subclass of: Strongly Agree
subclass of: Crime Makes It Unsafe To Walk In Daytime
comment: This class denotes Strongly Agree Crime Makes It Unsafe To Walk In Daytime
notation: 494

Less than 11th Grade
type: Class
type: Quality Value
type: Node shape
subclass of: High School or Less
comment: The status of completing less than the 11th grade of school
notation: 936

Tile
type: Class
type: Node shape
subclass of: Floor Covering
comment: manufactured piece of hard-wearing material (Source: Wikidata)

watt per steradian
type: unit of measurement
notation: W/sr

Bis(2-chloroethyl) phosphate
type: Class
type: Node shape
type: Facet Value
subclass of: HHEAR_01372
comment: This class denotes Bis(2-chloroethyl) phosphate
notation: BCETP

sequence_collection
type: Class
type: Node shape
subclass of: SIO_000030
comment: This class denotes sequence_collection

hour
type: unit of measurement
notation: h

volume percentage
type: unit of measurement
notation: %(v/v)

Difference of Weights
type: Class
type: Node shape
subclass of: Physical And Mental Assessment
subclass of: HHEAR_00054
subclass of: Restriction
  some values from: Class
  on property: SIO_000008
subclass of: Restriction
  on property: SIO_000008
comment: The arithmetic difference of two weights

Cape Verde
type: geographic region
comment: The country of Cape Verde
SIO_000313: Outside United States

mass volume percentage
type: unit of measurement
notation: (w/v)

minute
type: unit of measurement
notation: min

Organization
type: Class
subclass of: Thing
comment: This class denotes Organization

Behavior Assessment System for Children, Third Edition
type: Class
type: Node shape
subclass of: Research or Clinical Assessment Tool
comment: A comprehensive set of rating scales designed to facilitate the differential diagnosis and classification of a variety of emotional and behavioral disorders of children, aid in the design of treatment plans, and provide insight into an individual's thoughts and feelings. Version three incorporates additional questionnaires, scales and forms. (Source: NCI Thesaurus)

Duration of Breast Feeding
type: Class
type: Quantity Variable
type: Node shape
subclass of: HHEAR_00053
subclass of: duration
subclass of: Restriction
  some values from: Breast Feeding
  on property: SIO_000215
comment: The length of time a mother has spent breastfeeding a child

chrysene
type: Class
type: Node shape
subclass of: polycyclic hydrocarbon
comment: An ortho-fused polycyclic arene found commonly in the coal tar. (Source: ChEBI Ontology)
notation: CHRYSENE

Invalid Allergy Test
type: Class
type: Quality Value
subclass of: Invalid Test
subclass of: Allergy Test
comment: This class denotes Invalid Allergy Test
notation: 358
equivalent class: Class
  intersection of: Invalid Test
  intersection of: Allergy Test
  equivalent class: Invalid Allergy Test

Crime Makes It Unsafe To Walk In Daytime
type: Class
type: Quality Variable
type: Node shape
subclass of: Preschool-age Children's Physical Activity Questionnaire Response
comment: A response to the questionnaire statement "The level of crime in my neighborhood makes it unsafe to go on walks with my child during the day."

PCB195
type: Class
type: Facet Value
subclass of: Polychlorobiphenyl
comment: CAS Number: 52663-78-2
notation: PCB195

Annual Income $14,999 or Less
type: Class
type: Quality Value
subclass of: Annual Income $20,000 or Less
subclass of:
  on property: minValue
  has value: 0
subclass of:
  on property: maxValue
  has value: 14999
subclass of:
  on property: currency
  has value: USD
subclass of:
  on property: SIO_000900
  has value: year
comment: This class denotes Annual Income $14,999 or Less
notation: 219

Destination
type: Class
type: Quality Variable
subclass of: HHEAR_00074
notation: Dest
definition: A place to which one is traveling or to which something is sent.

Number of B-Cell Activation Biomarkers
type: Class
type: Node shape
subclass of: Number of Biomarkers
subclass of: Restriction
  some values from: NCIT C19255
  on property: SIO_000215
comment: This class denotes Number of B-Cell Activation Biomarkers

non-steroidal anti-inflammatory drug
type: Class
type: Node shape
subclass of: anti-inflammatory drug
comment: An anti-inflammatory drug that is not a steroid. In addition to anti-inflammatory actions, non-steroidal anti-inflammatory drugs have analgesic, antipyretic, and platelet-inhibitory actions. They act by blocking the synthesis of prostaglandins by inhibiting cyclooxygenase, which converts arachidonic acid to cyclic endoperoxides, precursors of prostaglandins. (Source: ChEBI Ontology)

admission diagnosis
type: Class
subclass of: HHEAR_00549
subclass of: diagnosis
subclass of: Restriction
  some values from: NCIT C25385
  on property: SIO_000687
comment: A medical diagnosis that occurs at admission to a hospital or other medical care provider.

poor quality
type: Class
subclass of: Thing
comment: This class denotes poor quality

Annual Income $15,000 to $29,999
type: Class
type: Quality Value
subclass of: HHEAR_02319
subclass of:
  on property: SIO_000900
  has value: year
subclass of:
  on property: currency
  has value: USD
subclass of:
  on property: maxValue
  has value: 29999
comment: This class denotes Annual Income $15,000 to $29,999
notation: 220

Above Median Number of B-Cell Activation Biomarkers Present
type: Class
type: Quality Value
type: Node shape
subclass of: Number of B-Cell Activation Biomarkers
comment: This class denotes Above Median Number of B-Cell Activation Biomarkers Present
notation: 1092
disjoint with: Below Median Number of B-Cell Activation Biomarkers Present

PCB196 + PCB203
type: Class
type: Facet Value
subclass of: Polychlorobiphenyl
comment: CAS Number: 42740-50-1_52663-76-0
notation: PCB196_PCB203

diabetes
type: Class
type: Facet
subclass of: Thing
comment: This class denotes diabetes

Hospital Admission
type: Class
subclass of: Medical History
subclass of: Hospitalization
subclass of: Healthcare Facility Admission
subclass of: Restriction
  some values from: Hospital
  on property: SIO_000061
comment: The event of admitting some patient into a hospital.

Disagree Safe To Walk With Child In Neighborhood Response
type: Class
type: Quality Value
type: Node shape
subclass of: Disagree
subclass of: Safe To Walk With Child In Neighborhood Response
comment: This class denotes Disagree Safe To Walk With Child In Neighborhood Response
notation: 489

Invalid Test
type: Class
subclass of: Test
comment: This class denotes Invalid Test
disjoint with: Valid Test

ICU Admission Not Requiring Tracheostomy
type: Class
type: Quality Value
type: Node shape
subclass of: ICU Admission By Tracheostomy Status
subclass of: Class
  complement of: Restriction
    some values from: tracheostomy
    on property: SIO_000250
comment: An ICU Admission of a patient that does not require a tracheostomy immediately upon admission.
notation: 429
equivalent class: Class
  equivalent class: ICU Admission Not Requiring Tracheostomy

Z-Score
type: Class
subclass of: Anthropometry
definition: A z-score (also known as z-value, standard score, or normal score) is a measure of the divergence of an individual experimental result from the most probable result, the mean. Z is expressed in terms of the number of standard deviations from the mean value.

PCB183
type: Class
type: Facet Value
subclass of: Polychlorobiphenyl
comment: CAS Number: 52663-69-1
notation: PCB183

Above Median Number of Inflammatory Biomarkers Present
type: Class
type: Quality Value
type: Node shape
subclass of: Number of Inflammatory Biomarkers
comment: This class denotes Above Median Number of Inflammatory Biomarkers Present
notation: 1089
disjoint with: Below Median Number of Inflammatory Biomarkers Present

good quality
type: Class
subclass of: Thing
comment: This class denotes good quality

Valid Allergy Test
type: Class
type: Quality Value
subclass of: Valid Test
subclass of: Allergy Test
comment: This class denotes Valid Allergy Test
notation: 359

Strongly Disagree Safe To Walk With Child In Neighborhood Response
type: Class
type: Quality Value
type: Node shape
subclass of: Strongly Disagree
subclass of: Safe To Walk With Child In Neighborhood Response
comment: This class denotes Strongly Disagree Safe To Walk With Child In Neighborhood Response
notation: 491

ICU Admission By Tracheostomy Status
type: Class
type: Quality Variable
type: Node shape
subclass of: Medical History
subclass of: ICU Admission
comment: A subclass of ICU Admission; it is used to differentiate between when patients require a tracheostomy upon ICU admission versus when they do not.

Drug, Food, Chemical or Biomedical Material
type: Class
type: Node shape
subclass of: Thing
comment: An organic or inorganic substance, element, isotope, food or other materials derived from microorganism, plant, or animal sources. They can be used for the prevention, diagnosis, treatment or research of disease states, for industrial purposes, or for the promotion or maintenance of organism viability or health. (Source: NCI Thesaurus)

PCB194
type: Class
type: Facet Value
subclass of: Polychlorobiphenyl
comment: CAS Number: 35694-08-7
notation: PCB194

nitenpyram
type: Class
type: Node shape
type: Facet Value
subclass of: HHEAR_01374
comment: A C-nitro compound consisting of 2-nitroethene-1,1-diamine where one of the nitrogens bears ethyl and (6-chloro-3-pyridinyl)methyl while the other nitrogen carries a methyl group. Source: ChEBI
notation: NIT

Below Median Number of Inflammatory Biomarkers Present
type: Class
type: Quality Value
type: Node shape
subclass of: Number of Inflammatory Biomarkers
comment: This class denotes Below Median Number of Inflammatory Biomarkers Present
notation: 1090
disjoint with: Above Median Number of Inflammatory Biomarkers Present

anti-inflammatory drug
type: Class
subclass of: CHEBI_23888
subclass of: anti-inflammatory agent
comment: This class denotes anti-inflammatory drug

Strongly Agree Safe To Walk With Child In Neighborhood Response
type: Class
type: Quality Value
type: Node shape
subclass of: Strongly Agree
subclass of: Safe To Walk With Child In Neighborhood Response
comment: This class denotes Strongly Agree Safe To Walk With Child In Neighborhood Response
notation: 490

comment
type: Class
subclass of: Thing
comment: This class denotes comment

School Breakfast Consumption Frequency
type: Class
type: Quantity Variable
type: Node shape
subclass of: Diet Quantity
subclass of: SIO_001367
subclass of: Restriction
  some values from: Eats School Breakfast
  on property: SIO_000215
comment: A measure of the number of times in a given time interval that a person eats breakfast provided at school

Allergy Test
type: Class
type: Quality Variable
subclass of: Physical And Mental Assessment
subclass of: Restriction
  some values from: Allergy
  on property: SIO_000563
comment: This class denotes Allergy Test

Twenty Four Hours Prior to Baseline
type: Class
subclass of: time interval
subclass of: duration
comment: This class denotes Twenty Four Hours Prior to Baseline

Sinaloa, Mexico
type: geographic region
comment: The state, province, or territory of Sinaloa, Mexico
SIO_000313: Q96

Number of Biomarkers
type: Class
type: Node shape
subclass of: SIO_000794
comment: This class denotes Number of Biomarkers

PCB18 + PCB17
type: Class
type: Facet Value
subclass of: Polychlorobiphenyl
comment: CAS Number: 37680-65-2_37680-66-3
notation: PCB18_PCB17

autoimmune disease of endocrine system
type: Class
subclass of: Thing
comment: This class denotes autoimmune disease of endocrine system

Invasive Mechanical Ventilator Assisted Respiration
type: Class
type: Node shape
subclass of: NCIT C17091
subclass of: artificial respiration
subclass of: Restriction
  some values from: invasive mechanical ventilation
  on property: SIO_000139
comment: Respiration that requires assistance from an invasive mechanical respirator.
disjoint with: Ventilator Free Respiration

School Lunch Consumption Frequency
type: Class
type: Quantity Variable
type: Node shape
subclass of: Diet Quantity
subclass of: SIO_001367
subclass of: Restriction
  some values from: Eats School Lunch
  on property: SIO_000215
comment: A measure of the number of times in a given time interval that a person eats lunch provided at school

Agree Safe To Walk With Child In Neighborhood Response
type: Class
type: Quality Value
type: Node shape
subclass of: Agree
subclass of: Safe To Walk With Child In Neighborhood Response
comment: This class denotes Agree Safe To Walk With Child In Neighborhood Response
notation: 488

Valid Test
type: Class
subclass of: Test
comment: This class denotes Valid Test
disjoint with: Invalid Test

Number of Inflammatory Biomarkers
type: Class
type: Node shape
subclass of: Number of Biomarkers
subclass of: Restriction
  some values from: inflammatory response
  on property: SIO_000215
comment: This class denotes Number of Inflammatory Biomarkers

Ordinal Position
type: Class
subclass of: Thing
comment: This class denotes Ordinal Position

PCB182 + PCB187
type: Class
type: Facet Value
subclass of: Polychlorobiphenyl
comment: CAS Number: 60145-23-5_52663-68-0
notation: PCB182_PCB187

Control Group
type: Class
type: Quality Value
subclass of: Population Group
notation: 200
definition: A group used as a standard of comparison in a control experiment.

census
type: Class
type: Node shape
subclass of: data collection
comment: acquiring and recording information about the members of a given population (Source: Wikidata.org)

Probiotic Beverage Consumption Frequency
type: Class
type: Quality Variable
subclass of: Diet Quantity
subclass of: SIO_001367
definition: Frequency of Probiotic Beverage Consumption.

Drug Other Than Antimalarial Use
type: Class
subclass of: medical intervention
subclass of: Pharmacotherapy
subclass of: Restriction
  some values from: SIO_000393
  on property: SIO_000291
subclass of: Restriction
  some values from: HHEAR_00792
  on property: SIO_000230
comment: This class denotes Drug Other Than Antimalarial Use

Number of Members in Household
type: Class
type: Quantity Variable
type: Node shape
subclass of: Demographic
subclass of: SIO_000794
subclass of: Restriction
  some values from: Household
  on property: SIO_000215
comment: The number of people living in a household

PCB172 + PCB192
type: Class
type: Facet Value
subclass of: Polychlorobiphenyl
comment: CAS Number: 52663-74-8
notation: PCB172_PCB192

2-hydroxyphenanthrene
type: Class
type: Facet Value
subclass of: polycyclic hydrocarbon
comment: This class denotes 2-hydroxyphenanthrene
notation: PHEN2

Madagascar
type: geographic region
comment: The country of Madagascar
SIO_000313: Outside United States

Waist
type: Class
subclass of: biological entity
definition: The waist is the part of the abdomen between the rib cage and hips. On people with slim bodies, the waist is the narrowest part of the torso.

Strongly Disagree Street Traffic Makes It Dangerous To Walk Response
type: Class
type: Quality Value
type: Node shape
subclass of: Strongly Disagree
subclass of: Street Traffic Makes It Dangerous To Walk Response
comment: This class denotes Strongly Disagree Street Traffic Makes It Dangerous To Walk Response
notation: 487

Spouse or Significant Other and Adult Child Living In Household Currently Smokes
type: Class
type: Quality Value
type: Node shape
subclass of: HHEAR_01119
subclass of: HHEAR_01121
comment: This class denotes Spouse or Significant Other and Adult Child Living In Household Currently Smokes
notation: 563
equivalent class: Class
  intersection of: HHEAR_01119
  equivalent class: Spouse or Significant Other and Adult Child Living In Household Currently Smokes

Spouse or Significant Other and Adult Child and Child Under 18 and Other Adults Living In Household Currently Smokes
type: Class
type: Quality Value
type: Node shape
subclass of: HHEAR_01119
subclass of: HHEAR_01120
subclass of: HHEAR_01121
subclass of: HHEAR_01122
comment: This class denotes Spouse or Significant Other and Adult Child and Child Under 18 and Other Adults Living In Household Currently Smokes
notation: 564

Some College Up To And Including Bachelors Degree
type: Class
type: Quality Value
type: Node shape
subclass of: Some College
comment: This class denotes Some College Up To And Including Bachelors Degree
notation: 593

Total Score
type: Class
type: Node shape
subclass of: score
comment: The sum of a set of numeric values. (Source: NCI Thesaurus)

PCB177
type: Class
type: Facet Value
subclass of: Polychlorobiphenyl
comment: CAS Number: 52663-70-4
notation: PCB177

Safe To Walk With Child In Neighborhood Response
type: Class
type: Quality Variable
type: Node shape
subclass of: Preschool-age Children's Physical Activity Questionnaire Response
comment: A response to the questionnaire statement "There are sufficient traffic lights or pedestrian crossings to make it safe to walk with my child around my neighborhood."

Unit Per Cubic Millimeter
type: Class
type: Node shape
subclass of: cell concentration unit
comment: A unit of concentration typically used for expressing the count of cells appearing within a one millimeter cubed volume of plasma

Costa Rica
type: geographic region
comment: The country of Costa Rica
SIO_000313: Outside United States

Eats Fish Sticks
type: Class
type: Quality Value
subclass of: HHEAR_02331
subclass of: Restriction
  some values from: FOODON_03311701
  on property: SIO_000369
notation: 225
definition: The attribute of eating fish sticks.

Adopted
type: Class
subclass of: Non-Biological Relative
definition: Adoption is a process whereby a person assumes the parenting of another, usually a child, from that person's biological or legal parent or parents, and, in so doing, permanently transfers all rights and responsibilities, along with filiation, from the biological parent or parents.

2, 2', 4, 4', 5, 6'-Hexabromodiphenyl ether
type: Class
type: Facet Value
subclass of: CHEBI_134094
comment: This class denotes 2, 2', 4, 4', 5, 6'-Hexabromodiphenyl ether
notation: BDE154
editorial note: To Do: align with CHEBI.

trifluridine
type: Class
type: Node shape
subclass of: pharmaceutical drug
comment: Trifluridine (also called trifluorothymidine; abbreviation TFT or FTD[1]) is an anti-herpesvirus antiviral drug, used primarily as prescription eyedrops. (Source: https://en.wikipedia.org/wiki/Trifluridine)

Human Dwelling With Tile Or Linoleum Flooring
type: Class
type: Node shape
subclass of: Human Dwelling By Floor Covering Type
comment: This class denotes a human dwelling with tile or linoleum flooring
notation: 877

Funding Institute
type: Class
type: Node shape
type: Facet Category
subclass of: institute
comment: This class denotes Funding Institute

2, 4, 6-Trichlorophenol
type: Class
type: Facet Value
subclass of: CHEBI_33853
notation: TCP246
definition: 2 4 6-Trichlorophenol is a synthetic, colorless crystalline solid that is slightly soluble in water and soluble in organic solvents. It has been used primarily in pesticide formulations and as a wood preservative, although most uses have been cancelled in the US. When heated to decomposition, 2, 4, 6-trichlorophenol emits toxic and corrosive fumes of hydrochloric acid and other toxic gases. Exposure of humans to 2, 4, 6-trichrophenol via inhalation has been reported to cause respiratory effects, altered pulmonary function and pulmonary lesions. It is reasonably anticipated to be a human carcinogen. (NCI05)

mononuclear cell percentage
type: Class
type: Node shape
subclass of: CMO_0002118
subclass of: percentage
comment: This class denotes mononuclear cell percentage

Ancestor
type: Class
subclass of: Relative
subclass of: Restriction
  on property: SIO_000668
  all values from: Class
    intersection of: Restriction
      on property: SIO_000228
      all values from: Descendant
    intersection of: SIO_000485
definition: An ancestor or forebear is a parent or (recursively) the parent of an ancestor (i.e., a grandparent, great-grandparent, great-great-grandparent, and so forth). Ancestor is "any person from whom one is descended. In law the person from whom an estate has been inherited."
was approved by: PER-Jeanette-Stingone

Protein Family
type: Class
type: Node shape
subclass of: Protein
comment: Collection of proteins that are evolutionarily related. This is reflected in the structural and functional similarities as well as in the extent of sequence conservation or residue identity. (from SCOP)

Eats Oily Fish
type: Class
type: Quality Value
subclass of: HHEAR_02332
subclass of: Restriction
  some values from: Oily Fish
  on property: SIO_000369
notation: 226
definition: The attribute of eating oily fish.

clothianidin
type: Class
type: Node shape
type: Facet Value
subclass of: HHEAR_01374
comment: An N-nitro compound consisting of 2-nitroguanidine having a (2-chloro-1,3-thiazol-5-yl)methyl group at position 1 and a methyl group at position 3. Source: ChEBI
notation: CLO

2, 2', 4, 4', 5-Pentabromodiphenyl ether
type: Class
type: Facet Value
subclass of: CHEBI_134094
comment: This class denotes 2, 2', 4, 4', 5-Pentabromodiphenyl ether
notation: BDE99
editorial note: To Do: align with CHEBI.

milligram per deciliter
type: Class
type: unit of measurement
subclass of: mass density unit
equivalent class: milligram per deciliter

Do Not Resuscitate Order
type: Class
type: Quality Value
subclass of: Advance Directive
comment: This class denotes Do Not Resuscitate Order
notation: 365

Human Dwelling With Hardwood Floor
type: Class
type: Node shape
subclass of: Human Dwelling By Floor Covering Type
comment: This class denotes Human Dwelling With Hardwood Floor
notation: 878
intersection of: Human Dwelling

Other Funding Institute
type: Class
type: Node shape
type: Facet
subclass of: Funding Institute
comment: This class denotes Other Funding Institute

Spanish Language
type: Class
type: Quality Value
subclass of: Acculturation
notation: 244
definition: The Spanish Language

some of the time
type: Class
subclass of: Thing
comment: This class denotes some of the time

Eating or Drinking
type: Class
type: Quality Variable
subclass of: Diet Quantity
subclass of: nutrition intake
definition: The act of eating or drinking some food or beverage.

2, 2', 4, 4', 5, 5'-Hexabromobiphenyl
type: Class
type: Facet Value
subclass of: CHEBI_134094
comment: This class denotes 2, 2', 4, 4', 5, 5'-Hexabromobiphenyl
notation: PBB153
editorial note: To Do: align with CHEBI.

3-hydroxybenzo[c]-phenanthrene
type: Class
type: Facet Value
subclass of: polycyclic hydrocarbon
comment: This class denotes 3-hydroxybenzo[c]-phenanthrene
notation: BCP3

biological sex
type: Class
type: Quality Variable
type: Facet
subclass of: Demographic
comment: This class denotes biological sex

pneumonia
type: Class
type: Quality Value
subclass of: lung disease
comment: This class denotes pneumonia
notation: 195

Number of Emergency Room or Urgent Care Visits
type: Class
type: Node shape
subclass of: SIO_000794
subclass of: HHEAR_00074
subclass of: Restriction
  some values from: Emergency Department or Urgent Care Visit
  on property: SIO_000215
comment: This class denotes Number of Emergency Room or Urgent Care Visits

Childhood Followup 4 Day 7
type: Class
type: Node shape
subclass of: Study Followup 4 Day 7
subclass of: Restriction
  some values from: Childhood Followup 4
  on property: intervalDuring
comment: The seventh day of the fourth study followup activity for a study that occurs during a subject's childhood period

Temporal Frequency
type: Class
type: Node shape
subclass of: UO_0000105
comment: The number of occurrences of something within a given time period. (Source: NCI Thesaurus)

Early Childhood
type: Class
type: Node shape
type: Facet
subclass of: Childhood
subclass of: Life Stage
comment: A human life stage that begins at two years of age and continues until five complete years of age. [Definition Source: NCI][attribution: NICHD]

3-hydroxychrysene
type: Class
type: Facet Value
subclass of: polycyclic hydrocarbon
comment: This class denotes 3-hydroxychrysene
notation: CHRY3

Eats Rice
type: Class
type: Quality Value
subclass of: HHEAR_02330
subclass of: Restriction
  some values from: FOODON_03301641
  on property: SIO_000369
notation: 224
definition: The attribute of eating rice.

2, 2', 4, 4', 5, 5'-Hexabromodiphenyl ether
type: Class
type: Facet Value
subclass of: CHEBI_134094
comment: This class denotes 2, 2', 4, 4', 5, 5'-Hexabromodiphenyl ether
notation: BDE153
editorial note: To Do: align with CHEBI.

Behavioral rating inventory of executive function
type: Class
subclass of: Thing
definition: used for evaluating and planning treatment strategies for a wide spectrum of developmental and acquired neurological conditions, including learning disabilities, low birth weight, ADHD, Touretteand#39;s disorder, Traumatic Brain Injury, and Autism; consists of 8 non-overlapping clinical scales that form two broader indexes: Behavior Regulation (three scales) and Metacognition (five scales). A Global Executive Composite score is also produced; completed by parents and teachers, is suitable for children as young as 5 years old.
equivalent class: NCIT C121459

Middle Childhood
type: Class
type: Node shape
subclass of: Childhood
subclass of: Life Stage
comment: A human life stage that begins at six years of age and continues until eleven complete years of age. [Definition Source: NCI][attribution: NICHD]

Malaria
type: Class
type: Quality Value
subclass of: Disease
notation: 121
definition: A parasitic protozoa infectious disease characterized as a vector-borne infectious disease caused by the presence of protozoan parasites of the genus Plasmodium in the red blood cells, transmitted from an infected to an uninfected individual by the bite of anopheline mosquitoes, and characterized by periodic attacks of chills and fever that coincide with mass destruction of blood cells and the release of toxic substances by the parasite at the end of each reproductive cycle.

Other Living Quarters
type: Class
type: Node shape
subclass of: Living Quarters
comment: This is Living Quarters 'other' than a Detached, Duplex/Semi, Row House, Row House End or Apartment
notation: 875

Childhood Followup 4 Day 8
type: Class
type: Node shape
subclass of: Study Followup 4 Day 8
subclass of: Restriction
  some values from: Childhood Followup 4
  on property: intervalDuring
comment: The eighth day of the fourth study followup activity for a study that occurs during a subject's childhood period

Emergency Department or Urgent Care Visit
type: Node shape
type: Class
subclass of: HHEAR_00074
subclass of: Class
  union of: HHEAR_01747
  union of: Urgent Care Facility Visit

always
type: Class
subclass of: temporal qualifier
comment: This class denotes always

Annual Income More Than $100,000
type: Class
type: Quality Value
subclass of: Annual Income More Than $95,000
subclass of:
  on property: minValue
  has value: 100000
subclass of:
  on property: currency
  has value: USD
subclass of:
  on property: maxValue
subclass of:
  on property: SIO_000900
  has value: year
comment: This class denotes Annual Income More Than $100,000
notation: 223

atrazine
type: Class
type: Node shape
type: Facet Value
subclass of: HHEAR_01374
comment: A diamino-1,3,5-triazine that is 1,3,5-triazine-2,4-diamine substituted by a chloro group at position 6 while one of hydrogens of each amino group is replaced respectively by an ethyl and a propan-2-yl group. Source: ChEBI
notation: ATZ
notation: ATRAZ

on property: currency
has value: USD

1-hydroxybenzo[c]-phenanthrene
type: Class
type: Facet Value
subclass of: polycyclic hydrocarbon
comment: This class denotes 1-hydroxybenzo[c]-phenanthrene
notation: BCP1

Omalizumab (Xolair)
type: Class
subclass of: Asthma Controller Medication
comment: This class denotes Omalizumab (Xolair)

Above Median Number of T-Cell Activation Biomarkers Present
type: Class
type: Quality Value
type: Node shape
subclass of: Number of T-Cell Activation Biomarkers
comment: This class denotes Above Median Number of T-Cell Activation Biomarkers Present
notation: 1094
disjoint with: Below Median Number of T-Cell Activation Biomarkers Present

Yemen
type: geographic region
comment: The country of Yemen
SIO_000313: Outside United States

Childhood Followup 4 Day 6
type: Class
type: Node shape
subclass of: Study Followup 4 Day 6
subclass of: Restriction
  some values from: Childhood Followup 4
  on property: intervalDuring
subclass of: Restriction
  some values from: Childhood Followup 4 Day 5
  on property: intervalAfter
comment: The sixth day of the fourth study followup activity for a study that occurs during a subject's childhood period

rubella
type: Class
type: Quality Value
subclass of: DOID 934
comment: This class denotes rubella
notation: 1072

Edinburgh Postnatal Depression Scale
type: Class
type: Node shape
subclass of: Questionnaire
subclass of: Research or Clinical Assessment Tool
comment: A 10-item, self-rating questionnaire designed to screen postpartum women for indications of depression. (Source: NCI Thesaurus)

most of the time
type: Class
subclass of: Thing
comment: This class denotes most of the time

2-hydroxybenzo[c]-phenanthrene
type: Class
type: Facet Value
subclass of: polycyclic hydrocarbon
comment: This class denotes 2-hydroxybenzo[c]-phenanthrene
notation: BCP2

Difference of Weight-to-Length Z-Scores from 0 to 6 Months
type: Class
type: Quantity Variable
subclass of: Difference of Z-Scores
definition: The arithmetic difference between the weight-to-length Z-scores for a child taken at birth and at six months.

Below Median Number of T-Cell Activation Biomarkers Present
type: Class
type: Quality Value
type: Node shape
subclass of: Number of T-Cell Activation Biomarkers
comment: This class denotes Below Median Number of T-Cell Activation Biomarkers Present
notation: 1095
disjoint with: Above Median Number of T-Cell Activation Biomarkers Present

Panama
type: geographic region
comment: The country of Panama
SIO_000313: Outside United States

Number of Overnight Hospital Admissions
type: Class
type: Node shape
subclass of: Number of Hospital Admissions
comment: This class denotes Number of Overnight Hospital Admissions

Three months period before the visit.
type: Class
type: Node shape
subclass of: Three months
comment: A time interval that begins three months prior to a study visit.
intersection of: time interval

thiacloprid
type: Class
type: Node shape
type: Facet Value
subclass of: HHEAR_01374
comment: nitrile that is cyanamide in which the hydrogens are replaced by a 1,3-thiazolidin-2-ylidene group which in turn is substituted by a (6-chloropyridin-3-yl)methyl group at the ring nitrogen. Source: ChEBI
notation: THI

very poor quality
type: Class
subclass of: Thing
comment: This class denotes very poor quality

Annual Income $30,000 to $49,999
type: Class
type: Quality Value
subclass of: Annual Income $30,000 to $60,000
subclass of: Annual Income $25,000 to $49,999
subclass of:
  on property: currency
  has value: USD
subclass of:
  on property: minValue
  has value: 30000
subclass of:
  on property: maxValue
  has value: 49999
comment: This class denotes Annual Income $30,000 to $49,999
notation: 221

Below Median Number of B-Cell Activation Biomarkers Present
type: Class
type: Quality Value
type: Node shape
subclass of: Number of B-Cell Activation Biomarkers
comment: This class denotes Below Median Number of B-Cell Activation Biomarkers Present
notation: 1093
disjoint with: Above Median Number of B-Cell Activation Biomarkers Present

PCB199
type: Class
type: Facet Value
subclass of: Polychlorobiphenyl
comment: CAS Number: 52663-75-9
notation: PCB199

respiratory failure
type: Class
subclass of: lung disease
comment: A lung disease characterized by inadequate gas exchange by the respiratory system. (Source: Disease Ontology)

Admitted to Hospital Overnight
type: Class
type: Quality Value
type: Node shape
subclass of: Hospital Admission By Duration
comment: This class denotes Admitted to Hospital Overnight
notation: 1110

Israel
type: geographic region
comment: The country of Israel
SIO_000313: Outside United States

1-hydroxybenz[a]anthacene
type: Class
type: Facet Value
subclass of: polycyclic hydrocarbon
comment: This class denotes 1-hydroxybenz[a]anthacene
notation: BAA1
editorial note: Only found in one journal article, no where else. Maybe mis-spelled?

Annual Income $50,000 to $99,999
type: Class
type: Quality Value
subclass of: Annual Income More Than $50,000
subclass of:
  on property: minValue
  has value: 50000
subclass of:
  on property: SIO_000900
  has value: year
subclass of:
  on property: maxValue
  has value: 99999
comment: This class denotes Annual Income $50,000 to $99,999
notation: 222

Number of T-Cell Activation Biomarkers
type: Class
type: Node shape
subclass of: Number of Biomarkers
subclass of: Restriction
  some values from: T-Cell Activation
  on property: SIO_000215
comment: This class denotes Number of T-Cell Activation Biomarkers

rs2292239
type: Class
type: Node shape
subclass of: SNP
comment: This class denotes rs2292239

Autism Spectrum Disorder related condition
type: Class
type: Quality Value
subclass of: developmental disorder of mental health
notation: 150
definition: Quality refers to children who do not meet DSM criteria for ASD but have scores on ADOS and Mullens that suggest related outcome. All potential options seems to fall under this class from the Autism Ontology

cell in vitro
type: Class
subclass of: Cell
comment: A cell that is maintained or propagated in a controlled artificial environment for use in an investigation. (Source: Cell Ontology)

mono benzyl phthalate (BzBP)
type: Class
type: Facet Value
subclass of: Phthalate
comment: This class denotes mono benzyl phthalate (BzBP)
notation: MBZP

Sierra Leone
type: geographic region
comment: The country of Sierra Leone
SIO_000313: Outside United States

FEF 25-75 Percent Predicted Value
type: Class
type: Quality Variable
subclass of: Forced Expiratory Flow at 25-75 Percent
subclass of: Restriction
  on property: hasUnit
  has value: percent
definition: The percent ratio of a patient's best FEF 25-75 value divided by the expected or predicted FEF 25-75 value for the patient based on their demographics (typically age, height, sex, and race) and comparison with a population control group.

N-ace-S-(phenl-2-hydxyetl)-L-cys(ng/mL)
type: Class
type: Facet Value
subclass of: Volatile Organic Compound
comment: This class denotes N-ace-S-(phenl-2-hydxyetl)-L-cys(ng/mL)
notation: VOCPHE
notation: VOCMB3
editorial note: To Do: align with CHEBI.

Uncle
type: Class
type: Quality Value
subclass of: Relative
subclass of: Restriction
  on property: SIO_000227
  all values from: Restriction
    some values from: SIO_010048
    on property: SIO_000008
notation: 192
definition: The brother of your father or mother or the husband of your aunt.

Spontaneous Labor and Birth
type: Class
type: Quality Value
type: Node shape
subclass of: HHEAR_00036
comment: Initiation of labor without the use of pharmacological and/or mechanical interventions, resulting in a non-operative vaginal birth. (reVITALize) [Definition Source: NCI][attribution: NICHD]
notation: 609

Ever Received Hormone Therapy
type: Class
type: Quality Value
type: Node shape
subclass of: Hormone Therapy
comment: This class denotes Ever Received Hormone Therapy
notation: 1060

Raw Score
type: Class
type: Quantity Variable
subclass of: Physical And Mental Assessment
subclass of: score
comment: This class denotes Raw Score
disjoint with: Adjusted Score

siemens
type: unit of measurement
notation: 1/AV

total calorie intake rate
type: Class
type: Quantity Variable
subclass of: CMO_0002248
comment: The entire number of calories consumed by an organism per unit time, regardless of source.

Woke Up With Cough, Wheeze, Shortness of Breath or Tightness in Chest Once
type: Class
type: Quality Value
type: Node shape
subclass of: Number of days of Asthma Induced Night Sleeplessness
subclass of: Restriction
  on property: STATO_0000047
  all values from: Datatype
    with restrictions:
      exactly: 1
    on datatype: NCIT C25301
comment: One day during the visit period child woke up at night with a cough, wheeze, shortness of breath or tightness in the chest
notation: 845

Yes, fabric upholstered furniture in the living room or child's bedroom
type: Class
type: Quality Value
type: Node shape
subclass of: HHEAR_01877
comment: This class denotes Yes, fabric upholstered furniture in the living room or child's bedroom
notation: 941
equivalent class: Class
  intersection of: Living Room or Child's Bedroom
  equivalent class: Yes, fabric upholstered furniture in the living room or child's bedroom

Pregnancy Month 5
type: Class
subclass of: time interval
definition: The fifth month of pregnancy

cardiovascular system disease
type: Class
subclass of: Comorbidity Disease
comment: This class denotes cardiovascular system disease

Somalia
type: geographic region
comment: The country of Somalia
SIO_000313: Outside United States

Grandfather
type: Class
type: Quality Value
subclass of: Ancestor
notation: 682
definition: The father of your father or mother.

N-acel-S-(1, 2-dichlorovinl)-L-cys(ng/mL)
type: Class
subclass of: Volatile Organic Compound
comment: This class denotes N-acel-S-(1, 2-dichlorovinl)-L-cys(ng/mL)
notation: VOC1DC
editorial note: To Do: align with CHEBI.

Fungus
type: Class
type: Node shape
subclass of: Eukaryota
comment: A kingdom of eukaryotic, heterotrophic organisms that live as saprobes or parasites, including mushrooms, yeasts, smuts, molds, etc. They reproduce either sexually or asexually, and have life cycles that range from simple to complex. Filamentous fungi refer to those that grow as multicellular colonies (mushrooms and molds). (Source: NCI Thesaurus)

o-Xylene
type: Class
type: Facet Value
subclass of: Volatile Organic Compound
notation: OXY
definition: O-xylene is a colorless watery liquid with a sweet odor. Less dense than water. Insoluble in water. Irritating vapor. (USCG, 1999)

Living Room or Child's Bedroom or Kitchen
type: Class
type: Node shape
subclass of: room
subclass of: Room
comment: This class denotes Living Room or Child's Bedroom or Kitchen
equivalent class: Class
  union of: Living Room
  union of: Child's Bedroom
  union of: Kitchen
  equivalent class: Living Room or Child's Bedroom or Kitchen

Woke Up With Cough, Wheeze, Shortness of Breath or Tightness in Chest More Than Once
type: Class
type: Quality Value
type: Node shape
subclass of: Number of days of Asthma Induced Night Sleeplessness
comment: More than one day during the visit period child woke up at night with a cough, wheeze, shortness of breath or tightness in the chest
notation: 846

Pregnancy Month 7
type: Class
subclass of: time interval
definition: The seventh month of pregnancy

N-ac-S-(2-carbmo-2-hydxel)-L-cys(ng/mL)
type: Class
subclass of: Volatile Organic Compound
comment: This class denotes N-ac-S-(2-carbmo-2-hydxel)-L-cys(ng/mL)
notation: VOCGAM
editorial note: To Do: align with CHEBI.

Grandmother
type: Class
type: Quality Value
subclass of: Ancestor
notation: 190
definition: The mother of your father or mother.

FVC Percent Predicted Value
type: Class
type: Quality Variable
subclass of: forced vital capacity (FVC)
subclass of: Restriction
  on property: hasUnit
  has value: percent
definition: The percent ratio of a patient's best FVC value divided by the expected or predicted FVC value for the patient based on their demographics (typically age, height, sex, and race) and comparison with a population control group.

Republic of the Congo
type: geographic region
comment: The country of Republic of the Congo
SIO_000313: Outside United States

Tobacco Related Exposure
type: Class
subclass of: HHEAR_00062
comment: This class denotes Tobacco Related Exposure

Seychelles
type: geographic region
comment: The country of Seychelles
SIO_000313: Outside United States

behavior
type: Class
subclass of: Thing
comment: 1. Note that this term is in the subset of terms that should not be used for direct gene product annotation. Instead, select a child term or, if no appropriate child term exists, please request a new term. Direct annotations to this term may be amended during annotation reviews. 2. While a broader definition of behavior encompassing plants and single cell organisms would be justified on the basis of some usage (see PMID:20160973 for discussion), GO uses a tight definition that limits behavior to animals and to responses involving the nervous system, excluding plant responses that GO classifies under development, and responses of unicellular organisms that has general classifications for covering the responses of cells in multicellular organisms (e.g. cell chemotaxis).

Uses Statins Regularly
type: Class
type: Quality Value
type: Node shape
subclass of: Statin Use
comment: This class denotes Uses Statins Regularly
notation: 1058

electronvolt
type: unit of measurement
notation: eV

curie
type: unit of measurement
notation: Ci

unit
type: Class
subclass of: Thing
comment: This class denotes unit

Drank Alcohol Today
type: Class
type: Quality Value
type: Node shape
subclass of: Consumed Alcohol
comment: This class denotes drank alcohol today
notation: 1000

Number of days of Asthma Induced Night Sleeplessness
type: Class
type: Quantity Variable
type: Node shape
subclass of: SIO_000794
subclass of: HHEAR_00661
subclass of: Discover Questionnaire Response
comment: Number of days during the visit period child woke up at night with a cough, wheeze, shortness of breath or tightness in the chest.

Child's Bedroom
type: Class
type: Node shape
subclass of: Bedroom
subclass of: Living Room or Child's Bedroom
subclass of: Living Room or Child's Bedroom or Kitchen
comment: A bedroom in a human dwelling that is specifically for a child or children

Pulmonary Function Test
type: Class
type: Node shape
subclass of: NCIT C18020
comment: A broad range of tests that are performed to assess how well lungs inhale and exhale air and how efficiently they transfer oxygen into the blood. [Source: NCI Thesaurus]

Aunt
type: Class
type: Quality Value
subclass of: Relative
subclass of: Restriction
  on property: SIO_000227
notation: 191
definition: The sister of your father or mother or the wife of your uncle.

Uses Statins Intermittently
type: Class
type: Quality Value
type: Node shape
subclass of: Statin Use
comment: This class denotes Uses Statins Intermittently
notation: 1059

FEV1 Percent Predicted Value
type: Class
type: Quality Variable
subclass of: forced expiratory volume
definition: The percent ratio of a patient's best FEV1 value divided by the expected or predicted FEV1 value for the patient based on their demographics (typically age, height, sex, and race) and comparison with a population control group.

Comoros
type: geographic region
comment: The country of Comoros
SIO_000313: Outside United States

becquerel
type: unit of measurement
notation: Bq

watt per meter kelvin
type: unit of measurement
notation: W/mK

Living Room or Child's Bedroom
type: Class
type: Node shape
subclass of: room
subclass of: Room
subclass of: Class
  union of: Living Room
  union of: Child's Bedroom
comment: This class denotes Living Room or Child's Bedroom
equivalent class: Class
  union of: Living Room
  equivalent class: Living Room or Child's Bedroom

Drank Alcohol Yesterday
type: Class
type: Quality Value
type: Node shape
subclass of: Consumed Alcohol
comment: This class denotes drank alcohol yesterday
notation: 1001

Did Not Wake Up With Cough, Wheeze, Shortness of Breath or Tightness in Chest
type: Class
type: Quality Value
type: Node shape
subclass of: Number of days of Asthma Induced Night Sleeplessness
subclass of: Restriction
  on property: STATO_0000047
  all values from: Datatype
    with restrictions:
      exactly: 0
    on datatype: NCIT C25301
comment: No days during the visit period child woke up at night with a cough, wheeze, shortness of breath or tightness in the chest
notation: 844

Pregnancy Month 4
type: Class
subclass of: time interval
definition: The fourth month of pregnancy

MonetaryAmount
type: Class
subclass of: SIO_000052
comment: A monetary value or range. This type can be used to describe an amount of money such as $50 USD, or a range as in describing a bank account being suitable for a balance between £1,000 and £1,000,000 GBP, or the value of a salary, etc. It is recommended to use PriceSpecification Types to describe the price of an Offer, Invoice, etc. (Source: Schema.org ontology)
contributor: FIBO

Djibouti
type: geographic region
comment: The country of Djibouti
SIO_000313: Outside United States

Mongolia
type: geographic region
comment: The country of Mongolia
SIO_000313: Outside United States

First Void Urination
type: Class
type: Quality Value
subclass of: NCIT C25744
comment: This class denotes First Void Urination
notation: 356

Spirometry Outcomes Did Not Meet Guidelines
type: Class
type: Quality Value
subclass of: Spirometry Outcome
subclass of: Restriction
  some values from: SIO_001310
  on property: SIO_000217
comment: This class denotes Spirometry Outcomes Did Not Meet Guidelines
notation: 281

Daily Smoker
type: Class
type: Quality Value
subclass of: Smoking Status
comment: This class denotes Daily Smoker
notation: 157

Uses Non-Steroidal Anti-Inflammatory Drugs
type: Class
type: Quality Value
type: Node shape
subclass of: Non-Steroidal Anti-inflammatory Drug Use
comment: This class denotes Uses Non-Steroidal Anti-Inflammatory Drugs
notation: 1057

Primary Residence
type: Class
type: Node shape
subclass of: Residence
comment: main residence (Source: wikidata.org)

volt per meter
type: unit of measurement
notation: V/m

Smoked Prior to Pregnancy
type: Class
type: Quality Value
type: Node shape
subclass of: Smoking Status
comment: This class denotes smoked prior to pregnancy
notation: 999

Mediterranean Diet (24-hr recall)
type: Class
type: Node shape
subclass of: HHEAR_01728
comment: This class denotes Mediterranean Diet (24-hr recall)
notation: 843

Distance between membrane rupture site and margin
type: Class
type: Quantity Variable
type: Node shape
subclass of: Physical And Mental Assessment
subclass of: placenta morphological measurement
comment: This class denotes Distance between membrane rupture site and margin

Significant Other
type: Class
type: Quality Value
type: Node shape
subclass of: Marital Status
comment: A gender-neutral term for a person's partner in an intimate or romantic relationship without disclosing or presuming marital status or sexual orientation. [Definition Source: NCI]
notation: 451

Pakistan
type: Quality Value
type: NamedIndividual
type: geographic region
comment: sovereign state in South Asia
comment: The country of Pakistan
notation: 1188
SIO_000313: Outside United States

cell type benign neoplasm
type: Class
subclass of: Thing
comment: This class denotes cell type benign neoplasm

Kiribati
type: geographic region
comment: The country of Kiribati
SIO_000313: Outside United States

Restriction
on property: SIO_000300
has value: 24

Has taken asthma control medications
type: Class
type: Quality Value
subclass of: Asthma Controller Use
comment: This class denotes Has taken asthma control medications
notation: 282
disjoint with: HHEAR_00655

4-(Ethoxycarbonyl)benzoic acid
type: Class
type: Node shape
type: Facet Value
subclass of: Phthalate
comment: This class denotes 4-(Ethoxycarbonyl)benzoic acid
notation: METP

Occasional Smoker
type: Class
type: Quality Value
subclass of: Smoker
comment: This class denotes Occasional Smoker
notation: 158

on property: currency
has value: USD

First Void Urine
type: Class
type: Quality Value
subclass of: urine
subclass of: Restriction
  some values from: First Void Urination
  on property: SIO_000311
comment: This class denotes First Void Urine
notation: 357

N-Acetyl-S-(trichlorovinyl)-L-cysteine
type: Class
type: Facet Value
subclass of: Volatile Organic Compound
comment: This class denotes N-Acetyl-S-(trichlorovinyl)-L-cysteine
notation: TCVMA
editorial note: To Do: align with CHEBI.

Statin Use
type: Class
type: Node shape
subclass of: Pharmacotherapy
comment: This class denotes Statin Use

Senegal
type: geographic region
comment: The country of Senegal
SIO_000313: Outside United States

electric field strength unit
type: unit of measurement
notation: Efs

Gray
type: unit of measurement
notation: Gy

esophageal disease
type: Class
subclass of: Disease
comment: This class denotes esophageal disease

3-hydroxyphenanthrene
type: Class
type: Facet Value
subclass of: polycyclic hydrocarbon
comment: This class denotes 3-hydroxyphenanthrene
notation: PHEN3

Specific Gravity Corrected Concentration
type: Class
type: Node shape
subclass of: concentration
comment: This class denotes Specific Gravity Corrected Concentration

Frequency of Second Hand Smoke Exposure
type: Class
type: Node shape
subclass of: environmental tobacco smoke exposure measurement
subclass of: SIO_001367
comment: the numeric frequency of second hand smoke exposure over some defined period of time

Household Members Not Mother and Father
type: Class
type: Node shape
subclass of: Household
comment: This class denotes Household Members Not Mother and Father
SIO_000132: SIO_000498

neutrophil percentage of leukocytes
type: Class
type: Node shape
subclass of: percentage
comment: A calculated measurement in which the number of neutrophil granulocytes is divided by the number of all white blood cells in a specified sample of peripheral venous blood, and the result presented as a ratio, fraction, quotient or percentage. A neutrophil is, or is in the process of becoming, a granular leucocyte having a nucleus with three to five lobes connected by threads of chromatin, cytoplasm containing very fine granules, and which is readily stainable with neutral dyes. (Source: Experimental Factor Ontology)

Oman
type: geographic region
comment: The country of Oman
SIO_000313: Outside United States

Mono-n-octyl phthalate
type: Class
type: Facet Value
subclass of: Phthalate
comment: This class denotes Mono-n-octyl phthalate
notation: MOP

Socioeconomic Status Index Quartile 4
type: Class
type: Quality Value
type: Node shape
subclass of: Socioeconomic Status Index
comment: This class denotes Socioeconomic Status Index Quartile 4
notation: 1056

infection
type: Class
type: Quality Variable
subclass of: phenotype
subclass of: biological quality
comment: This class denotes infection

millisievert
type: unit of measurement
notation: mSv

Annual Income $30,000 to $60,000
type: Class
type: Quality Value
subclass of: NCIT C70811
subclass of:
  on property: SIO_000900
  has value: year
subclass of:
  on property: maxValue
  has value: 60000
subclass of:
  on property: minValue
  has value: 30000
comment: This class denotes Annual Income $30,000 to $60,000
notation: 349

Occasional E-Cigarette Use
type: Class
type: Quality Value
subclass of: HHEAR_00528
comment: This class denotes Occasional E-Cigarette Use
notation: 155

Spirometry Outcome
type: Class
type: Quality Variable
subclass of: Physical And Mental Assessment
subclass of: NCIT C123984
subclass of: Restriction
  some values from: Spirometry
  on property: SIO_001157
comment: This class denotes Spirometry Outcome

sievert
type: unit of measurement
notation: Sv

Cyclohexane-1,2-dicarboxylic acid mono carboxyisooctyl ester (DINCH)
type: Class
type: Facet Value
subclass of: Phthalate
comment: This class denotes Cyclohexane-1,2-dicarboxylic acid mono carboxyisooctyl ester (DINCH)
notation: MCOCH

Perfluorononanoic acid
type: Class
type: Facet Value
subclass of: Perfluoroakyl and Polyfluoroalkyl Substance
comment: This class denotes Perfluorononanoic acid
notation: PFNA

statin
type: Class
type: Node shape
subclass of: CHEBI_36963
comment: Any organooxygen compound whose structure is related to compactin (mevastatin) and which may be used as an anticholesteremic drug due its EC 1.1.1.34/EC 1.1.1.88 (hydroxymethylglutaryl-CoA reductase) inhibitory properties. (Source: ChEBI Ontology)

Smoked More Than A Month Ago
type: Class
type: Quality Value
type: Node shape
subclass of: Smoker
comment: smoked a cigarette more than a month ago
notation: 997

Right Pulsatility Index
type: Class
type: Quantity Variable
type: Node shape
subclass of: Physical And Mental Assessment
subclass of: Pulsatility Index
comment: This class denotes Right Pulsatility Index
note: Comes from the Right Umbilical Artery - UBERON_0005470.

Democratic Republic of the Congo
type: geographic region
comment: The country of Democratic Republic of the Congo
SIO_000313: Outside United States

carotid artery intima media thickness
type: Class
type: Node shape
subclass of: Physical And Mental Assessment
subclass of: SIO_000043
comment: quantification of the thickness of tunica intima and tunica media, the innermost two layers of the wall of the carotid artery, usually by carotid ultrasound

rest: nil
first:
  min exclusive: 25.0

NCI
type: Class
type: Facet
subclass of: Funding Institute
comment: This class denotes NCI

Annual Income More Than $60,000
type: Class
type: Quality Value
subclass of: Annual Income More Than $50,000
subclass of:
  on property: maxValue
comment: This class denotes Annual Income More Than $60,000
notation: 350

Daily E-Cigarette Use
type: Class
type: Quality Value
subclass of: HHEAR_00528
comment: This class denotes Daily E-Cigarette Use
notation: 156

Non-Steroidal Anti-inflammatory Drug Use
type: Class
type: Node shape
subclass of: Pharmacotherapy
subclass of: Restriction
  some values from: non-steroidal anti-inflammatory drug
  on property: SIO_000230
comment: This class denotes Non-Steroidal Anti-inflammatory Drug Use

Spirometry Outcomes Met Guidelines
type: Class
type: Quality Value
subclass of: Spirometry Outcome
comment: This class denotes Spirometry Outcomes Met Guidelines
notation: 280

absorbance unit
type: unit of measurement
notation: AU

roentgen
type: unit of measurement
notation: Roentgen

Placenta Depth
type: Class
type: Quantity Variable
type: Node shape
subclass of: placenta morphological measurement
comment: Measurement in cm. perpendicular to the Larger and Shorter Axes of the placenta.

Sodium perfluorodecanesulfonate
type: Class
type: Node shape
type: Facet Value
subclass of: Perfluoroakyl and Polyfluoroalkyl Substance
comment: This class denotes Sodium perfluorodecanesulfonate
notation: PFDS

Smoked This Week
type: Class
type: Quality Value
type: Node shape
subclass of: Smoker
comment: smoked a cigarette this week
notation: 998

Clotrimazole
type: Class
type: Quality Value
type: Node shape
subclass of: pharmaceutical drug
comment: A synthetic, imidazole derivate with broad-spectrum, antifungal activity. Clotrimazole inhibits biosynthesis of sterols, particularly ergosterol, an essential component of the fungal cell membrane, thereby damaging and affecting the permeability of the cell membrane. This results in leakage and loss of essential intracellular compounds, and eventually causes cell lysis. (Source: NCI Thesaurus)
notation: 1215

Demographic
type: Class
type: Facet Category
subclass of: Study Indicator
definition: Demographics are quantifiable characteristics of a given population.
was approved by: PER-Jeanette-Stingone
editorial note: SDD-2016-1431-P01_SG_Dictionary_SDD_v1.xlsx

Drug History
type: Class
type: Quality Variable
subclass of: Alcohol, Tobacco, and Illicit Drug Use
comment: This class denotes Drug History
notation: 14

Study Baseline Day 5
type: Class
type: Node shape
subclass of: Study Activity
subclass of: Restriction
  some values from: Study Baseline
  on property: intervalDuring
comment: The fifth day of the baseline activity for a study

Perfluorooctanoic acid (sum of branched isomers)
type: Class
type: Node shape
type: Facet Value
subclass of: Perfluorooctanoic acid
comment: This class denotes Perfluorooctanoic acid (sum of branched isomers)
notation: SBPFOA

on property: currency
has value: USD

Bosnia and Herzegovina
type: geographic region
comment: The country of Bosnia and Herzegovina
SIO_000313: Outside United States

Dental Fillings
type: Class
type: Quality Value
subclass of: Oral Health
comment: This class denotes Dental Fillings
notation: 13

rs4948088
type: Class
type: Node shape
subclass of: SNP
comment: This class denotes rs4948088

Number of A minor alleles for rs689
type: Class
type: Quantity Variable
type: Node shape
subclass of: Number of Minor Alleles for SNP
subclass of: Restriction
  some values from: HHEAR_01241
  on property: SIO_000215
comment: This class denotes Number of A minor alleles for rs689

Perfluorooctanesulfonic acid (linear isomer only)
type: Class
type: Node shape
type: Facet Value
subclass of: Perfluorooctanesulfonic acid
comment: This class denotes Perfluorooctanesulfonic acid (linear isomer only)
notation: NPFOS

Non-Biological Relative
type: Class
subclass of: Relative
definition: People that are considered relatives but are not related by blood. This includes relatives by marriage, adoption, or fosterage.

Croatia
type: geographic region
comment: The country of Croatia
SIO_000313: Outside United States

Developmental Quality
type: Class
type: Quality Variable
subclass of: biological quality
definition: Refers to which stage of development a person is in.
was approved by: PER-Jeanette-Stingone

Gas Chromatography Instrument
type: Class
subclass of: HHEAR_00041
definition: Gas chromatography (GC) is a common type of chromatography used in analytical chemistry for separating and analyzing compounds that can be vaporized without decomposition. Typical uses of GC include testing the purity of a particular substance, or separating the different components of a mixture (the relative amounts of such components can also be determined). In some situations, GC may help in identifying a compound. In preparative chromatography, GC can be used to prepare pure compounds from a mixture.
was approved by: PER-Jim-McCusker

Study Baseline Day 3
type: Class
type: Node shape
subclass of: Study Activity
comment: The third day of the baseline activity for a study

rest:
  rest: nil
  first: Datatype
    with restrictions:
      max exclusive: 29.9
    on datatype: float