Address
type: Class

Affiliation
type: Class
comment: A resource that describes an individual's affiliation with an organization or group, such as the nature of the affiliation and the active dates.

Area Type
type: Class
comment: Describes a resource whose label is a non-jurisdictional geographic entity.
subclass of: Geographic Authority

Authority
type: Class
comment: A concept with a controlled label.
subclass of: Thing
subclass of: Concept
disjoint with: Deprecated Authority
disjoint with: MADS Collection
disjoint with: MADS Scheme
disjoint with: Variant

City Type
type: Class
comment: Describes a resource whose label is an inhabited place incorporated as a city, town, etc.
subclass of: Geographic Authority

City Section Type
type: Class
comment: Describes a resource whose label is a smaller unit within a populated place, e.g., a neighborhood, park, or street.
subclass of: Geographic Authority

Complex Subject Type
type: Class
comment: The label of a madsrdf:ComplexSubject is the concatenation of labels from two or more madsrdf:SimpleType descriptions, except that the combination of madsrdf:SimpleType labels for the madsrdf:ComplexSubject does not meet the conditions to be the label of a madsrdf:NameTitle resource or madsrdf:HierarchicalGeographic resource.
subclass of: Complex Type

Complex Type
type: Class
comment: madsrdf:ComplexType is a resource whose label is the concatenation of labels from two or more Authority descriptions or two or more Variant descriptions or some combination of Authority and Variant descriptions, each of a madsrdf:SimpleType.
subclass of: MADS Type
disjoint union of: Hierarchical Geographic Type
disjoint union of: Complex Subject Type
disjoint union of: Name/Title Type
disjoint with: Simple Type
equivalent class: Restriction
  cardinality: 1
  on property: Component List

Conference Name Type
type: Class
comment: Describes a resource whose label represents a conference name.
subclass of: Name Type

Continent Type
type: Class
comment: Describes a resource whose label is one of seven large landmasses on Earth. These are: Asia, Africa, Europe, North America, South America, Australia, and Antarctica.
subclass of: Geographic Authority

Corporate Name Type
type: Class
comment: Describes a resource whose label is the name of a corporate entity, which may include political or ecclesiastical entities.
subclass of: Name Type

Country Type
type: Class
comment: Describes a resource whose label is a country, i.e. a political entity considered a country.
subclass of: Geographic Authority

County Type
type: Class
comment: Describes a resource whose label is the largest local administrative unit, e.g. Warwickshire, in a country, e.g. England.
subclass of: Geographic Authority

Date Name Element
type: Class
subclass of: Name Element

Deprecated Authority
type: Class
comment: A former Authority.
subclass of: Thing
disjoint with: Authority
disjoint with: MADS Collection
disjoint with: MADS Scheme

Element
type: Class
comment: madsrdf:Element types describe the various parts of labels.
equivalent class: Restriction
  cardinality: 1
  on property: Element Value

Extraterrestrial Area Type
type: Class
comment: Describes a resource whose label is any extraterrestrial entity or space, including a solar system, a galaxy, a star system, and a planet, including a geographic feature of an individual planet.
subclass of: Geographic Authority

Family Name Type
type: Class
comment: Describes a resource whose label represents a family name.
subclass of: Name Type

Family Name Element
type: Class
subclass of: Name Element

Fullname Element
type: Class
subclass of: Name Element

Genre/Form Type
type: Class
comment: Describes a resource whose label is a genre or form term. Genre terms for textual materials designate specific kinds of materials distinguished by the style or technique of their intellectual contents; for example, biographies, catechisms, essays, hymns, or reviews. Form terms designate historically and functionally specific kinds of materials as distinguished by an examination of their physical character, characteristics of their intellectual content, or the order of information within them; for example, daybooks, diaries, directories, journals, memoranda, questionnaires, syllabi, or time sheets. In the context of graphic materials, genre headings denote categories of material distinguished by vantage point, intended purpose, characteristics of the creator, publication status, or method of representation.
subclass of: Simple Type

Genre/Form Element
type: Class
subclass of: Element

Geographic Authority
type: Class
comment: Describes a resource whose label represents a geographic place or feature, especially when a more precise geographic determination (City, Country, Region, etc.) cannot be made.
subclass of: Simple Type

Geographic Element
type: Class
subclass of: Element

Given Name Element
type: Class
subclass of: Name Element

Hierarchical Geographic Type
type: Class
comment: A madsrdf:HierarchicalGeographic indicates that its label is the concatenation of labels from a sequence of madsrdf:Geographic types taken from one of the madsrdf:Geographic sub-classes such as madsrdf:City, madsrdf:Country, madsrdf:State, madsrdf:Region, madsrdf:Area, etc. The madsrdf:Geographic resources that constitute the madsrdf:HierarchicalGeographic should have a broader to narrower hierarchical relationship between them.
subclass of: Complex Type

Other Identifier
type: Class
comment: A madsrdf:Identifier resource describes an identifier by associating the identifier value with its type. To be used to record identifiers for a resource in the absence of URIs.

Island Type
type: Class
comment: Describes a resource whose label is a tract of land surrounded by water and smaller than a continent but is not itself a separate country.
subclass of: Geographic Authority

Language Type
type: Class
comment: Describes a resource whose label represents a language.
subclass of: Simple Type
equivalent class: LinguisticSystem

Language Element
type: Class
subclass of: Element

MADS Collection
type: Class
comment: A madsrdf:Collection is an organizational unit, members of which will have some form of intellectually unifying theme but not to the extent that it defines an independent knowledge organization system. It aggregates madsrdf:Authority descriptions or other madsrdf:MADSCollection resources.
subclass of: Collection
disjoint with: Authority
disjoint with: MADS Scheme
disjoint with: Variant

MADS Scheme
type: Class
comment: MADS Scheme is an organizational unit that describes a knowledge organization system. It aggregates madsrdf:Authority descriptions and/or madsrdf:MADSCollection resources included in the knowledge organization system. Including a madsrdf:MADSCollection within a madsrdf:MADSScheme should be done with care; when a madsrdf:MADSCollection is part of a madsrdf:MADSScheme, then any madsrdf:Authority within that madsrdf:MADSCollection is effectively also in the madsrdf:MADSScheme.
subclass of: ConceptScheme
disjoint with: Authority
disjoint with: MADS Collection
disjoint with: Variant

MADS Type
type: Class
disjoint with: MADS Collection
disjoint with: MADS Scheme

Main Title Element
type: Class
subclass of: Title Element

Name Type
type: Class
comment: Describes a resource whose label represents a name, especially when a more precise Name type (madsrdf:ConferenceName, masdrdf:FamilyName, etc.) cannot be identified.
subclass of: Simple Type

Name Element
type: Class
subclass of: Element

Name/Title Type
type: Class
comment: The label of a madsrdf:NameTitle resource is the concatenation of a label of a madsrdf:Name description and the label of a madsrdf:Title description. Both description types (madsrdf:Name and madsrdf:Title) are of madsrdf:SimpleType types.
subclass of: Complex Type

Non-sort Element
type: Class
subclass of: Title Element

Occupation Type
type: Class
comment: Describes a resource whose label represents an occcupation.
subclass of: Simple Type

Part Name Element
type: Class
subclass of: Title Element

Part Number Element
type: Class
subclass of: Title Element

Personal Name Type
type: Class
comment: Describes a resource whose label represents a personal name.
subclass of: Name Type

Province Type
type: Class
comment: Describes a resource whose label is a first order political division, e.g. Ontario, within a country, e.g. Canada.
subclass of: Geographic Authority

Real World Object
type: Class
comment: A madsrdf:RWO is an abstract entity and identifies a Real World Object (RWO) identified by the label of a madsrdf:Authority or madsrdf:DeprecatedAuthority.
subclass of: Thing

Region Type
type: Class
comment: Describes a resource whose label is an area that has the status of a jurisdiction, usually incorporating more than one first level jurisdiction.
subclass of: Geographic Authority

Simple Type
type: Class
comment: madsrdf:SimpleType is a resource with a label constituting a single word or phrase.
subclass of: MADS Type

Source
type: Class
comment: A resource that represents the source of information about another resource. madsrdf:Source is a type of citation.

State Type
type: Class
comment: Describes a resource whose label is a first order political division, e.g. Montana, within a country, e.g. U.S.
subclass of: Geographic Authority

Subtitle Element
type: Class
subclass of: Title Element

Temporal Type
type: Class
comment: Describes a resource whose label represents a time-based notion.
subclass of: Simple Type

Temporal Element
type: Class
subclass of: Element

Terms of Address Element
type: Class
subclass of: Name Element

Territory Type
type: Class
comment: Describes a resource whose label is a geographical area belonging to or under the jurisdiction of a governmental authority.
subclass of: Geographic Authority

Title Type
type: Class
comment: Describes a resource whose label represents a title.
subclass of: Simple Type

Title Element
type: Class
subclass of: Element

Topic Type
type: Class
comment: Describes a resource whose label represents a topic.
subclass of: Simple Type

Topic Element
type: Class
subclass of: Element

Variant
type: Class
comment: A resource whose label is the alternate form of an Authority or Deprecated Authority.
subclass of: Thing
subclass of: Label
disjoint with: Authority
disjoint with: MADS Collection
disjoint with: MADS Scheme

Administrative Metadata
type: ObjectProperty
type: Property
comment: This relates an Authority or Variant to its administrative metadata, which is, minimimally, a Class defined outside of the MADS/RDF namespace. The RecordInfo Class from the RecordInfo ontology is recommended.
domain: Class
  union of: Authority
  union of: Deprecated Authority
  union of: Variant

Activity End
type: Property
type: DatatypeProperty
comment: Latest date in a period of activity.
domain: Real World Object

Activity Start
type: Property
type: DatatypeProperty
comment: Earliest date in a period of activity.
domain: Real World Object

Affiliation Ended
type: Property
type: DatatypeProperty
comment: The date an individual ceased to be affiliated with an organization.
domain: Affiliation
range: date

Affiliation Started
type: Property
type: DatatypeProperty
comment: The date an individual established an affiliation with an organization.
domain: Affiliation
range: date

Associated Language
type: Property
type: ObjectProperty
comment: Language that a person, organization, or family uses for publication, communication, etc., or in which a work is expressed.
domain: Real World Object
range: Language Type

Associated Locale
type: Property
type: ObjectProperty
comment: A town, city, province, state, and/or country associated with persons, corporate bodies, families, works, and expressions.
domain: Real World Object
range: Geographic Authority

Authoritative Label
type: AnnotationProperty
type: Property
comment: A lexical string representing a controlled, curated label for the Authority.
domain: Authority
sub property of: label
sub property of: prefLabel

Birth Date
type: Property
type: DatatypeProperty
comment: The year a person was born. Date of birth may also include the month and day of the person’s birth. (RDA 9.3.2.1)
domain: Real World Object

Place of Birth
type: Property
type: ObjectProperty
comment: The town, city, province, state, and/or country in which a person was born.
domain: Real World Object
range: Geographic Authority

Change Note
type: AnnotationProperty
type: Property
comment: A note detailing a modification to an Authority or Variant.
sub property of: Note
equivalent property: changeNote

Citation Note
type: AnnotationProperty
type: Property
comment: A note about how the madsrdf:Source relates to the resource about which the madsrdf:Source is the information source.
domain: Source

Citation Source
type: AnnotationProperty
type: Property
comment: The cited resource.
domain: Source

Citation Status
type: DatatypeProperty
type: Property
comment: Should use a standard term - such as 'found' or 'not found' - to indicate whether the cited resource yielded information about the resource related to the madsrdf:Source.
domain: Source
range: string

City
type: AnnotationProperty
type: Property
comment: The city component of an address.
domain: Address

Classification
type: AnnotationProperty
type: Property
comment: The classification code associated with a madsrdf:Authority.
domain: Authority
sub property of: semanticRelation

Code
type: DatatypeProperty
type: Property
comment: A code is a string of characters associated with a the authoritative or deprecated label. It may record an historical notation once used to uniquely identify a concept.
domain: Class
  union of: Authority
  union of: Deprecated Authority
sub property of: notation

Component List
type: Property
type: ObjectProperty
comment: madsrdf:componentList organizes the madsrdf:SimpleType resources whose labels are represented in the label of the associated madsrdf:ComplexType resource.
domain: Complex Type
range: Class
  union of: List
  union of: Seq

Country
type: AnnotationProperty
type: Property
comment: Country associated with an address.
domain: Address

creationDateEnd
type: Property
type: DatatypeProperty
comment: Ending date of the date range for which the beginning date is recorded in madsrdf:creationDateStart.

Work begun
type: Property
type: DatatypeProperty
comment: For a work, earliest date (normally the year) associated with a work; that date may be the date the work was created or first published or released. For an expression, the earliest date (normally the year) associated with an expression; that date may be the date of the earliest known manifestation of that expression. In both cases the date may be the starting date of a range or a single date.

Death Date
type: Property
type: DatatypeProperty
comment: The year a person died. Date of death may also include the month and day of the person’s death. (RDA 9.3.3.1)
domain: Real World Object

Place of Death
type: Property
type: ObjectProperty
comment: The town, city, province, state, and/or country in which a person died.
domain: Real World Object
range: Geographic Authority

Definition Note
type: AnnotationProperty
type: Property
comment: An explanation of the meaning of an Authority, DeprecatedAuthority, or Variant description.
sub property of: Note
equivalent property: definition

Deletion Note
type: AnnotationProperty
type: Property
comment: A note pertaining to the deletion of a resource.
sub property of: Change Note

Deprecated Label
type: Property
type: AnnotationProperty
comment: A label once considered authoritative (controlled and curated) but which is no longer.
domain: Deprecated Authority
sub property of: label
sub property of: hiddenLabel

Editorial Note
type: AnnotationProperty
type: Property
comment: A note pertaining to the management of the label associated with the resource.
sub property of: Note
equivalent property: editorialNote

Element List
type: ObjectProperty
type: Property
comment: The madsrdf:elementList property is used to organize the various parts of labels.
range: Class
  union of: List
  union of: Seq

Element Value
type: DatatypeProperty
type: Property
domain: Element
range: string

Email
type: DatatypeProperty
type: Property
domain: Affiliation

Entity Descriptor
type: Property
type: DatatypeProperty
comment: Any attribute that serves to characterize a person, family or corporate body or that may be needed for differentiation from other persons. families or corporate bodies and for which separate content designation is not already defined.Or
domain: Real World Object

Established
type: Property
type: DatatypeProperty
comment: The year a corporate body was established. Date of establishment may also include the month and day of the corporate body’s establishment.
domain: Real World Object

Example Note
type: AnnotationProperty
type: Property
comment: A example of how the resource might be used.
sub property of: Note
equivalent property: example

Extended Address
type: DatatypeProperty
type: Property
comment: The second address line, if needed.
domain: Address

Extension
type: ObjectProperty
type: Property

Fax
type: DatatypeProperty
type: Property
comment: Fax number
domain: Affiliation

Field of Activity
type: Property
type: ObjectProperty
comment: The field of activity associated with an individual.
domain: Real World Object

Fuller Name
type: Property
type: ObjectProperty
comment: Full form of name needed to distinguish a person from another person with the same preferred name.
range: Personal Name Type

Gender
type: Property
type: DataTypeProperty
comment: The gender with which a person identifies.
domain: Real World Object

Has Abbreviation Variant
type: ObjectProperty
type: Property
sub property of: Has Variant

Has Acronym Variant
type: ObjectProperty
type: Property
sub property of: Has Variant

Has Affiliation
type: ObjectProperty
type: Property
comment: Property to associate an individual, such as a foaf:Agent, to a group or organization with which an individual is or has been affiliated.
domain: Real World Object
range: Affiliation

Has Affiliation Address
type: ObjectProperty
type: Property
comment: The address of the group or organization with which an individual is associated.
domain: Affiliation
range: Address

Has Broader Authority
type: ObjectProperty
type: Property
sub property of: Has Related Authority
sub property of: broader
inverse of: Has Narrower Authority

Has Broader External Authority
type: ObjectProperty
type: Property
comment: Creates a direct relationship between an Authority and a more broadly defined Authority from a different MADS Scheme.
sub property of: Has Broader Authority
sub property of: broadMatch

Other characteristic
type: Property
type: ObjectProperty
comment: A term that specifies a characteristic that differentiates a work or expression from another one.

Has Close External Authority
type: ObjectProperty
type: Property
type: SymmetricProperty
comment: Records a relationship between an Authority and one that is closely related from a different MADS Scheme.
sub property of: Has Related Authority
sub property of: closeMatch

Has Parent Organization
type: Property
type: ObjectProperty
comment: Establishes a relationship between a CorporateName Authority and one of the same that is more broadly defined.
domain: Corporate Name Type
range: Corporate Name Type
sub property of: Has Related Authority

Is Parent Organization Of
type: ObjectProperty
type: Property
comment: Establishes a relationship between a CorporateName Authority and one of the same that is more narrowly defined.
domain: Corporate Name Type
range: Corporate Name Type
sub property of: Has Related Authority
inverse of: Has Parent Organization

Has Earlier Established Form
type: ObjectProperty
type: Property
comment: Used to reference a resource that was an earlier form. This is Related type='earlier' in MADS XML.
sub property of: See Also
inverse of: Has Later Established Form

Has Exact External Authority
type: ObjectProperty
type: Property
type: SymmetricProperty
type: TransitiveProperty
comment: Records a relationship between an Authority and one to which it matches exactly but from a different MADS Scheme.
sub property of: Has Close External Authority
sub property of: exactMatch

Has Expansion Variant
type: ObjectProperty
type: Property
sub property of: Has Variant

Has Hidden Variant
type: ObjectProperty
type: Property
comment: Use for variants that are searchable, but not necessarily for display.
domain: Authority
range: Variant
sub property of: hiddenLabel

Has Identifier
type: ObjectProperty
type: Property
comment: Associates a resource with a madsrdf:Identifier.
range: Other Identifier

Has Later Established Form
type: ObjectProperty
type: Property
comment: Use to reference the later form of a resource. This is Related type='later' in MADS XML.
sub property of: See Also
inverse of: Has Earlier Established Form

Has MADSCollection Member
type: Property
type: ObjectProperty
comment: Associates an Authority or other Collection with a madsrdf:MADSCollection.
domain: MADS Collection
range: Class
  union of: Authority
  union of: MADS Collection
sub property of: member
inverse of: Is Member Of MADSCollection

Has MADS Scheme Member
type: Property
type: ObjectProperty
comment: Associates an Authority or Collection with a madsrdf:MADSScheme.
domain: MADS Scheme
range: Class
  union of: Authority
  union of: MADS Collection
inverse of: Is Member of MADS Scheme

Has Narrower Authority
type: ObjectProperty
type: Property
comment: Creates a direct relationship between an Authority and one that is more narrowly defined.
sub property of: Has Related Authority
sub property of: narrower
inverse of: Has Broader Authority

Has Narrower External Authority
type: ObjectProperty
type: Property
comment: Creates a direct relationship between an Authority and a more narrowly defined Authority from a different MADS Scheme.
sub property of: Has Narrower Authority
sub property of: narrowMatch

Has Reciprocal Authority
type: SymmetricProperty
type: Property
type: ObjectProperty
comment: Establishes a relationship between two Authority resources. It is reciprocal, so the relationship must be shared. This is Related type='equivalent' in MADS XML.
sub property of: Has Related Authority
sub property of: related

Has Reciprocal External Authority
type: SymmetricProperty
type: Property
type: ObjectProperty
comment: Establishes a relationship between an Authority and one from a different MADS Scheme. It is reciprocal, so the relationship must be shared.
sub property of: Has Reciprocal Authority
sub property of: relatedMatch

Has Related Authority
type: ObjectProperty
type: Property
comment: Unless the relationship can be more specifically identified, use 'hasRelatedAuthority.'
domain: Authority
range: Authority
sub property of: semanticRelation

Has Source
type: ObjectProperty
type: Property
comment: Associates a resource description with its Source.
range: Source

Has Top Member of MADS Scheme
type: ObjectProperty
type: Property
comment: Identifies an Authority that is at the top of the hierarchy of authorities within the MADS Scheme.
domain: MADS Scheme
range: Authority
sub property of: Has MADS Scheme Member
sub property of: hasTopConcept

Has Translation Variant
type: ObjectProperty
type: Property
comment: A Variant whose label represents a translation of that of the authoritative label.
sub property of: Has Variant

Has Variant
type: ObjectProperty
type: Property
comment: Associates a Variant with an Authority or Deprecrated Authority. Unless the variant type can be more specifically identified, use 'hasVariant.'
domain: Authority
range: Variant
sub property of: altLabel

Hidden Label
type: Property
type: DatatypeProperty
comment: A label entered for discovery purposes but not shown.
domain: Variant
sub property of: literalForm

History Note
type: AnnotationProperty
comment: A note pertaining to the history of the resource.
sub property of: Note
equivalent property: historyNote

Honorary Title
type: Property
type: DatatypeProperty
comment: Designation indicative of royalty, nobility, or ecclesiastical rank or office, or a term of address for a person of religious vocation.
domain: Real World Object

Hours
type: DatatypeProperty
type: Property
domain: Affiliation

Identifier Scheme
type: AnnotationProperty
type: Property
comment: The scheme associated with the identifier. For example, "LCCN" would be used when the Identifier Value (madsrdf:idValue) is a LC Control Number.
domain: Other Identifier

Identifier Value
type: DatatypeProperty
type: Property
comment: The value of the identifier conforming to the Identifier Scheme syntax.
domain: Other Identifier
range: string

Identifies RWO
type: Property
type: ObjectProperty
comment: Associates a madsrdf:Authority with the Real World Object that is the subject of the authority's label.
domain: Authority
range: Real World Object
sub property of: focus
inverse of: Is Identified By Authority

Is Identified By Authority
type: ObjectProperty
type: Property
comment: Associates a Real World Object with its Authority description.
domain: Real World Object
range: Authority
inverse of: Identifies RWO

Is Member Of MADSCollection
type: Property
type: ObjectProperty
comment: Associates a Collection with a madsrdf:Authority or another madsrdf:MADSCollection.
domain: Class
  union of: Authority
  union of: MADS Collection
range: MADS Collection
inverse of: Has MADSCollection Member

Is Member of MADS Scheme
type: Property
type: ObjectProperty
domain: Class
  union of: Authority
  union of: MADS Collection
range: MADS Scheme
sub property of: inScheme
inverse of: Has MADS Scheme Member

Is Top Member of MADS Scheme
type: Property
type: ObjectProperty
comment: Identifies a MADS Scheme in which the Authority is at the top of the hierarchy.
domain: Class
  union of: Authority
  union of: MADS Collection
range: MADS Scheme
sub property of: Is Member of MADS Scheme
sub property of: topConceptOf
inverse of: Has Top Member of MADS Scheme

Nature of Affiliation
type: Property
type: AnnotationProperty
comment: Records the individual's role or position in the organization with which the individual is affiliated. A "job title" might be appropriate.
domain: Affiliation

Note
type: Property
type: AnnotationProperty
comment: A note about the resource.
equivalent property: note

Occupation
type: Property
type: ObjectProperty
comment: A profession or occupation in which the person works or has worked.
domain: Real World Object
range: Occupation Type

Organization or Group
type: AnnotationProperty
type: Property
comment: The group or organization with which an individual is associated.
domain: Affiliation

Phone
type: DatatypeProperty
type: Property
domain: Affiliation

Post Code / Zip Code
type: DatatypeProperty
type: Property
domain: Address

Prominent Family Member
type: Property
type: DatatypeProperty
comment: A well-known individual who is a member of the family.
domain: Real World Object

Scope Note
type: AnnotationProperty
type: Property
sub property of: Note
equivalent property: scopeNote

See Also
type: ObjectProperty
comment: Denotes a relationship between an Authority and/or DeprecatedAuthority. The relationship may or may or may not be reciprocated and there is no certainty that the related resource will further illuminate the original resource.
domain: Class
  union of: Authority
  union of: Deprecated Authority
range: Class
  union of: Authority
  union of: Deprecated Authority
sub property of: seeAlso

State
type: AnnotationProperty
type: Property
comment: The state associated with an address.
domain: Address

Street Address
type: DatatypeProperty
type: Property
comment: First line of address. For second line, use madsrdf:extendedAddress.
domain: Address

Terminated
type: Property
type: DatatypeProperty
comment: The year a corporate body was terminated. Date of termination may also include the month and day of the corporate body’s termination.
domain: Real World Object

Use For
type: Property
type: ObjectProperty
comment: "Use [This Resource] For." Traditional "USE FOR" reference.
sub property of: See Also
inverse of: Use Instead

Use Instead
type: ObjectProperty
type: Property
comment: "Use [This Other Resource] Instead." Traditional "USE" reference.
sub property of: See Also

Variant Label
type: DatatypeProperty
type: Property
comment: The lexical, variant form of an authoritative label.
domain: Variant
sub property of: literalForm

Work locale
type: Property
type: ObjectProperty
comment: The country or other territorial jurisdiction from which a work originated.
range: Geographic Authority

v1.rdf
type: Ontology
comment: Updated: 29 October 2015