ARNOLD PRESS
type: Class
subclass of: Health Related Factors
comment: 1 MD02008 2 ARNOLD PRESS 3 None 4 ARNOLD PRESS 5 183301007 6 Physical exercises 7 Physical exercises (regime/therapy) 8 Physical therapy exercises 9 C0452240

Ability to walk
type: Class
subclass of: Health Related Factors
comment: 1 MD02711 2 Ability to walk 3 None 4 Ability to walk 5 282097004 6 Ability to walk 7 Ability to walk (observable entity) 8 Ability to walk 9 C0559964

Action
type: Class
subclass of: Health Related Factors
comment: 1 MD04090 2 Action 3 None 4 Action 5 129264002 6 Action 7 Action (qualifier value) 8 Action 9 C0441472
comment: 1 MD04090-1 2 Action 3 None 4 Action 5 129264002 6 Action 7 Action (qualifier value) 8 Action 9 C3266814
comment: 1 MD04090-2 2 Action 3 None 4 Action 5 273248003 6 Action 7 Action (attribute) 8 Action 9 C0441472
comment: 1 MD04090-3 2 Action 3 None 4 Action 5 273248003 6 Action 7 Action (attribute) 8 Action 9 C3266814

Active-Assist
type: Class
subclass of: Health Related Factors
comment: 1 MD02645 2 Active-Assist 3 None 4 Active-Assist 5 35897007 6 active motion 7 Active movement (observable entity) 8 Active movement 9 C0231481

Behavior
type: Class
subclass of: Health Related Factors
comment: 1 M00001 2 Behavior 3 Behaviors, Behaviours, Behavioral, behaviour 4 Behavior 5 844005 6 Behavior finding 7 Behavior finding (finding) 8 Behavior 9 C0004927

Breaths
type: Class
subclass of: Health Related Factors
comment: 1 MD02562 2 Breath 3 breathe 4 Breaths 5 78064003 6 Breathing 7 Respiratory function (observable entity) 8 braeth 9 C0225386

Convenience Measurement
type: Class
subclass of: Health Related Factors
comment: 1 MD04343 2 Convenience Measurement 3 None 4 Convenience Measurement 5 122869004 6 Measurement 7 Measurement procedure (procedure) 8 measurement 9 C0242485
comment: 1 MD04343-1 2 Convenience Measurement 3 None 4 Convenience Measurement 5 272391002 6 Measurement 7 Measurement technique (qualifier value) 8 measurement 9 C0242485

Cut
type: Class
subclass of: Health Related Factors
comment: 1 MD04227 2 Cut 3 None 4 Cut 5 283396008 6 Cut 7 Incised wound (disorder) 8 Cut 9 C0000925
comment: 1 MD04227 2 Cut 3 None 4 Cut 5 134352000 6 Cut 7 Incised wound - morphology (morphologic abnormality) 8 Cut 9 C0000925

Cylindrical Grasp
type: Class
subclass of: Health Related Factors
comment: 1 MD04093 2 Cylindrical Grasp 3 None 4 Cylindrical Grasp 5 242899004 6 Grasped with hand 7 Grasped with hand (event) 8 grasp 9 C0220843

Discover
type: Class
subclass of: Health Related Factors
comment: 1 MD01757 2 Discover 3 None 4 Discover 5 263857004 6 Revealed 7 Revealed (qualifier value) 8 Discover 9 C1880355

Draw a circle on the wall
type: Class
subclass of: Health Related Factors
comment: 1 MD02783 2 Draw a circle on the wall 3 None 4 Draw a circle on the wall 5 226029000 6 exercises 7 Exercises (regime/therapy) 8 Exercise 9 C0015259

During activities
type: Class
subclass of: Health Related Factors
comment: 1 MD04337 2 During activity 3 during activites, during activity 4 During activities 5 257733005 6 Activity 7 Activity (observable entity) 8 Activities 9 C0441655

During activity
type: Class
subclass of: Health Related Factors
comment: 1 MD04331 2 During activity 3 during activites, During activities, during activity 4 During activity 5 257733005 6 Activity 7 Activity (observable entity) 8 Activities 9 C0441655

Finger to palm
type: Class
subclass of: Health Related Factors
comment: 1 MD04115 2 Finger to palm 3 Palm to finger 4 Finger to palm 5 249837003 6 Fingertip to palm distance 7 Fingertip to palm distance (observable entity) 8 Palm of hand 9 C0817662

Gain
type: Class
subclass of: Health Related Factors
comment: 1 MD02513 2 Gain 3 None 4 Gain 5 282501000 6 Runs up hill 7 Does run up hill (finding) 8 gain 9 C1517378

Get up and walk
type: Class
subclass of: Health Related Factors
comment: 1 MD04384 2 Get up and walk 3 None 4 Get up and walk 5 282146009 6 Walks 7 Does walk (finding) 8 Does walk 9 C0600108

Going up and down the stairs
type: Class
subclass of: Health Related Factors
comment: 1 MD02813 2 Going up and down the stairs 3 Going up and down stairs 4 Going up and down the stairs 5 282193002 6 walks up stairs 7 Does walk up stairs (finding) 8 Does walk up stairs 9 C0560078

Grasp
type: Class
subclass of: Health Related Factors
comment: 1 MD04095 2 Grasp 3 grasp, Grasping 4 Grasp 5 242899004 6 Grasped with hand 7 Grasped with hand (event) 8 grasp 9 C0220843

Grit
type: Class
subclass of: Health Related Factors
comment: 1 MD02505 2 Grit 3 None 4 Grit 5 264359001 6 Grit 7 Grit (substance) 8 Grit 9 C0440273

HAND ROTATION
type: Class
subclass of: Health Related Factors
comment: 1 MD02019 2 HAND ROTATION 3 None 4 HAND ROTATION 5 70433009 6 Rotation 7 Musculoskeletal rotation (observable entity) 8 Musculoskeletal rotation 9 C0677597

Hand action
type: Class
subclass of: Health Related Factors
comment: 1 MD04088 2 Hand action 3 None 4 Hand action 5 129264002 6 Action 7 Action (qualifier value) 8 Action 9 C0441472
comment: 1 MD04088-1 2 Hand action 3 None 4 Hand action 5 129264002 6 Action 7 Action (qualifier value) 8 Action 9 C3266814
comment: 1 MD04088-2 2 Hand action 3 None 4 Hand action 5 273248003 6 Action 7 Action (attribute) 8 Action 9 C0441472
comment: 1 MD04088-3 2 Hand action 3 None 4 Hand action 5 273248003 6 Action 7 Action (attribute) 8 Action 9 C3266814

Health Related Factors
type: Class
subclass of: Lifestyle
comment: 1 MD02515 2 Flow 3 None 4 Flow 5 54709006 6 Body measurement 7 Body measurement (procedure) 8 Flow 9 C0806140

Hook Grasp
type: Class
subclass of: Health Related Factors
comment: 1 MD04101 2 Hook Grasp 3 None 4 Hook Grasp 5 242899004 6 Grasped with hand 7 Grasped with hand (event) 8 grasp 9 C0220843

Hydration
type: Class
subclass of: Health Related Factors
comment: 1 MD01128 2 Hydration 3 None 4 Hydration 5 405006006 6 Hydration 7 Hydration status (observable entity) 8 Hydration status 9 C1321013

Imagination
type: Class
subclass of: Health Related Factors
comment: 1 MD00563 2 fancy 3 None 4 Imagination 5 247659005 6 imagination 7 Use of imagination (observable entity) 8 Imagination 9 C0020913

In-Hand Manipulation
type: Class
subclass of: Health Related Factors
comment: 1 MD04112 2 In-Hand Manipulation 3 None 4 In-Hand Manipulation 5 119665008 6 Hand Manipulation 7 Hand manipulation (procedure) 8 Hand Manipulation 9 C0556796

Key Pinch
type: Class
subclass of: Health Related Factors
comment: 1 MD04109 2 Key Pinch 3 None 4 Key Pinch 5 251434007 6 Key pinch 7 Key pinch (observable entity) 8 Key pinch 9 C0429272

Lifestyle
type: Class
comment: 1 MD00724 2 lifestyle 3 None 4 lifestyle 5 134436002 6 Lifestyle 7 Lifestyle (finding) 8 Life Style 9 C0023676

Manipulation
type: Class
subclass of: Health Related Factors
comment: 1 MD04113 2 Manipulation 3 Manipulating 4 Manipulation 5 19207007 6 Manipulation 7 Manipulation (procedure) 8 Manipulation 9 C0947647

Micro-operation
type: Class
subclass of: Health Related Factors
comment: 1 MD04468 2 Micro-operation 3 None 4 Micro-operation 5 844005 6 Behavior finding 7 Behavior finding (finding) 8 Behavior 9 C0004927

Muscle force
type: Class
subclass of: Health Related Factors
comment: 1 MD02710 2 Muscle force 3 None 4 Muscle force 5 271708004 6 muscle power 7 Finding of power of skeletal muscle (finding) 8 Muscle Strength 9 C0517349

PRESS
type: Class
subclass of: Health Related Factors
comment: 1 MD02007 2 PRESS 3 None 4 PRESS 5 303365000 6 Pushes 7 Does push (finding) 8 Does push (finding) 9 C0580841

Palm to finger
type: Class
subclass of: Health Related Factors
comment: 1 MD04117 2 Finger to palm 3 Palm to finger 4 Palm to finger 5 249837003 6 Fingertip to palm distance 7 Fingertip to palm distance (observable entity) 8 Palm of hand 9 C0817662

Palmar abduction
type: Class
subclass of: Health Related Factors
comment: 1 MD04034 2 Palmar abduction 3 None 4 Palmar abduction 5 60074003 6 Abduction 7 Abduction, function (observable entity) 8 Abduction 9 C0231456

Physical functions
type: Class
subclass of: Health Related Factors
comment: 1 MD02266 2 Physical functions 3 None 4 Physical functions 5 246464006 6 Function 7 Function (observable entity) 8 Physical function 9 C0516981

Power Assist Beep
type: Class
subclass of: Health Related Factors
comment: 1 MD01954 2 evening drive 3 None 4 Power Assist Beep 5 256235009 6 Exercise 7 Exercise (observable entity) 8 Exercise 9 C0015259

Raise your arms and legs in a lying position
type: Class
subclass of: Health Related Factors
comment: 1 MD02795 2 Raise your arms and legs in a lying position 3 None 4 Raise your arms and legs in a lying position 5 256235009 6 exercise 7 Exercise (observable entity) 8 Exercise 9 C0015259

Registered
type: Class
subclass of: Health Related Factors
comment: 1 MD00555 2 Registered 3 None 4 Registered 5 229053005 6 Registers 7 Registers (qualifier value) 8 Registration 9 C1514821

Responsiveness
type: Class
subclass of: Health Related Factors
comment: 1 MD01764 2 Responsiveness 3 None 4 Responsiveness 5 35209006 6 Sensitivity 7 Sensitivity (finding) 8 Reactivity reduced 9 C0457239

Seated
type: Class
subclass of: Health Related Factors
comment: 1 MD03227 2 Seated 3 None 4 Seated 5 301998005 6 Ability to move 7 Ability to move (observable entity) 8 Ability to move 9 C0344382

Shift
type: Class
subclass of: Health Related Factors
comment: 1 MD02086 2 Shift 3 None 4 Shift 5 9546005 6 Shift 7 Shift (morphologic abnormality) 8 Shift 9 C0333051
comment: 1 MD04119 2 Shift 3 None 4 Shift 5 255324009 6 Movement 7 Movement (observable entity) 8 Shift 9 C0333051

Spherical Grasp
type: Class
subclass of: Health Related Factors
comment: 1 MD04097 2 Spherical Grasp 3 None 4 Spherical Grasp 5 242899004 6 Grasped with hand 7 Grasped with hand (event) 8 grasp 9 C0220843

Stand up from sitting
type: Class
subclass of: Health Related Factors
comment: 1 MD03228 2 Stand up from sitting 3 None 4 Stand up from sitting 5 282881008 6 ability to stand from sitting 7 Ability to stand from sitting (observable entity) 8 Ability to stand from sitting 9 C0560798

Standing up
type: Class
subclass of: Health Related Factors
comment: 1 MD03243 2 Standing up 3 stand up 4 Standing up 5 258148007 6 Standing up 7 Standing up (observable entity) 8 Standing up 9 C0444796

Tip pinch
type: Class
subclass of: Health Related Factors
comment: 1 MD04107 2 Tip pinch 3 None 4 Tip pinch 5 251435008 6 Tip pinch 7 Tip pinch (observable entity) 8 Tip pinch 9 C0429273

Tripod Pinch
type: Class
subclass of: Health Related Factors
comment: 1 MD04105 2 Tripod Pinch 3 None 4 Tripod Pinch 5 242899004 6 Grip/pinch 7 Grasped with hand (event) 8 Grip/pinch 9 C0429270

Use
type: Class
subclass of: Health Related Factors
comment: 1 MD04370 2 Use 3 using, use of 4 Use 5 419385000 6 Use 7 Use - dosing instruction imperative (qualifier value) 8 Use 9 C1947944

Wearing
type: Class
subclass of: Health Related Factors
comment: 1 MD04381 2 Wearing 3 weariness 4 Wearing 5 844005 6 Behavior finding 7 Behavior finding (finding) 8 Behavior 9 C0004927

access
type: Class
subclass of: Health Related Factors
comment: 1 MD04465 2 access 3 None 4 access 5 260507000 6 Access 7 Access (attribute) 8 Access 9 C0444454

activity
type: Class
subclass of: Health Related Factors
comment: 1 MD02597 2 activity 3 None 4 activity 5 257733005 6 Activity 7 Activity (observable entity) 8 Activity 9 C0441655

appetite change
type: Class
subclass of: Health Related Factors
comment: 1 MD01612 2 appetite change 3 None 4 appetite change 5 249473004 6 Altered appetite 7 Altered appetite (finding) 8 Altered appetite 9 C0426587

assist
type: Class
subclass of: Health Related Factors
comment: 1 MD03253 2 assist 3 None 4 assist 5 10904000 6 Assists 7 Orthostatic body position (finding) 8 Assist, unit 9 C3841982

breathe
type: Class
subclass of: Health Related Factors
comment: 1 MD0283 2 Breath 3 Breaths 4 breathe 5 719983008 6 breathing 7 Breathing process (qualifier value) 8 Work of Breathing 9 C0043229

circles
type: Class
subclass of: Health Related Factors
comment: 1 MD02765 2 circles 3 None 4 circles 5 229152003 6 leg exercise 7 Lower limb exercises (regime/therapy) 8 Exercise 9 C0015259

concentration
type: Class
subclass of: Health Related Factors
comment: 1 MD02163 2 concentration 3 concentrate 4 concentration 5 82742001 6 Concentration 7 Concentration, function (observable entity) 8 Concentration 9 C0086045
comment: 1 MD02163-1 2 concentration 3 concentrate 4 concentration 5 702942001 6 Concentration 7 Concentration (qualifier value) 8 Concentration 9 C0086045
comment: 1 MD02219 2 concentration 3 concentrate 4 concentration 5 838500001 6 Able to concentrate 7 Able to concentrate (finding) 8 Able to concentrate (finding) 9 C5241388

consume
type: Class
subclass of: Health Related Factors
comment: 1 MD01516 2 consume 3 None 4 consume 5 844005 6 Behavior finding 7 Behavior finding (finding) 8 Behavior 9 C0004927

contact
type: Class
subclass of: Health Related Factors
comment: 1 MD02550 2 contact 3 None 4 contact 5 11723008 6 contact with 7 Contact with (contextual qualifier) (qualifier value) 8 contact with 9 C0332158

continue
type: Class
subclass of: Health Related Factors
comment: 1 MD00220 2 Continuous 3 None 4 continue 5 258135008 6 Continued movement 7 Continued movement (physical force) 8 Continuous 9 C0549178

control ability
type: Class
subclass of: Health Related Factors
comment: 1 MD04287 2 control ability 3 None 4 control ability 5 122869004 6 Measurement 7 Measurement procedure (procedure) 8 measurement 9 C0242485

cool-down
type: Class
subclass of: Health Related Factors
comment: 1 MD02782 2 cool-down 3 None 4 cool-down 5 256235009 6 exercise 7 Exercise (observable entity) 8 Cool-Down Exercise 9 C3658227

cross leg jump
type: Class
subclass of: Health Related Factors
comment: 1 MD02802 2 cross leg jump 3 None 4 cross leg jump 5 256235009 6 exercise 7 Exercise (observable entity) 8 Cool-Down Exercise 9 C3658227

daily life
type: Class
subclass of: Health Related Factors
comment: 1 MD02267 2 daily life 3 None 4 daily life 5 69620002 6 Daily 7 Daily (qualifier value) 8 Daily 9 C0332173
comment: 1 MD02918 2 daily life 3 None 4 daily life 5 129025006 6 Activity of daily living 7 Activity of daily living (observable entity) 8 Activities of Daily Living (activity) 9 C0001288

decompression
type: Class
subclass of: Health Related Factors
comment: 1 MD02544 2 decompression 3 None 4 decompression 5 281613004 6 Decompression 7 Decompression - action (qualifier value) 8 Decompression 9 C1829459
comment: 1 MD02544-1 2 decompression 3 None 4 decompression 5 281613004 6 Decompression 7 Decompression - action (qualifier value) 8 Decompression 9 C1965697
comment: 1 MD02544-2 2 decompression 3 None 4 decompression 5 424128006 6 Decompression 7 Decompression (procedure) 8 Decompression 9 C1829459
comment: 1 MD02544-3 2 decompression 3 None 4 decompression 5 424128006 6 Decompression 7 Decompression (procedure) 8 Decompression 9 C1965697

defecation
type: Class
subclass of: Health Related Factors
comment: 1 MD01449 2 defecation 3 Defecation functions 4 defecation 5 111989001 6 Defecation 7 Defecation (observable entity) 8 Defecation 9 C0011135

dorsiflexion
type: Class
subclass of: Health Related Factors
comment: 1 MD03463 2 dorsiflexion 3 Dorsiflexion 4 dorsiflexion 5 71496008 6 Dorsiflexion of ankle 7 Dorsiflexion of foot, function (observable entity) 8 right ankle dorsiflexion 9 C2196482
comment: 1 MD03614 2 dorsiflexion 3 Dorsiflexion 4 dorsiflexion 5 71496008 6 Dorsiflexion of ankle 7 Dorsiflexion of foot, function (observable entity) 8 Left ankle dorsiflexion 9 C2139371
comment: 1 MD03619 2 dorsiflexion 3 Dorsiflexion 4 dorsiflexion 5 19876005 6 Ankle dorsiflexion test 7 Ankle dorsiflexion test (procedure) 8 Ankle dorsiflexion test 9 C0231771

double leg circles
type: Class
subclass of: Health Related Factors
comment: 1 MD02763 2 double leg circles 3 None 4 double leg circles 5 229152003 6 leg exercise 7 Lower limb exercises (regime/therapy) 8 Lower limb exercises 9 C0454361

draw
type: Class
subclass of: Health Related Factors
comment: 1 MD02785 2 draw 3 None 4 draw 5 844005 6 behavior finding 7 Behavior finding (finding) 8 Behavior 9 C0004927

driving
type: Class
subclass of: Health Related Factors
comment: 1 MD02533 2 driving 3 None 4 driving 5 129060000 6 Driving 7 Driving (observable entity) 8 Driving 9 C0004379

drug treatment
type: Class
subclass of: Health Related Factors
comment: 1 MD00944 2 drug treatment 3 None 4 drug treatment 5 18629005 6 Medication treatment 7 Administration of drug or medicament (procedure) 8 On Treatment 9 C4684449

during a break
type: Class
subclass of: Health Related Factors
comment: 1 MD04261 2 during rest 3 None 4 during a break 5 258157001 6 Rest 7 Rest (observable entity) 8 Rest 9 C0035253

during activites
type: Class
subclass of: Health Related Factors
comment: 1 MD04264 2 During activity 3 During activities, during activity 4 during activites 5 257733005 6 Activity 7 Activity (observable entity) 8 Behavior 9 C0004927

during activity
type: Class
subclass of: Health Related Factors
comment: 1 MD04444 2 During activity 3 during activites, During activities 4 during activity 5 257733005 6 Activity 7 Activity (observable entity) 8 during activity 9 during activity

during rest
type: Class
subclass of: Health Related Factors
comment: 1 MD04440 2 during rest 3 during a break 4 during rest 5 258157001 6 Rest 7 Rest (observable entity) 8 during rest 9 C0035253

eat
type: Class
subclass of: Health Related Factors
comment: 1 MD02209 2 eat 3 None 4 eat 5 48263008 6 Eating 7 Eating (observable entity) 8 Eating 9 C0013470

evaluation
type: Class
subclass of: Health Related Factors
comment: 1 MD02249 2 Evaluation 3 None 4 evaluation 5 129265001 6 Evaluation 7 Evaluation - action (qualifier value) 8 Evaluation 9 C0220825

evening drive
type: Class
subclass of: Health Related Factors
comment: 1 MD01953 2 afternoon drive 3 None 4 evening drive 5 256235009 6 Exercise 7 Exercise (observable entity) 8 Exercise 9 C0015259

excluding
type: Class
subclass of: Health Related Factors
comment: 1 MD00252 2 excluding 3 None 4 excluding 5 77765009 6 Exclude 7 Exclude (qualifier value) 8 Exclusion 9 C2828389

execute
type: Class
subclass of: Health Related Factors
comment: 1 MD04459 2 execute 3 executive function 4 execute 5 844005 6 Behavior finding 7 Behavior finding (finding) 8 Behavior 9 C0004927

exemption
type: Class
subclass of: Health Related Factors
comment: 1 MD00565 2 exemption 3 None 4 exemption 5 260400001 6 Reduced 7 Reduced (qualifier value) 8 Exemption 9 C2348482

find
type: Class
subclass of: Health Related Factors
comment: 1 MD03223 2 find 3 None 4 find 5 246106000 6 control 7 Control (attribute) 8 Ability to control position 9 C0560751

force
type: Class
subclass of: Health Related Factors
comment: 1 MD03146 2 Force (forceplate) 3 force, forceplate 4 force 5 263760002 6 Forced 7 Forced (qualifier value) 8 Force 9 C0441722

get rid
type: Class
subclass of: Health Related Factors
comment: 1 MD02216 2 get rid 3 None 4 get rid 5 118292001 6 To take something off or out, to get rid of, to eliminate 7 Removal (procedure) 8 Removing (action) 9 C1883720

get up
type: Class
subclass of: Health Related Factors
comment: 1 MD02186 2 get up 3 None 4 get up 5 401196007 6 Get up and go test 7 Get up and go test (procedure) 8 Get up and go test 9 C1303170

go to the bathroom
type: Class
subclass of: Health Related Factors
comment: 1 MD02187 2 go to the bathroom 3 None 4 go to the bathroom 5 183366004 6 Use of bathroom aids 7 Use of bathroom aids (regime/therap 8 Use of bathroom aids 9 C0418961

going down
type: Class
subclass of: Health Related Factors
comment: 1 MD02816 2 going down 3 None 4 going down 5 282187005 6 does walk down step 7 Does walk down step (finding) 8 Does walk down step 9 C0516678

going up
type: Class
subclass of: Health Related Factors
comment: 1 MD02815 2 going up 3 None 4 going up 5 282181006 6 does walk up step 7 Does walk up step (finding) 8 Does walk up step 9 C0516677

grip
type: Class
subclass of: Health Related Factors
comment: 1 MD04466 2 Grip 3 grip 4 grip 5 284260004 6 grips 7 Does grip (finding) 8 Does grip 9 C0600117

grocery shopping
type: Class
subclass of: Health Related Factors
comment: 1 MD02268 2 grocery shopping 3 None 4 grocery shopping 5 129011005 6 shopping 7 Shopping (observable entity) 8 Shopping (activity) 9 C0150768

growth
type: Class
subclass of: Health Related Factors
comment: 1 MD00515 2 growth 3 None 4 growth 5 365698005 6 Organism growth 7 Finding of organism growth (finding) 8 Growth 9 C0018270

hunting
type: Class
subclass of: Health Related Factors
comment: 1 MD02496 2 hunting 3 None 4 hunting 5 256235009 6 Exercise 7 Exercise (observable entity) 8 Exercise 9 C0015259

hunting fishing
type: Class
subclass of: Health Related Factors
comment: 1 MD02495 2 hunting fishing 3 None 4 hunting fishing 5 1137717005 6 fishing 7 Fishing (qualifier value) 8 fishing 9 C5445286

improvement
type: Class
subclass of: Health Related Factors
comment: 1 MD00726 2 improvement 3 None 4 improvement 5 390771008 6 Improvement of status 7 Improvement of status (qualifier value) 8 Improvement 9 C2986411

intake
type: Class
subclass of: Health Related Factors
comment: 1 MD00774 2 intake 3 None 4 intake 5 226430004 6 Pork intake 7 Pork intake (observable entity) 8 Intake 9 C1512806
comment: 1 MD00777 2 intake 3 None 4 intake 5 365967005 6 Finding of alcohol intake 7 Finding of alcohol intake (finding) 8 Alcohol intake - finding 9 C1287509

inversion
type: Class
subclass of: Health Related Factors
comment: 1 MD03487 2 iniversion 3 None 4 iniversion 5 45027002 6 Inversion 7 Inversion (morphologic abnormality) 8 inversion of ankle 9 C2078964
comment: 1 MD03490 2 inversion 3 None 4 inversion 5 45027002 6 Inversion 7 Inversion (morphologic abnormality) 8 Inversion 9 C0021945

jump
type: Class
subclass of: Health Related Factors
comment: 1 MD02804 2 jump 3 Jumping 4 jump 5 282602000 6 jumps 7 Does jump (finding) 8 Jumping 9 C0221189

kicks
type: Class
subclass of: Health Related Factors
comment: 1 MD02775 2 kicks 3 Kicking 4 kicks 5 1222895009 6 does kick object 7 Does kick object (finding) 8 Does kick 9 C0562013

lean
type: Class
subclass of: Health Related Factors
comment: 1 MD03005 2 lean 3 None 4 lean 5 248362003 6 Lean body mass 7 Lean body mass (observable entity) 8 Lean body mass 9 C0424678

life record
type: Class
subclass of: Health Related Factors
comment: 1 MD01442 2 life record 3 None 4 life record 5 57646009 6 record of 7 Record of (contextual qualifier) (qualifier value) 8 Record of (contextual qualifier) 9 C2355580

like
type: Class
subclass of: Health Related Factors
comment: 1 MD02235 2 like 3 None 4 like 5 23682002 6 Love 7 Love (finding) 8 Like 9 C0870814

measurement
type: Class
subclass of: Health Related Factors
comment: 1 MD02464 2 measurement 3 None 4 measurement 5 122869004 6 Measurement 7 Measurement procedure (procedure) 8 Measurement 9 C0242485
comment: 1 MD02464-1 2 measurement 3 None 4 measurement 5 272391002 6 Measurement 7 Measurement technique (qualifier value) 8 Measurement 9 C0242485

meditation
type: Class
subclass of: Health Related Factors
comment: 1 MD01773 2 meditation 3 None 4 meditation 5 386365008 6 Meditation facilitation 7 Meditation facilitation (procedure) 8 Maditation 9 C0150277

mindfulness
type: Class
subclass of: Health Related Factors
comment: 1 MD01736 2 mindfulness 3 None 4 mindfulness 5 1259023009 6 Mindfulness Based Stress Reduction program 7 Mindfulness Based Stress Reduction program (regime/therapy) 8 Mindfulness 9 C3542996
comment: 1 MD01772 2 mindfulness 3 None 4 mindfulness 5 1259023009 6 Mindfulness Based Stress Reduction program 7 Mindfulness Based Stress Reduction program (regime/therapy) 8 Mindfulness 9 C3542996

move
type: Class
subclass of: Health Related Factors
comment: 1 MD03219 2 move 3 movement, Moves, moving 4 move 5 302000008 6 Moves 7 Does move (finding) 8 Does move 9 C0578671
comment: 1 MD03226 2 move 3 movement, Moves, moving 4 move 5 301999002 6 Able to move 7 Able to move (finding) 8 Able to move 9 C0578670

moving
type: Class
subclass of: Health Related Factors
comment: 1 MD02450 2 move 3 movement, Moves 4 moving 5 256235009 6 exercise 7 Exercise (observable entity) 8 exercise 9 C0015259

muscular
type: Class
subclass of: Health Related Factors
comment: 1 MD02865 2 muscular 3 None 4 muscular 5 263816006 6 Muscular 7 Muscular (qualifier value) 8 Muscular 9 C0442025

performing
type: Class
subclass of: Health Related Factors
comment: 1 MD02260 2 performing 3 None 4 performing 5 398166005 6 Performed 7 Performed (qualifier value) 8 Performed 9 C0884358

physical activity
type: Class
subclass of: Health Related Factors
comment: 1 MD00781 2 physical activity 3 None 4 physical activity 5 68130003 6 Physical activity 7 Physical activity (observable entity) 8 Physical activity 9 C0026606

pushing
type: Class
subclass of: Health Related Factors
comment: 1 MD03145 2 push 3 Pushing 4 pushing 5 303365000 6 Pushes 7 Does push (finding) 8 Pushing 9 C2584302

raise
type: Class
subclass of: Health Related Factors
comment: 1 MD02798 2 raise 3 None 4 raise 5 844005 6 behavior finding 7 Behavior finding (finding) 8 Behavior 9 C0004927
comment: 1 MD02806 2 raise 3 None 4 raise 5 844005 6 behavior finding 7 Behavior finding (finding) 8 Behavior 9 C0004927

realease
type: Class
subclass of: Health Related Factors
comment: 1 MD02759 2 release 3 realeasing 4 realease 5 115956009 6 release 7 Release (procedure) 8 Release (procedure) 9 C1963578

recovery
type: Class
subclass of: Health Related Factors
comment: 1 MD01515 2 recovery 3 None 4 recovery 5 74822006 6 Recovering from 7 Recovering from (contextual qualifier) (qualifier value) 8 Recovery - action 9 C0237820

reduction
type: Class
subclass of: Health Related Factors
comment: 1 MD00587 2 reduction 3 None 4 reduction 5 289928003 6 Reduction 7 Reduction plasty (qualifier value) 8 Surgical reduction 9 C4551656

repeat
type: Class
subclass of: Health Related Factors
comment: 1 MD02412 2 Repeat 3 None 4 repeat 5 27582007 6 Repeat 7 Repeat (qualifier value) 8 Repeat 9 C0205341

repetitions
type: Class
subclass of: Health Related Factors
comment: 1 MD01118 2 repetition 3 None 4 repetitions 5 27582007 6 repetition of 7 Repeat (qualifier value) 8 repeat 9 C0205341

replacement
type: Class
subclass of: Health Related Factors
comment: 1 MD04469 2 replacement 3 None 4 replacement 5 282089006 6 Replacement 7 Replacement - action (qualifier value) 8 Replacement 9 C0035139
comment: 1 MD04469-1 2 replacement 3 None 4 replacement 5 282089006 6 Replacement 7 Replacement - action (qualifier value) 8 Replacement 9 C0559956
comment: 1 MD04469-2 2 replacement 3 None 4 replacement 5 373188003 6 Replacement 7 Replacement procedure (procedure) 8 Replacement 9 C0035139
comment: 1 MD04469-3 2 replacement 3 None 4 replacement 5 373188003 6 Replacement 7 Replacement procedure (procedure) 8 Replacement 9 C0559956

resistance
type: Class
subclass of: Health Related Factors
comment: 1 MD01120 2 resistance 3 None 4 resistance 5 30714006 6 Resistant 7 Resistant (qualifier value) 8 Resistance 9 C1442099

rest
type: Class
subclass of: Health Related Factors
comment: 1 MD01517 2 rest 3 resting 4 rest 5 258157001 6 Rest 7 Rest (observable entity) 8 Rest 9 C0035253

resting
type: Class
subclass of: Health Related Factors
comment: 1 MD01775 2 rest 3 None 4 resting 5 258157001 6 Rest 7 Rest (observable entity) 8 Rest 9 C0035253 1 MD02407 2 rest 3 None 4 resting 5 258157001 6 rest 7 Rest (observable entity) 8 rest 9 C0035253

restoration
type: Class
subclass of: Health Related Factors
comment: 1 MD02920 2 restoration 3 None 4 restoration 5 260938008 6 Restoration 7 Type of restoration (attribute) 8 Restoration 9 C0449982

ride
type: Class
subclass of: Health Related Factors
comment: 1 MD02406 2 ride 3 None 4 ride 5 256235009 6 Exercise 7 Exercise (observable entity) 8 Exercise 9 C0015259
comment: 1 MD02801 2 ride 3 None 4 ride 5 844005 6 behavior finding 7 Behavior finding (finding) 8 Behavior 9 C0004927

roll dowm
type: Class
subclass of: Health Related Factors
comment: 1 MD02762 2 roll dowm 3 None 4 roll dowm 5 256235009 6 Exercise 7 Exercise (observable entity) 8 Exercise 9 C0015259

roll up
type: Class
subclass of: Health Related Factors
comment: 1 MD02761 2 roll up 3 None 4 roll up 5 256235009 6 Exercise 7 Exercise (observable entity) 8 Exercise 9 C0015259

rolls
type: Class
subclass of: Health Related Factors
comment: 1 MD02778 2 rolls 3 None 4 rolls 5 282622001 6 does roll 7 Does roll (finding) 8 Does roll 9 C0560470

side step
type: Class
subclass of: Health Related Factors
comment: 1 MD02737 2 sit and reach 3 None 4 sit and reach 5 256235009 6 Exercise 7 Exercise (observable entity) 8 Exercise 9 C0015259

sit
type: Class
subclass of: Health Related Factors
comment: 1 MD02876 2 sit 3 None 4 sit 5 33586001 6 sitting 7 Sitting position (finding) 8 Sitting position 9 C0277814
comment: 1 MD03108 2 sit 3 None 4 sit 5 282967005 6 Sits 7 Does sit (finding) 8 Does sit 9 C0728713

sit and reach
type: Class
subclass of: Health Related Factors
comment: 1 MD02737 2 sit and reach 3 None 4 sit and reach 5 256235009 6 Exercise 7 Exercise (observable entity) 8 Exercise 9 C0015259

sitting
type: Class
subclass of: Health Related Factors
comment: 1 MD03230 2 Sitting 3 None 4 sitting 5 33586001 6 Sitting 7 Sitting position (finding) 8 Sitting 9 C0277814
comment: 1 MD03230-1 2 Sitting 3 None 4 sitting 5 33586001 6 Sitting 7 Sitting position (finding) 8 Sitting 9 C2584297

spin
type: Class
subclass of: Health Related Factors
comment: 1 MD02788 2 spin 3 Spinning 4 spin 5 844005 6 behavior finding 7 Behavior finding (finding) 8 Behavior 9 C0004927

spoke less
type: Class
subclass of: Health Related Factors
comment: 1 MD02228 2 spoke less 3 None 4 spoke less 5 286370002 6 speak 7 Does speak (finding) 8 Speak - language ability 9 C1547187

stand
type: Class
subclass of: Health Related Factors
comment: 1 MD03109 2 Standing 3 None 4 stand 5 706479008 6 Stand 7 Stand (physical object) 8 Stand 9 C3888057

stand up
type: Class
subclass of: Health Related Factors
comment: 1 MD02371 2 Standing up 3 None 4 stand up 5 258148007 6 Standing up 7 Standing up (observable entity) 8 standing up 9 C0444796
comment: 1 MD03229 2 Standing up 3 None 4 stand up 5 258148007 6 Stands up 7 Standing up (observable entity) 8 Does stand up 9 C0600132
comment: 1 MD03934 2 Standing up 3 None 4 stand up 5 282873007 6 stands up 7 Does stand up (finding) 8 Does stand up 9 C0600132

stand up from sitting
type: Class
subclass of: Health Related Factors
comment: 1 MD03772 2 Stand up from sitting 3 None 4 stand up from sitting 5 282830003 6 Ability to control position (observable entity) 7 Ability to control position (observable entity) 8 Ability to control position 9 C0560751

stand up paddleboarding
type: Class
subclass of: Health Related Factors
comment: 1 MD02370 2 stand up paddleboarding 3 Stand-up paddleboarding 4 stand up paddleboarding 5 415577004 6 sports 7 Sport (qualifier value) 8 spors 9 C0038039

standing
type: Class
subclass of: Health Related Factors
comment: 1 MD01498 2 Standing 3 stand 4 standing 5 10904000 6 Standing 7 Orthostatic body position (finding) 8 Standing position 9 C0231472

standing high jump
type: Class
subclass of: Health Related Factors
comment: 1 MD02751 2 standing high jump 3 None 4 standing high jump 5 9251003 6 jumping 7 Jumping (observable entity) 8 Jumping 9 C0221189

strength
type: Class
subclass of: Health Related Factors
comment: 1 MD02360 2 Strength 3 None 4 strength 5 411117005 6 Has strength 7 Has strength (attribute) 8 Has strength 9 C1445096
comment: 1 MD02869 2 Strength 3 None 4 strength 5 271708004 6 muscle power 7 Finding of power of skeletal muscle (finding) 8 Muscle power functions 9 C2371225

supination
type: Class
subclass of: Health Related Factors
comment: 1 MD02621 2 Supinaion 3 None 4 supination 5 14502000 6 supination 7 Supination, function (observable entity) 8 Supination 9 C0038845

survey
type: Class
subclass of: Health Related Factors
comment: 1 MD04413 2 Survey 3 None 4 survey 5 311791003 6 Information gathering 7 Information gathering (procedure) 8 Information 9 C1533716

theorem
type: Class
subclass of: Health Related Factors
comment: 1 MD02851 2 theorem 3 None 4 theorem 5 22602900 6 Exercises 7 Exercises (regime/therapy) 8 Exercise 9 C0015260

use a knife to cut food
type: Class
subclass of: Health Related Factors
comment: 1 MD04226 2 use a knife to cut food 3 None 4 use a knife to cut food 5 37284003 6 Cuts up food 7 Bag, device (physical object) 8 Cut-up food 9 C0453849

using the inhaler
type: Class
subclass of: Health Related Factors
comment: 1 MD01588 2 using the inhaler 3 None 4 using the inhaler 5 704098003 6 Uses inhaler device 7 Uses inhaler device (finding) 8 Uses inhaler device 9 C3875293

walk
type: Class
subclass of: Health Related Factors
comment: 1 MD03094 2 Walk 3 walking 4 walk 5 282146009 6 Walks 7 Does walk (finding) 8 Does walk 9 C0600108
comment: 1 MD03102 2 Walk 3 walking 4 walk 5 282146009 6 Walks 7 Does walk (finding) 8 Does walk 9 C0600108

walking training
type: Class
subclass of: Health Related Factors
comment: 1 MD04336 2 walking training 3 None 4 walking training 5 359665005 6 Ambulation training 7 Ambulation training (procedure) 8 Ambulation training 9 C1276390

wearing
type: Class
subclass of: Health Related Factors
comment: 1 MD04456 2 Wearing 3 weariness 4 wearing 5 129003000 6 Dressing 7 Dressing (observable entity) 8 Dressing- activity of daily living 9 C1305428

wheelchair travel
type: Class
subclass of: Health Related Factors
comment: 1 MD01654 2 wheelchair travel 3 None 4 wheelchair travel 5 129015001 6 Using wheelchair 7 Using wheelchair (observable entity) 8 Using wheelchair 9 C1290943

woke up
type: Class
subclass of: Health Related Factors
comment: 1 MD02179 2 wake up 3 woke up 4 woke up 5 713822005 6 Wakes up during night 7 Wakes up during night (finding) 8 Wake Ups 9 C1170730

work
type: Class
subclass of: Health Related Factors
comment: 1 MD02263 2 work 3 None 4 work 5 261041009 6 Working 7 Working, function (observable entity) 8 Work 9 C0043227

workout
type: Class
subclass of: Health Related Factors
comment: 1 MD01116 2 WORKOUTS 3 None 4 workout 5 256235009 6 Exercise 7 Exercise (observable entity) 8 Exercise 9 C0015259

Ability to find a central position (seated)
type: Class
subclass of: Health Related Factors
comment: 1 MD03222 2 Ability to find a central position (seated) 3 None 4 Ability to find a central position (seated) 5 282830003 6 Ability to control position 7 Ability to control position (observable entity) 8 Ability to control position 9 C0560751

Ability to find a central position (standing)
type: Class
subclass of: Health Related Factors
comment: 1 MD03236 2 Ability to find a central position (standing) 3 None 4 Ability to find a central position (standing) 5 282830003 6 Ability to control position 7 Ability to control position (observable entity) 8 Ability to control position 9 C0560751

Ability to find correct posture (from a sitting position)
type: Class
subclass of: Health Related Factors
comment: 1 MD03770 2 Ability to find correct posture (from a sitting position) 3 None 4 Ability to find correct posture (from a sitting position) 5 282830003 6 Ability to control position (observable entity) 7 Ability to control position (observable entity) 8 Ability to control position 9 C0560751

Ability to find correct posture (while standing)
type: Class
subclass of: Health Related Factors
comment: 1 MD03774 2 Ability to find correct posture (while standing) 3 None 4 Ability to find correct posture (while standing) 5 249868004 6 Ability to maintain a position 7 Ability to maintain a position (observable entity) 8 Ability to maintain a position 9 C0555084

Ability to move L/R (seated)
type: Class
subclass of: Health Related Factors
comment: 1 MD03218 2 Ability to move L/R (seated) 3 None 4 Ability to move L/R (seated) 5 301998005 6 Ability to move 7 Ability to move (observable entity) 8 Ability to move 9 C0344382

Ability to move L/R (standing)
type: Class
subclass of: Health Related Factors
comment: 1 MD03231 2 Ability to move L/R (standing) 3 None 4 Ability to move L/R (standing) 5 301998005 6 Ability to move 7 Ability to move (observable entity) 8 Ability to move 9 C0344382

Ability to move forward (from standing position)
type: Class
subclass of: Health Related Factors
comment: 1 MD03775 2 Ability to move forward (from standing position) 3 None 4 Ability to move forward (from standing position) 5 301998005 6 Ability to move (observable entity) 7 Ability to move (observable entity) 8 Ability to move 9 C0344382

Ability to move forward (seated)
type: Class
subclass of: Health Related Factors
comment: 1 MD03225 2 Ability to move forward (seated) 3 None 4 Ability to move forward (seated) 5 301998005 6 Ability to move 7 Ability to move (observable entity) 8 Ability to move 9 C0344382

Ability to move forward (standing)
type: Class
subclass of: Health Related Factors
comment: 1 MD03240 2 Ability to move forward (standing) 3 None 4 Ability to move forward (standing) 5 10904000 6 standing 7 Orthostatic body position (finding) 8 standing up 9 C0444796

Ability to move left and right (from a sitting position)
type: Class
subclass of: Health Related Factors
comment: 1 MD03930 2 Ability to move left and right (from a sitting position) 3 None 4 Ability to move left and right (from a sitting position) 5 301998005 6 Ability to move (observable entity) 7 Ability to move (observable entity) 8 Ability to move 9 C0344382

Ability to move left and right (while standing)
type: Class
subclass of: Health Related Factors
comment: 1 MD03773 2 Ability to move left and right (while standing) 3 None 4 Ability to move left and right (while standing) 5 301998005 6 Ability to move (observable entity) 7 Ability to move (observable entity) 8 Ability to move 9 C0344382

Forward movement ability (from sitting position)
type: Class
subclass of: Health Related Factors
comment: 1 MD03771 2 Forward movement ability (from sitting position) 3 None 4 Forward movement ability (from sitting position) 5 301998005 6 Ability to move (observable entity) 7 Ability to move (observable entity) 8 Ability to move 9 C0344382

roll up & roll down
type: Class
subclass of: Health Related Factors
comment: 1 MD02760 2 roll up & roll down 3 None 4 roll up & roll down 5 256235009 6 Exercise 7 Exercise (observable entity) 8 Exercise 9 C0015259

Thing
comment: 1 MELLO-D ID 2 Preferred Term 3 synonym 4 MELLO-D Term 5 SNOMED-CT SCTID 6 SNOMED-CT Term 7 SNOMED-CT FSN 8 ULMS STR 9 ULMS CUI