ABNORM REFLEX
type: Class
subclass of: Musculoskeletal function (Symptom)
comment: 1 M01309 2 ABNORM REFLEX 3 ABNORM REFLEXES 4 ABNORM REFLEX 5 46670006 6 Abnormal reflex 7 Abnormal reflex (finding) 8 Abnormal reflex 9 C0034933
alternative label: ABNORM REFLEXES

ABO blood type
type: Class
subclass of: Functions of Blood System, Metabolic system and Endocrine system (Body measurement)
comment: 1 MD00878 2 ABO blood type 3 None 4 ABO blood type 5 250378007 6 ABO antigen type 7 ABO antigen type determination (procedure) 8 ABO blood grouping 9 C0200499

AG Ratio
type: Class
subclass of: Functions of Blood System, Metabolic system and Endocrine system (Body measurement)
comment: 1 MD03025 2 AG Ratio 3 None 4 AG Ratio 5 687005 6 Albumin/Globulin ratio 7 Albumin/Globulin ratio (procedure) 8 Albumin/Globulin ratio (procedure) 9 C0201837

ALanine Transaminase
type: Class
subclass of: Functions of Blood System, Metabolic system and Endocrine system (Body measurement)
comment: 1 MD03070 2 ALanine Transaminase 3 Alanine Transaminase(aminoTransferase)(=SGPT), alanine transaminase and Serum Glutamic Pyruvic Transaminase, ALT (SGPT) 4 ALanine Transaminase 5 56935002 6 Alanine transaminase 7 Alanine aminotransferase (substance) 8 Alanine transaminase 9 C0001899
alternative label: alanine transaminase and Serum Glutamic Pyruvic Transaminase
alternative label: Alanine Transaminase(aminoTransferase)(=SGPT)
alternative label: Serum Glutamate Pyruvate Transaminase

AMP score
type: Class
subclass of: Units
comment: 1 MD04748 2 AMP score 3 None 4 AMP score 5 246262008 6 Score 7 Score (attribute) 8 Score 9 C0449820

APPFUL
type: Class
subclass of: Units
comment: 1 M05701 2 APPFUL 3 None 4 APPFUL 5 1651000175105 6 Applicatorful 7 Applicatorful - unit of product usage (qualifier value) 8 Applicatorful Dosing Unit 9 C2698173

AP - Abdominal pain
type: Class
subclass of: Hospital information, examination/diagnosis/treatment data
comment: 1 M00652 2 AP - Abdominal pain 3 Abdomen pain Abdominal Pains 4 AP - Abdominal pain 5 21522001 6 AP - Abdominal pain 7 Abdominal pain (finding) 8 Abdominal Pain 9 C0000737

ARNOLD PRESS
type: Class
subclass of: Health Related Factors
comment: 1 MD02008 2 ARNOLD PRESS 3 None 4 ARNOLD PRESS 5 183301007 6 Physical exercises 7 Physical exercises (regime/therapy) 8 Physical therapy exercises 9 C0452240

ARTERIAL BLOOD PRESSURE DECREASED
type: Class
subclass of: Cardiovascular system function (Symptom)
comment: 1 M01180 2 ARTERIAL BLOOD PRESSURE DECREASED 3 PRESSURE ARTERIAL DECREASED 4 ARTERIAL BLOOD PRESSURE DECREASED 5 386534000 6 Arterial blood pressure 7 Arterial blood pressure (observable entity) 8 Taking arterial blood pressure 9 C0684223
alternative label: PRESSURE ARTERIAL DECREASED

ASpartate Transaminase
type: Class
subclass of: Functions of Blood System, Metabolic system and Endocrine system (Body measurement)
comment: 1 MD03069 2 ASpartate Transaminase 3 Aspartate Transaminase(aminoTransferase)(=SGOT), Serum Glutamic Oxaloacetic Transaminase, AST (SGOT), AST(SGOT) 4 ASpartate Transaminase 5 26091008 6 Aspartate transaminase 7 Aspartate aminotransferase (substance) 8 Aspartate transaminase 9 C0004002
alternative label: Serum Glutamic Oxaloacetic Transaminase
alternative label: AST(SGOT)
alternative label: Aspartate Transaminase(aminoTransferase)(=SGOT)

ATM
type: Class
subclass of: Equipment
comment: 1 MD05430 2 ATM 3 None 4 ATM 5 61284002 6 Machine 7 Machine, device (physical object) 8 Machine 9 C0336779

AV
type: Class
subclass of: Units
comment: 1 M05320 2 AV 3 None 4 AV 5 767525000 6 unit 7 Unit (qualifier value) 8 Unit 9 C0439180

AVG.POWER
type: Class
subclass of: Units
comment: 1 MD03127 2 AVG.POWER 3 None 4 AVG.POWER 5 272080004 6 Unit of power 7 Unit of power (qualifier value) 8 Unit of power 9 C0439260

A - ampere
type: Class
subclass of: Units
comment: 1 M03087 2 A - ampere 3 None 4 A - ampere 5 278078000 6 A - ampere 7 Ampere (qualifier value) 8 A - ampere 9 C0457243

Abdmnal pain unspcf site
type: Class
subclass of: Hospital information, examination/diagnosis/treatment data
comment: 1 M00655 2 Abdmnal pain unspcf site 3 None 4 Abdmnal pain unspcf site 5 21522001 6 AP - Abdominal pain 7 Abdominal pain (finding) 8 Abdominal pain, other specified site 9 C0375555

Abdominal back
type: Class
subclass of: Musculoskeletal function (Body region)
comment: 1 M01906 2 Abdominal back 3 Back of abdomen, abdomen back 4 Abdominal back 5 77568009 6 Back structure 7 Structure of back of trunk (body structure) 8 Lumbar Region 9 C0024090
alternative label: Back of abdomen
alternative label: abdomen back

Abdominal esophagus structure
type: Class
subclass of: Digestive function (Body region)
comment: 1 M01153 2 Abdominal esophagus structure 3 Abdominal esophagus, Abdominal part of esophagus, Abdominal part of oesophagus, Pars abdominalis oesophageae 4 Abdominal esophagus structure 5 60865004 6 Abdominal esophagus structure 7 Abdominal esophagus structure (body structure) 8 Abdominal esophagus structure 9 C0227190
alternative label: Abdominal part of esophagus
alternative label: Pars abdominalis oesophageae
alternative label: Abdominal esophagus

Abdominal exercises
type: Class
subclass of: trunk
comment: 1 M00316 2 Abdominal exercises 3 abdominal exercise, abdominals exercises, abdominals exercise 4 Abdominal exercises 5 229144001 6 Abdominal exercises 7 Abdominal exercises (regime/therapy) 8 Abdominal exercises 9 C0454354
alternative label: abdominals exercise
alternative label: abdominal exercise
alternative label: abdominals exercises

Abdominal exercises in water
type: Class
subclass of: Active exercise
comment: 1 M00317 2 Abdominal exercises in water 3 None 4 Abdominal exercises in water 5 229185006 6 Abdominal exercises in water 7 Abdominal exercises in water (regime/therapy) 8 Abdominal exercises in water 9 C0454394

Abdominal lump
type: Class
subclass of: Hospital information, examination/diagnosis/treatment data
comment: 1 M00638 2 Abdominal lump 3 abdomen lumps abdominal lumps lump abdomen lump abdominal 4 Abdominal lump 5 271860006 6 Abdominal lump 7 Abdominal mass (finding) 8 Abdominal lump 9 C0000736
alternative label: abdominal lumps
alternative label: lump abdomen
alternative label: abdomen lumps
alternative label: lump abdominal

Abdominal mass
type: Class
subclass of: Hospital information, examination/diagnosis/treatment data
comment: 1 M00635 2 Abdominal mass 3 mass abdominal abdominal masses abdomen masses abdomen mass mass abdomen mass in abdomen 4 Abdominal mass 5 271860004 6 Abdominal mass 7 Abdominal mass (finding) 8 Abdominal mass 9 C0000734
alternative label: abdomen masses
alternative label: abdominal masses
alternative label: mass abdomen
alternative label: abdomen mass
alternative label: mass abdominal
alternative label: mass in abdomen

Abdominal pain
type: Class
subclass of: Hospital information, examination/diagnosis/treatment data
comment: 1 M00473 2 Abdominal pain 3 Abdominal Pains AP - Abdominal pain 4 Abdominal pain 5 21522001 6 Abdominal pain 7 Abdominal pain (finding) 8 Abdominal pain 9 C0000737
alternative label: Abdominal Pains
alternative label: Abdomen pain

Abdominal part of oesophagus
type: Class
subclass of: Digestive function (Body region)
comment: 1 M01134 2 Abdominal part of oesophagus 3 None 4 Abdominal part of oesophagus 5 245407007 6 Entire abdominal oesophagus 7 Entire abdominal esophagus (body structure) 8 Abdominal part of esophagus 9 C0227190

Abdominal swelling
type: Class
subclass of: Hospital information, examination/diagnosis/treatment data
comment: 1 M00474 2 Abdominal swelling 3 abdominal swellings 4 Abdominal swelling 5 60728008 6 Abdominal swelling 7 Swollen abdomen (finding) 8 Abdominal swelling 9 C0000731
alternative label: abdominal swellings

Ability to perform
type: Class
subclass of: Units
comment: 1 MD00954 2 Ability to perform 3 None 4 Ability to perform 5 398298007 6 step 7 Step (qualifier value) 8 number of steps 9 C1651669

Ability to walk
type: Class
subclass of: Health Related Factors
comment: 1 MD02711 2 Ability to walk 3 None 4 Ability to walk 5 282097004 6 Ability to walk 7 Ability to walk (observable entity) 8 Ability to walk 9 C0559964

Abnormal Bleeding
type: Class
subclass of: Urogenital function (Symptom)
comment: 1 MD00788 2 Abnormal Bleeding 3 None 4 Abnormal Bleeding 5 44991000119100 6 Abnormal uterine bleeding 7 Abnormal uterine bleeding (disorder) 8 Abnormal uterine bleeding 9 C3650625

Abnormal ankle pulse
type: Class
subclass of: Cardiovascular system function (Body measurement)
comment: 1 M01923 2 Abnormal ankle pulse 3 None 4 Abnormal ankle pulse 5 45186007 6 Abnormal ankle pulse 7 Abnormal ankle pulse (finding) 8 Abnormal ankle pulse 9 C0232156

Abnormal blood pressure
type: Class
subclass of: Cardiovascular system function (Symptom)
comment: 1 M00125 2 Abnormal blood pressure 3 abnormal blood pressures, Labile blood pressure, blood pressure abnormal 4 Abnormal blood pressure 5 38936003 6 Abnormal blood pressure 7 Abnormal blood pressure (finding) 8 Abnormal blood pressure 9 C0005826
alternative label: abnormal blood pressures
alternative label: blood pressure abnormal
alternative label: Labile blood pressure

Abnormal body temperature
type: Class
subclass of: Sensory function, Pain and Skin function (Symptom)
comment: 1 M00151 2 Abnormal body temperature 3 abnormal body temperatures 4 Abnormal body temperature 5 123979008 6 Abnormal body temperature 7 Abnormal body temperature (finding) 8 Abnormal body temperature 9 C1290981
alternative label: abnormal body temperatures

Abnormal central venous pressure
type: Class
subclass of: Cardiovascular system function (Symptom)
comment: 1 M00132 2 Abnormal central venous pressure 3 None 4 Abnormal central venous pressure 5 70679005 6 Abnormal central venous pressure 7 Abnormal central venous pressure (finding) 8 Abnormal central venous pressure 9 C0277895

Abnormal central venous pulse pressure
type: Class
subclass of: Cardiovascular system function (Symptom)
comment: 1 M02075 2 Abnormal central venous pulse pressure 3 None 4 Abnormal central venous pulse pressure 5 70679005 6 abnormal central venous pressure 7 Abnormal central venous pressure (finding) 8 Abnormal central venous pressure 9 C0277895

Abnormal coordination
type: Class
subclass of: Nervous system and Mental function (Symptom)
comment: 1 M02565 2 Abnormal coordination 3 None 4 Abnormal coordination 5 302289002 6 Abnormal coordination 7 Coordination problem (finding) 8 Abnormal coordination 9 C0520966

Abnormal glucose
type: Class
subclass of: Functions of Blood System, Metabolic system and Endocrine system (Symptom)
comment: 1 M02658 2 Abnormal glucose 3 None 4 Abnormal glucose 5 166922008 6 Blood glucose abnormal 7 Blood glucose outside reference range (finding) 8 Blood glucose abnormal 9 C0580546

Abnormal hair growth
type: Class
subclass of: Sensory function, Pain and Skin function (Symptom)
comment: 1 M00535 2 Abnormal hair growth 3 hair abnormal growth 4 Abnormal hair growth 5 85305001 6 Abnormal hair growth 7 Abnormal hair growth (finding) 8 Abnormal hair growth 9 C0232409
alternative label: hair abnormal growth

Abnormal heart rate
type: Class
subclass of: Cardiovascular system function (Symptom)
comment: 1 M00178 2 Abnormal heart rate 3 Abnormal heart beat, abnormal beats heart, Abnormal cardiac rate, heart rate abnormal 4 Abnormal heart rate 5 361136003 6 Abnormal heart beat 7 Abnormal heart beat (finding) 8 Abnormal heart beat 9 C1744601
alternative label: abnormal beats heart
alternative label: Body temperature above reference range
alternative label: Abnormal cardiac rate
alternative label: Abnormal heart beat

Abnormal loss of weight
type: Class
subclass of: Functions of Blood System, Metabolic system and Endocrine system (Symptom)
comment: 1 M01608 2 Abnormal loss of weight 3 None 4 Abnormal loss of weight 5 816160009 6 Weight loss 7 Measured weight loss (observable entity) 8 Abnormal weight loss (finding 9 C0936227

Abnormal movements of the abdomen and pelvis are observed at the beginning stage of evaluation using biofeedback after abdominal contraction.
type: Class
subclass of: Questionnaire
comment: 1 MD04291 2 Abnormal movements of the abdomen and pelvis are observed at the beginning stage of evaluation using biofeedback after abdominal contraction. 3 None 4 Abnormal movements of the abdomen and pelvis are observed at the beginning stage of evaluation using biofeedback after abdominal contraction. 5 273389003 6 Daily activities questionnaire 7 Daily activities questionnaire (assessment scale) 8 Daily activities questionnaire 9 C0451094

Abnormal movements of the abdomen and pelvis were observed during the evaluation using Biofeedback after abdominal contraction while bending the hip joint 90 degrees for 5 seconds.
type: Class
subclass of: Questionnaire
comment: 1 MD04293 2 Abnormal movements of the abdomen and pelvis were observed during the evaluation using Biofeedback after abdominal contraction while bending the hip joint 90 degrees for 5 seconds. 3 None 4 Abnormal movements of the abdomen and pelvis were observed during the evaluation using Biofeedback after abdominal contraction while bending the hip joint 90 degrees for 5 seconds. 5 273389003 6 Daily activities questionnaire 7 Daily activities questionnaire (assessment scale) 8 Daily activities questionnaire 9 C0451094

Abnormal peripheral pulse
type: Class
subclass of: Cardiovascular system function (Symptom)
comment: 1 M00207 2 Abnormal peripheral pulse 3 None 4 Abnormal peripheral pulse 5 73155008 6 Abnormal peripheral pulse 7 Abnormal peripheral pulse (finding) 8 Abnormal peripheral pulse 9 C0232141

Abnormal pulse
type: Class
subclass of: Cardiovascular system function (Symptom)
comment: 1 M00182 2 Abnormal pulse 3 None 4 Abnormal pulse 5 67683007 6 Abnormal pulse 7 Abnormal pulse (finding) 8 Abnormal pulse 9 C0235472

Abnormal radial pulse
type: Class
subclass of: Cardiovascular system function (Symptom)
comment: 1 M00217 2 Abnormal radial pulse 3 None 4 Abnormal radial pulse 5 39435002 6 Abnormal radial pulse 7 Abnormal radial pulse (finding) 8 Abnormal radial pulse 9 C0232144

Abnormal reflex
type: Class
subclass of: Cardiovascular system function (Symptom)
comment: 1 M01311 2 Abnormal reflex 3 Abnormal reflexes 4 Abnormal reflex 5 46670006 6 Abnormal reflex 7 Abnormal reflex (finding) 8 Abnormal reflex 9 C0034933
alternative label: Abnormal reflexes

Abnormal respiratory rate
type: Class
subclass of: Digestive function (Symptom)
comment: 1 M00222 2 Abnormal respiratory rate 3 None 4 Abnormal respiratory rate 5 17077006 6 Abnormal respiratory rate 7 Abnormal respiratory rate (finding) 8 Abnormal respiratory rate 9 C0231834

Abnormalities
type: Class
subclass of: Hospital information, examination/diagnosis/treatment data
comment: 1 MD00392 2 Abnormalities 3 None 4 Abnormalities 5 263654008 6 Abnormal 7 Abnormal (qualifier value) 8 Abnormality 9 C1704258

Above
type: Class
subclass of: Units
comment: 1 MD01746 2 Above 3 None 4 Above 5 352730000 6 Above 7 Supra- (qualifier value) 8 Upper 9 C1282910

Absence of hair - failure to grow
type: Class
subclass of: Sensory function, Pain and Skin function (Symptom)
comment: 1 M01951 2 Absence of hair - failure to grow 3 None 4 Absence of hair - failure to grow 5 399018006 6 Absence of hair - failure to grow 7 Absence of hair - failure to grow (finding) 8 Absence of hair - failure to grow 9 C0232412

Absent hair growth
type: Class
subclass of: Sensory function, Pain and Skin function (Symptom)
comment: 1 M01949 2 Absent hair growth 3 None 4 Absent hair growth 5 85305001 6 abnormal hair growth 7 Abnormal hair growth (finding) 8 Abnormal hair growth 9 C0232409

Absent peripheral pulses
type: Class
subclass of: Cardiovascular system function (Symptom)
comment: 1 M02649 2 Absent peripheral pulses 3 None 4 Absent peripheral pulses 5 297210000 6 Peripheral pulses impalpable 7 Peripheral pulses impalpable (finding) 8 Peripheral pulse absent 9 C0577850

Absent pulse
type: Class
subclass of: Cardiovascular system function (Symptom)
comment: 1 M00183 2 Absent pulse 3 None 4 Absent pulse 5 54518005 6 Absent pulse 7 Absent pulse (finding) 8 Absent pulse 9 C0277899

Absorbance Unit
type: Class
subclass of: Units
comment: 1 M03529 2 Absorbance Unit 3 None 4 Absorbance Unit 5 118289000 6 Absorbance 7 Optical density (observable entity) 8 Absorbance Unit 9 C2346712

Absorbance Unit per Minute
type: Class
subclass of: Units
comment: 1 M05451 2 Absorbance Unit per Minute 3 None 4 Absorbance Unit per Minute 5 767525000 6 unit 7 Unit (qualifier value) 8 Unit 9 C0439189

Absorbance Units per Minute
type: Class
subclass of: Units
comment: 1 M05450 2 Absorbance Units per Minute 3 None 4 Absorbance Units per Minute 5 767525000 6 unit 7 Unit (qualifier value) 8 Unit 9 C0439189

Absorption of nutrients
type: Class
subclass of: Digestive function (Body measurement)
comment: 1 MD05927 2 Absorption of nutrients 3 None 4 Absorption of nutrients 5 38597004 6 Intestinal absorption 7 Intestinal absorption, function (observable entity) 8 Absorption of nutrients 9 C1961155

Abstinent
type: Class
subclass of: Health Related Factors
comment: 1 M02465 2 Abstinent 3 None 4 Abstinent 5 105542008 6 Abstinent 7 Current non-drinker of alcohol (finding) 8 Abstinent alcoholic 9 C0577647

Abstraction
type: Class
subclass of: Nervous system and Mental function (Body measurement)
comment: 1 MD05688 2 Abstraction 3 None 4 Abstraction 5 285246007 6 Selective abstraction 7 Selective abstraction (finding) 8 Abstraction 9 C0679195

Acceleration Time
type: Class
subclass of: Time
comment: 1 MD03130 2 Acceleration Time 3 None 4 Acceleration Time 5 410669006 6 Time 7 Time (property) (qualifier value) 8 Time 9 C0040224

Accidental drowning and submersion while engaged in sport or recreational activity with diving equipment
type: Class
subclass of: Individual Related Factors
comment: 1 M02217 2 Accidental drowning and submersion while engaged in other sport or recreational activity with diving equipment 3 None 4 Accidental drowning and submersion while engaged in other sport or recreational activity with diving equipment 5 217750008 6 Accidental drowning and submersion while engaged in other sport or recreational activity with diving equipment 7 Accidental drowning and submersion while engaged in sport or recreational activity with diving equipment (event) 8 Accidental drowning and submersion while engaged in other sport or recreational activity with diving equipment 9 C0417794
comment: Lifestyle Individual Related Factors None 1 M02216 2 Accidental drowning and submersion while engaged in sport or recreational activity with diving equipment 3 None 4 Accidental drowning and submersion while engaged in sport or recreational activity with diving equipment 5 217750008 6 Accidental drowning and submersion while engaged in sport or recreational activity with diving equipment 7 Accidental drowning and submersion while engaged in sport or recreational activity with diving equipment (event) 8 Accidental drowning and submersion while engaged in sport or recreational activity with diving equipment 9 C0417794

Accidental drowning and submersion whilst engaged in other sport or recreational activity with diving equipment
type: Class
subclass of: Individual Related Factors
comment: 1 M02218 2 Accidental drowning and submersion whilst engaged in other sport or recreational activity with diving equipment 3 None 4 Accidental drowning and submersion whilst engaged in other sport or recreational activity with diving equipment 5 217750008 6 Accidental drowning and submersion whilst engaged in other sport or recreational activity with diving equipment 7 Accidental drowning and submersion while engaged in sport or recreational activity with diving equipment (event) 8 Accidental drowning and submersion whilst engaged in other sport or recreational activity with diving equipment 9 C0417794

Accidental drowning and submersion whilst engaged in sport or recreational activity with diving equipment
type: Class
subclass of: Individual Related Factors
comment: 1 M02219 2 Accidental drowning and submersion whilst engaged in sport or recreational activity with diving equipment 3 None 4 Accidental drowning and submersion whilst engaged in sport or recreational activity with diving equipment 5 217750008 6 Accidental drowning and submersion whilst engaged in sport or recreational activity with diving equipment 7 Accidental drowning and submersion while engaged in sport or recreational activity with diving equipment (event) 8 Accidental drowning and submersion whilst engaged in sport or recreational activity with diving equipment 9 C0417794

Accupedo Pedometer
type: Class
subclass of: Units
comment: 1 M05728 2 Accupedo Pedometer 3 None 4 Accupedo Pedometer 5 413568008 6 Application - unit of product usage (qualifier value) 7 Application - unit of product usage (qualifier value) 8 Application dose 9 C1533134

Achondroplasia
type: Class
subclass of: Musculoskeletal function (Symptom)
comment: 1 MD00378 2 Achondroplasia 3 None 4 Achondroplasia 5 86268005 6 Achondroplasia 7 Achondroplasia (disorder) 8 Achondroplasia 9 C0001080

Acquired deficiency
type: Class
subclass of: Disorder of nutrition
comment: 1 M00468 2 Acquired deficiency 3 None 4 Acquired deficiency 5 102635008 6 Acute nutritional deficiency 7 Acute nutritional deficiency (finding) 8 Acute deficiency state 9 C0522074

Acquired epidermolysis bullosa
type: Class
subclass of: Sensory function, Pain and Skin function (Symptom)
comment: 1 MD00430 2 Acquired epidermolysis bullosa 3 None 4 Acquired epidermolysis bullosa 5 2772003 6 Acquired epidermolysis bullosa 7 Acquired epidermolysis bullosa (disorder) 8 Other acquired epidermolysis bullosa 9 C2888145

Acquiring a place to live
type: Class
subclass of: Health Related Factors
comment: 1 MD06411 2 Acquiring a place to live 3 None 4 Acquiring a place to live 5 264362003 6 Home 7 Home (environment) 8 Acquiring a place to live 9 C2371482

Acquiring additional language
type: Class
subclass of: Health Related Factors
comment: 1 MD06137 2 Acquiring additional language 3 None 4 Acquiring additional language 5 844005 6 Behavior finding 7 Behavior finding (finding) 8 Acquiring additional language 9 C2371980

Acquiring basic concepts
type: Class
subclass of: Health Related Factors
comment: 1 MD06140 2 Acquiring basic concepts 3 None 4 Acquiring basic concepts 5 844005 6 Behavior finding 7 Behavior finding (finding) 8 Acquiring basic concepts 9 C2371982

Acquiring basic skills
type: Class
subclass of: Health Related Factors
comment: 1 MD06164 2 Acquiring basic skills 3 None 4 Acquiring basic skills 5 844005 6 Behavior finding 7 Behavior finding (finding) 8 Acquiring basic skills 9 C2371292

Acquiring complex concepts
type: Class
subclass of: Health Related Factors
comment: 1 MD06141 2 Acquiring complex concepts 3 None 4 Acquiring complex concepts 5 844005 6 Behavior finding 7 Behavior finding (finding) 8 Acquiring complex concepts 9 C2371983

Acquiring complex skills
type: Class
subclass of: Health Related Factors
comment: 1 MD06165 2 Acquiring complex skills 3 None 4 Acquiring complex skills 5 844005 6 Behavior finding 7 Behavior finding (finding) 8 Acquiring complex skills 9 C2371293

Acquiring concepts
type: Class
subclass of: Health Related Factors
comment: 1 MD06139 2 Acquiring concepts 3 None 4 Acquiring concepts 5 844005 6 Behavior finding 7 Behavior finding (finding) 8 Acquiring concepts 9 C2371981

Acquiring information
type: Class
subclass of: Health Related Factors
comment: 1 MD06144 2 Acquiring information 3 None 4 Acquiring information 5 844005 6 Behavior finding 7 Behavior finding (finding) 8 Acquiring information 9 C2371973

Acquiring language
type: Class
subclass of: Health Related Factors
comment: 1 MD06131 2 Acquiring language 3 None 4 Acquiring language 5 844005 6 Behavior finding 7 Behavior finding (finding) 8 Acquiring language 9 C2371974

Acquiring single words or meaningful symbols
type: Class
subclass of: Health Related Factors
comment: 1 MD06132 2 Acquiring single words or meaningful symbols 3 None 4 Acquiring single words or meaningful symbols 5 844005 6 Behavior finding 7 Behavior finding (finding) 8 Acquiring single words or meaningful symbols 9 C2371975

Acquiring skills
type: Class
subclass of: Health Related Factors
comment: 1 MD06163 2 Acquiring skills 3 None 4 Acquiring skills 5 844005 6 Behavior finding 7 Behavior finding (finding) 8 Acquiring skills 9 C2371291

Acquiring skills in using basic operations
type: Class
subclass of: Health Related Factors
comment: 1 MD06160 2 Acquiring skills in using basic operations 3 None 4 Acquiring skills in using basic operations 5 844005 6 Behavior finding 7 Behavior finding (finding) 8 Acquiring skills in using basic operations 9 C2371998

Acquiring skills of numeracy
type: Class
subclass of: Health Related Factors
comment: 1 MD06158 2 Acquiring skills of numeracy 3 None 4 Acquiring skills of numeracy 5 844005 6 Behavior finding 7 Behavior finding (finding) 8 Acquiring skills of numeracy such as counting and ordering 9 C2371997

Acquiring skills to recognize symbols
type: Class
subclass of: Health Related Factors
comment: 1 MD06146 2 Acquiring skills to recognize symbols 3 None 4 Acquiring skills to recognize symbols 5 844005 6 Behavior finding 7 Behavior finding (finding) 8 Acquiring skills to recognize numerals, arithmetic signs and symbols 9 C2371996

Acquiring skills to sound out written words
type: Class
subclass of: Health Related Factors
comment: 1 MD06147 2 Acquiring skills to sound out written words 3 None 4 Acquiring skills to sound out written words 5 844005 6 Behavior finding 7 Behavior finding (finding) 8 Acquiring skills to sound out written words 9 C2371987

Acquiring skills to understanding written words and phrases
type: Class
subclass of: Health Related Factors
comment: 1 MD06148 2 Acquiring skills to understanding written words and phrases 3 None 4 Acquiring skills to understanding written words and phrases 5 844005 6 Behavior finding 7 Behavior finding (finding) 8 Acquiring skills to understand written words and phrases 9 C2371988

Acquiring skills to use writing implements
type: Class
subclass of: Health Related Factors
comment: 1 MD06152 2 Acquiring skills to use writing implements 3 None 4 Acquiring skills to use writing implements 5 844005 6 Behavior finding 7 Behavior finding (finding) 8 Acquiring skills to use writing implements 9 C2371991

Acquiring skills to write words and phrases
type: Class
subclass of: Health Related Factors
comment: 1 MD06154 2 Acquiring skills to write words and phrases 3 None 4 Acquiring skills to write words and phrases 5 844005 6 Behavior finding 7 Behavior finding (finding) 8 Acquiring skills to write words and phrases 9 C2371993

Acquiring syntax
type: Class
subclass of: Health Related Factors
comment: 1 MD06134 2 Acquiring syntax 3 None 4 Acquiring syntax 5 844005 6 Behavior finding 7 Behavior finding (finding) 8 Acquiring syntax 9 C2371977

Acquisition of goods and services
type: Class
subclass of: Health Related Factors
comment: 1 MD06417 2 Acquisition of goods and services 3 None 4 Acquisition of goods and services 5 224930009 6 Services 7 Services (qualifier value) 8 Acquisition of goods and services 9 C2371488

Actinic Ray
type: Class
subclass of: Physical/Chemical Environment
comment: 1 M01509 2 Actinic Ray 3 Actinic Rays 4 Actinic Ray 5 41355003 6 Ultraviolet light 7 Ultraviolet radiation (physical force) 8 Ultraviolet Rays 9 C0041625
alternative label: Actinic Rays

Action
type: Class
subclass of: Health Related Factors
comment: 1 MD04090 2 Action 3 None 4 Action 5 129264002 6 Action 7 Action (qualifier value) 8 Action 9 C0441472
comment: 1 MD04090-1 2 Action 3 None 4 Action 5 129264002 6 Action 7 Action (qualifier value) 8 Action 9 C3266814
comment: 1 MD04090-2 2 Action 3 None 4 Action 5 273248003 6 Action 7 Action (attribute) 8 Action 9 C0441472
comment: 1 MD04090-3 2 Action 3 None 4 Action 5 273248003 6 Action 7 Action (attribute) 8 Action 9 C3266814

Active-Assist
type: Class
subclass of: Health Related Factors
comment: 1 MD02645 2 Active-Assist 3 None 4 Active-Assist 5 35897007 6 active motion 7 Active movement (observable entity) 8 Active movement 9 C0231481

Active Lengths
type: Class
subclass of: Units
comment: 1 MD02599 2 Active Lengths 3 None 4 Active Lengths 5 272101001 6 Lengths 7 Lengths (qualifier value) 8 Length 9 C1444754

Active exercise
type: Class
subclass of: Preference of exercise
comment: Clinical+Disability Hospital information, examination/diagnosis/treatment data None 1 M00374 2 Active exercise 3 None 4 Active exercise 5 183302000 6 Active exercise 7 Active exercise (regime/therapy) 8 Active exercise 9 C0419117

Active joint movements
type: Class
subclass of: Active exercise
comment: 1 M00347 2 Active joint movements 3 None 4 Active joint movements 5 229252009 6 Active joint movements 7 Active joint movements (regime/therapy) 8 oint movement training 9 C0203967

Active shoulder movement without pain in four types of exercise
type: Class
subclass of: Questionnaire
comment: 1 MD04816 2 Active shoulder movement without pain in four types of exercise 3 None 4 Active shoulder movement without pain in four types of exercise 5 273389003 6 Daily activities questionnaire 7 Daily activities questionnaire (assessment scale) 8 Daily activities questionnaire 9 C0451094

Active sleep
type: Class
subclass of: Individual Related Factors
comment: 1 M01379 2 Active sleep 3 None 4 Active sleep 5 89129007 6 Active sleep 7 Rapid eye movement sleep, function (observable entity) 8 Sleep, REM 9 C0037322

Activities-specific Balance Confidence Scale
type: Class
subclass of: Tool
comment: 1 MD04730 2 Activities-specific Balance Confidence Scale 3 Activities-Specific Balance Confidence Scales, Activities-specific Balance Confidence Scale Note 4 Activities-specific Balance Confidence Scale 5 443322002 6 Activities specific balance confidence scale 7 Activities specific balance confidence scale (assessment scale) 8 Activities specific balance confidence scale 9 C2733457
alternative label: Activities-specific Balance Confidence Scale Note
alternative label: Activities-Specific Balance Confidence Scales

Activity-related rehabilitation
type: Class
subclass of: Musculoskeletal function (Therapy)
comment: 1 M00621 2 Activity-related rehabilitation 3 None 4 Activity-related rehabilitation 5 52052004 6 Rehabilitation 7 Rehabilitation therapy (regime/therapy) 8 Rehabilitation therapy 9 C0034991

Activity Goals
type: Class
subclass of: Hospital information, examination/diagnosis/treatment data
comment: 1 MD01968 2 Activity Goals 3 None 4 Activity Goals 5 410518001 6 Goal 7 Goal context (qualifier value) 8 objective (goal) 9 C0018017

Activity index
type: Class
subclass of: Tool
comment: 1 MD05197 2 Activity index 3 None 4 Activity index 5 257733005 6 Activity 7 Activity (observable entity) 8 Activities 9 C0441655

Activity participation
type: Class
subclass of: Hospital information, examination/diagnosis/treatment data
comment: 1 MD05199 2 Activity participation 3 None 4 Activity participation 5 444753008 6 Participation in leisure activity 7 Participation in leisure activity (regime/therapy) 8 Participation in leisure activity 9 C2919885

Actual Hypothermia
type: Class
subclass of: Sensory function, Pain and Skin function (Symptom)
comment: 1 M02843 2 Actual Hypothermia 3 None 4 Actual Hypothermia 5 386689009 6 Hypothermia 7 Hypothermia (finding) 8 Hypothermia, CTCAE 9 C1963170

Acute rise of fever
type: Class
subclass of: Immune system function (Symptom)
comment: 1 M00168 2 Acute rise of fever 3 None 4 Acute rise of fever 5 271749004 6 Acute rise of fever 7 Acute rise of fever (finding) 8 Acute rise of fever 9 C0424761

Adapting to changes in daily routine
type: Class
subclass of: Health Related Factors
comment: 1 MD06214 2 Adapting to changes in daily routine 3 None 4 Adapting to changes in daily routine 5 4452006 6 Adaptation 7 Adaptation, function (observable entity) 8 Adapt (substance) 9 C2937289

Additional functions of the respiratory system
type: Class
subclass of: Respiratory function (Body measurement)
comment: 1 MD05885 2 Additional functions of the respiratory system 3 None 4 Additional functions of the respiratory system 5 301282008 6 Finding of respiration 7 Finding of respiration (finding) 8 Additional respiratory functions 9 C2371105

Additional musculoskeletal structures related to movement
type: Class
subclass of: Musculoskeletal function (Body region)
comment: 1 MD07094 2 Additional musculoskeletal structures related to movement 3 None 4 Additional musculoskeletal structures related to movement 5 421060004 6 Structure of vertebral column 7 Structure of vertebral column (body structure) 8 Additional musculoskeletal structures related to movement 9 C2371898

Additional opinion
type: Class
subclass of: Hospital information, examination/diagnosis/treatment data
comment: 1 MD00847 2 Additional opinion 3 None 4 Additional opinion 5 69657008 6 CT Additional views 7 Computed tomography additional views (procedure) 8 CT additional views 9 C0202655

Address
type: Class
subclass of: Units
comment: 1 MD03794 2 Address 3 None 4 Address 5 397635003 6 Address 7 Address (observable entity) 8 Address 9 C1442065
comment: 1 MD03794-1 2 Address 3 None 4 Address 5 397635003 6 Address 7 Address (observable entity) 8 Address 9 C4319699
comment: 1 MD03794-2 2 Address 3 None 4 Address 5 734004005 6 Address 7 Address (property) (qualifier value) 8 Address 9 C1442065
comment: 1 MD03794-3 2 Address 3 None 4 Address 5 734004005 6 Address 7 Address (property) (qualifier value) 8 Address 9 C4319699

Admission fee
type: Class
subclass of: Hospital Administration
comment: 1 MD00173 2 Admission fee 3 None 4 Admission fee 5 308590000 6 Payment for service procedure 7 Payment for service procedure (procedure) 8 Fees, Medical 9 C0015754

Aerobic Activity
type: Class
subclass of: Aerobic Exercise
comment: 1 M00660 2 Aerobic Activity 3 None 4 Aerobic Activity 5 229072005 6 Aerobic exercises 7 Aerobic exercises (regime/therapy) 8 during aerobic activity 9 C5212736

Aerobic capacity
type: Class
subclass of: Musculoskeletal function (Body measurement)
comment: 1 MD05899 2 Aerobic capacity 3 None 4 Aerobic capacity 5 229072005 6 Aerobic exercises 7 Aerobic exercises (regime/therapy) 8 Aerobic capacity 9 C2371107

Aerobic exercises
type: Class
subclass of: Aerobic Exercise
comment: 1 M00328 2 aerobic exercise 3 aerobic fitness 4 Aerobic exercises 5 229072005 6 Aerobic exercises 7 Aerobic exercises (regime/therapy) 8 Exercise, Aerobic 9 C0001701

Aerobic fitness improved
type: Class
subclass of: Aerobic Exercise
comment: 1 MD01874 2 Aerobic fitness improved 3 None 4 Aerobic fitness improved 5 229072005 6 Aerobic exercises 7 Aerobic exercises (regime/therapy) 8 Exercise, Aerobic 9 C0001701

Aerobics
type: Class
subclass of: Aerobic Exercise
comment: 1 MD00989 2 Aerobics 3 aerobic 4 Aerobics 5 229072005 6 Aerobic exercises 7 Aerobic exercises (regime/therapy) 8 Exercise, Aerobic 9 C0001701
comment: 1 MD00989-1 2 Aerobics 3 aerobic 4 Aerobics 5 229072005 6 Aerobic exercises 7 Aerobic exercises (regime/therapy) 8 Aerobic 9 C1510824

Affect finding
type: Class
subclass of: Nervous system and Mental function (Symptom)
comment: 1 M02271 2 Affect finding 3 None 4 Affect finding 5 106131003 6 Affect finding 7 Mood finding (finding) 8 Mood finding 9 C0424108

Affect observations
type: Class
subclass of: Nervous system and Mental function (Symptom)
comment: 1 M02272 2 Affect observations 3 None 4 Affect observations 5 106131003 6 Affect observations 7 Mood finding (finding) 8 Mood finding 9 C0424108

Affected Side
type: Class
subclass of: Hospital information, examination/diagnosis/treatment data
comment: 1 MD02641 2 Affected Side 3 None 4 Affected Side 5 22201000087104 6 Affected area of body 7 Affected area of body (body structure) 8 Side affected 9 C3166323

Affective Disorders
type: Class
subclass of: Nervous system and Mental function (Symptom)
comment: 1 M02602 2 Affective Disorders 3 affecive disorder, affect disorder, affect disorders, affects disorder, disorder affect, Disorder of affect 4 Affective Disorders 5 46206005 6 Affective disorder 7 Mood disorder (disorder) 8 Mood Disorders 9 C0525045
alternative label: affects disorder
alternative label: affect disorder
alternative label: disorder affect
alternative label: Disorder of affect
alternative label: affecive disorder
alternative label: affect disorders

Afraid
type: Class
subclass of: Nervous system and Mental function (Symptom)
comment: 1 M05830 2 Afraid 3 None 4 Afraid 5 1402001 6 Afraid 7 Fear (finding) 8 Afraid 9 C0015726

Aggressive ex-smoker
type: Class
subclass of: Sub-Cultural Level
comment: 1 M00099 2 Aggressive ex-smoker 3 None 4 Aggressive ex-smoker 5 360900008 6 Aggressive ex-smoker 7 Aggressive ex-smoker (finding) 8 Aggressive ex-smoker 9 C0521323

Aggressive non-smoker
type: Class
subclass of: Sub-Cultural Level
comment: 1 M00101 2 Aggressive non-smoker 3 None 4 Aggressive non-smoker 5 360918006 6 Aggressive non-smoker 7 Aggressive non-smoker (finding) 8 Aggressive non-smoker 9 C0337674

Agility
type: Class
subclass of: Hospital information, examination/diagnosis/treatment data
comment: 1 MD02728 2 Agility 3 None 4 Agility 5 248326004 6 Body measurements 7 Body measure (observable entity) 8 Body measure result 9 C1305852

Aglossia
type: Class
subclass of: Sensory function, Pain and Skin function (Symptom)
comment: 1 MD00533 2 Aglossia 3 None 4 Aglossia 5 74788000 6 Tongue absent 7 Tongue absent (disorder) 8 Tongue absent 9 C0158663

Agreeableness
type: Class
subclass of: Nervous system and Mental function (Body measurement)
comment: 1 MD05620 2 Agreeableness 3 None 4 Agreeableness 5 225773000 6 Preferences 7 Preferences (qualifier value) 8 Agreeableness 9 C0870113

Agyria
type: Class
subclass of: Nervous system and Mental function (Symptom)
comment: 1 MD00491 2 Agyria 3 None 4 Agyria 5 204036008 6 Agyria 7 Lissencephaly (disorder) 8 Agyria 9 C1879312

Air quality
type: Class
subclass of: Physical/Chemical Environment
comment: 1 MD06676 2 Air quality 3 None 4 Air quality 5 263496004 6 Quality 7 Quality (attribute) 8 Air quality 9 C2371710

Alacrity
type: Class
subclass of: Hospital information, examination/diagnosis/treatment data
comment: 1 MD02730 2 Alacrity 3 None 4 Alacrity 5 248326004 6 Body measurements 7 Body measure (observable entity) 8 Body measure result 9 C1305852

Albright syndrome
type: Class
subclass of: Musculoskeletal function (Symptom)
comment: 1 MD00381 2 Albright syndrome 3 None 4 Albright syndrome 5 36517007 6 Albright syndrome 7 Polyostotic fibrous dysplasia of bone (disorder) 8 McCune-Albright Syndrome 9 C0242292

Alcohol units
type: Class
subclass of: Units
comment: 1 M04495 2 Alcohol units 3 alcohol unit unit alcohol 4 Alcohol units 5 228956008 6 Alcohol units 7 Alcohol units (qualifier value) 8 Alcohol units 9 C0556604
alternative label: alcohol unit
alternative label: unit alcohol

Alcohol user
type: Class
subclass of: Sub-Cultural Level
comment: 1 M02620 2 Alcohol user 3 alcohol users 4 Alcohol user 5 219006 6 Alcohol user 7 Current drinker of alcohol (finding) 8 Current drinker 9 C0556297

Alcoholic beverage drinker
type: Class
subclass of: Classification of Patient
comment: 1 M02622 2 Alcoholic beverage drinker 3 None 4 Alcoholic beverage drinker 5 219006 6 Alcohol user 7 Current drinker of alcohol (finding) 8 Current drinker 9 C0556297

Alcoholic beverage heavy drinker
type: Class
subclass of: Classification of Patient
comment: 1 M02160 2 Alcoholic beverage heavy drinker 3 None 4 Alcoholic beverage heavy drinker 5 86933000 6 heavy drinker 7 Heavy drinker (finding) 8 Alcoholic beverage heavy drinker 9 C0337678

Alcoholic beverage moderate drinker
type: Class
subclass of: Classification of Patient
comment: 1 M02159 2 Alcoholic beverage moderate drinker 3 None 4 Alcoholic beverage moderate drinker 5 43783005 6 moderate drinker 7 Moderate drinker (finding) 8 Moderate drinker 9 C0337677

All processes can be carried out smoothly.
type: Class
subclass of: Questionnaire
comment: 1 MD04295 2 All processes can be carried out smoothly. 3 None 4 All processes can be carried out smoothly. 5 273389003 6 Daily activities questionnaire 7 Daily activities questionnaire (assessment scale) 8 Daily activities questionnaire 9 C0451094

Allergy Unit per Milliliter
type: Class
subclass of: Units
comment: 1 M05637 2 Allergy Unit per Milliliter 3 None 4 Allergy Unit per Milliliter 5 258948008 6 Unit/milliliter 7 Unit/milliliter (qualifier value) 8 Allergy Unit per Milliliter 9 C2348421

Allergy and Clinical Immunology
type: Class
subclass of: Classification of Hospital
comment: 1 MD00685 2 Allergy and Clinical Immunology 3 None 4 Allergy and Clinical Immunology 5 788121006 6 Clinical immunology and allergy service 7 Clinical immunology and allergy service (qualifier value) 8 Allergy and Clinical Immunology Procedures 9 C3702163

Allogeneic hematopoietic stem cell
type: Class
subclass of: Hospital information, examination/diagnosis/treatment data
comment: 1 MD00286 2 Allogeneic hematopoietic stem cell 3 None 4 Allogeneic hematopoietic stem cell 5 418318001 6 Hematopoietic stem cell 7 Hematopoietic stem cell (cell) 8 Hematopoietic System 9 C0018957

Allorhythmic pulse
type: Class
subclass of: Cardiovascular system function (Body measurement)
comment: 1 M02188 2 Allorhythmic pulse 3 None 4 Allorhythmic pulse 5 61086009 6 Irregular pulse 7 Pulse irregular (finding) 8 Irregular pulse 9 C0392684

Alopecia Areata
type: Class
subclass of: Sensory function, Pain and Skin function (Symptom)
comment: 1 M00665 2 Alopecia Areata 3 None 4 Alopecia Areata 5 68225006 6 Alopecia areata 7 Alopecia areata (disorder) 8 Alopecia areata 9 C0002171

Alopecia unspecified
type: Class
subclass of: Sensory function, Pain and Skin function (Symptom)
comment: 1 M00671 2 Alopecia unspecified 3 None 4 Alopecia unspecified 5 56317004 6 Alopecia 7 Alopecia (disorder) 8 Alopecia 9 C0002170

Alteration in nutrition
type: Class
subclass of: Nutritional status
comment: 1 M00462 2 Alteration in nutrition 3 None 4 Alteration in nutrition 5 129844000 6 Alteration in nutrition 7 Alteration in nutrition (finding) 8 Alteration in nutrition 9 C0184548

Alternative vocalization functions
type: Class
subclass of: Voice and Speaking (Body measurement)
comment: 1 MD05826 2 Alternative vocalization functions 3 None 4 Alternative vocalization functions 5 278288005 6 vocalization 7 Vocalization (finding) 8 Alternative vocalization functions 9 C2370986

Alveoli
type: Class
subclass of: Respiratory function (Body region)
comment: 1 MD06945 2 Alveoli 3 None 4 Alveoli 5 113253006 6 pulmonary alveoli 7 Pulmonary alveolar structure (body structure) 8 Alveoli 9 C1515933

Ambulation
type: Class
subclass of: Health Related Factors
comment: 1 M01661 2 Ambulation 3 None 4 Ambulation 5 282146009 6 Walks 7 Does walk (finding) 8 Ambulation 9 C0945826

Amnesia
type: Class
subclass of: Nervous system and Mental function (Symptom)
comment: 1 M05890 2 Amnesia 3 None 4 Amnesia 5 48167000 6 Amnesia 7 Amnesia (finding) 8 Amnesia 9 C0002622

Amount of sleep
type: Class
subclass of: Individual Related Factors
comment: 1 MD05638 2 Amount of sleep 3 None 4 Amount of sleep 5 258158006 6 Sleep 7 Sleep, function (observable entity) 8 Amount of sleep 9 C2584341

Amp
type: Class
subclass of: Units
comment: 1 M05328 2 Amp 3 None 4 Amp 5 4864008 6 AMP 7 Adenylic acid (substance) 8 AMP 9 C0001465

Amp-second
type: Class
subclass of: Units
comment: 1 M04665 2 Amp-second 3 None 4 Amp-second 5 767525000 6 Unit 7 Unit (qualifier value) 8 Unit 9 C0439148

Ampere
type: Class
subclass of: Units
comment: 1 M04465 2 Ampere 3 ampere (A) 4 Ampere 5 278078000 6 ampere 7 Ampere (qualifier value) 8 Ampere 9 C0457243
alternative label: ampere (A)

Ampere second
type: Class
subclass of: Units
comment: 1 M04666 2 Ampere second 3 None 4 Ampere second 5 767525000 6 Unit 7 Unit (qualifier value) 8 Unit 9 C0439148

Ampoule
type: Class
subclass of: Units
comment: 1 M05327 2 Ampoule 3 Ampoules 4 Ampoule 5 413516001 6 Ampoule 7 Ampule - unit of product usage (qualifier value) 8 Ampoule 9 C0179031
alternative label: Ampoules

Ampule
type: Class
subclass of: Units
comment: 1 M03481 2 Ampule 3 Ampules 4 Ampule 5 413516001 6 Ampule 7 Ampule - unit of product usage (qualifier value) 8 Ampule 9 C0179031
alternative label: Ampules

Ampule - unit of product usage
type: Class
subclass of: Units
comment: 1 M05325 2 Ampule - unit of product usage 3 None 4 Ampule - unit of product usage 5 413516001 6 Ampule - unit of product usage 7 Ampule - unit of product usage (qualifier value) 8 Ampule - unit of product usage 9 C1706498

Ampule Dosing Unit
type: Class
subclass of: Units
comment: 1 M05324 2 Ampule Dosing Unit 3 None 4 Ampule Dosing Unit 5 413516001 6 Ampoule 7 Ampule - unit of product usage (qualifier value) 8 Ampoule 9 C0179031

Amputee Mobility Predictor
type: Class
subclass of: Questionnaire
comment: 1 MD04741 2 Amputee Mobility Predictor 3 None 4 Amputee Mobility Predictor 5 273249006 6 Assessment scales 7 Assessment scales (assessment scale) 8 Assessment scales 9 C0450973

Amputee Mobility Predictor with prosthesis
type: Class
subclass of: Questionnaire
comment: 1 MD04744 2 Amputee Mobility Predictor with prosthesis 3 None 4 Amputee Mobility Predictor with prosthesis 5 273249006 6 Assessment scales 7 Assessment scales (assessment scale) 8 Assessment scales 9 C0450973

Amputee Mobility Predictor without prosthesis
type: Class
subclass of: Questionnaire
comment: 1 MD04745 2 Amputee Mobility Predictor without prosthesis 3 None 4 Amputee Mobility Predictor without prosthesis 5 273249006 6 Assessment scales 7 Assessment scales (assessment scale) 8 Assessment scales 9 C0450973

Amyloidosis
type: Class
subclass of: Functions of Blood System, Metabolic system and Endocrine system (Symptom)
comment: 1 MD00326 2 Amyloidosis 3 None 4 Amyloidosis 5 17602002 6 Amyloidosis 7 Amyloidosis (disorder) 8 Amyloidosis 9 C0002726

Anaemia
type: Class
subclass of: Functions of Blood System, Metabolic system and Endocrine system (Symptom)
comment: 1 MD00401 2 Anaemia 3 None 4 Anaemia 5 271737000 6 Anaemia 7 Anemia (disorder) 8 Anaemia 9 C0002871

Anaerobic Threshold
type: Class
subclass of: Muscle Strengthening Exercise
comment: 1 MD03172 2 Anaerobic Threshold 3 None 4 Anaerobic Threshold 5 283010007 6 Unit of density 7 Unit of density (qualifier value) 8 Unit of density 9 C0560918

Anaerobic recovery
type: Class
subclass of: Muscle Strengthening Exercise
comment: 1 MD01876 2 Anaerobic recovery 3 None 4 Anaerobic recovery 5 229072005 6 Aerobic exercises 7 Aerobic exercises (regime/therapy) 8 Anaerobic 9 C3641081

Anal Margin
type: Class
subclass of: Digestive function (Body region)
comment: 1 M00345 2 Anal Margin 3 None 4 Anal Margin 5 59112000 6 Anal Margin 7 Skin structure of anus (body structure) 8 Transition zone of anal mucous membrane 9 C0227423

Anal Region
type: Class
subclass of: Digestive function (Body region)
comment: 1 M00069 2 Anal Region 3 None 4 Anal Region 5 81939000 6 Anal region 7 Anal region structure (body structure) 8 Anal part of perineum 9 C1275631

Anatomic Border
type: Class
subclass of: Sub-Cultural Level
comment: 1 M00014 2 Anatomic Border 3 None 4 Anatomic Border 5 246278005 6 Anatomical line 7 Anatomical line (attribute) 8 Anatomic Border 9 C1522411

Anatomical Pathology
type: Class
subclass of: Classification of Hospital
comment: 1 MD00647 2 Anatomical Pathology 3 None 4 Anatomical Pathology 5 1255732006 6 Anatomic pathology 7 Anatomic pathology (qualifier value) 8 Anatomic pathology service 9 C3872656

Android Fat
type: Class
subclass of: Functions of Blood System, Metabolic system and Endocrine system (Body measurement)
comment: 1 MD03019 2 Android Fat 3 None 4 Android Fat 5 248311001 6 Android Fat distribution 7 Central obesity (disorder) 8 Android obesity 9 C0342940

Anemia
type: Class
subclass of: Functions of Blood System, Metabolic system and Endocrine system (Symptom)
comment: 1 MD00406 2 Anemia 3 None 4 Anemia 5 271737000 6 Anemia 7 Anemia (disorder) 8 Anemia 9 C0002871

Anesthesiology
type: Class
subclass of: Classification of Hospital
comment: 1 MD00638 2 Anesthesiology 3 None 4 Anesthesiology 5 394577000 6 Anesthesiology 7 Anesthetics (qualifier value) 8 Anesthesiology 9 C0002930

Angelman syndrome
type: Class
subclass of: Hospital information, examination/diagnosis/treatment data
comment: 1 MD00497 2 Angelman syndrome 3 None 4 Angelman syndrome 5 76880004 6 Angelman syndrome 7 Angelman syndrome (disorder) 8 Angelman syndrome 9 C0162635

Angular Acceleration of Arms
type: Class
subclass of: Units
comment: 1 MD03190 2 Angular Acceleration of Arms 3 None 4 Angular Acceleration of Arms 5 285659007 6 Acceleration 7 Acceleration (physical force) 8 Acceleration 9 C0000894

Angular Degree
type: Class
subclass of: Units
comment: 1 M05634 2 Angular Degree 3 None 4 Angular Degree 5 277255000 6 Angular degrees 7 Angular degrees (qualifier value) 8 Angular degrees 9 C0456574

Angular Velocity of Arms
type: Class
subclass of: Musculoskeletal function (Body measurement)
comment: 1 MD03187 2 Angular Velocity of Arms 3 None 4 Angular Velocity of Arms 5 118592000 6 Velocity 7 Velocity (property) (qualifier value) 8 Velocity 9 C0439830

Anhydrotic skin
type: Class
subclass of: Sensory function, Pain and Skin function (Symptom)
comment: 1 M01714 2 Anhydrotic skin 3 None 4 Anhydrotic skin 5 52475004 6 Anhydrotic skin 7 Xeroderma (disorder) 8 Anhydrotic skin 9 C0151908

Animals
type: Class
subclass of: Biological environment
comment: 1 MD06648 2 Animals 3 None 4 Animals 5 387961004 6 Animals 7 Kingdom Animalia (organism) 8 Animals 9 C0003062

Ankle exercises
type: Class
subclass of: Limb
comment: 1 M00289 2 Ankle exercises 3 ankle exercise, ankles exercises, exercise ankle 4 Ankle exercises 5 229160002 6 Ankle exercises 7 Ankle exercises (regime/therapy) 8 Ankle exercises 9 C0454369
alternative label: exercise ankle
alternative label: ankle exercise
alternative label: ankles exercises

Ankle exercises in water
type: Class
subclass of: Active exercise
comment: 1 M00290 2 Ankle exercises in water 3 None 4 Ankle exercises in water 5 229191008 6 Ankle exercises in water 7 Ankle exercises in water (regime/therapy) 8 Ankle exercises in water 9 C0454400

Ankle joint and joints of foot and toes
type: Class
subclass of: Musculoskeletal function (Body region)
comment: 1 MD07075 2 Ankle joint and joints of foot and toes 3 None 4 Ankle joint and joints of foot and toes 5 312816002 6 Joint structure of ankle and foot 7 Joint structure of ankle and/or foot (body structure) 8 Ankle joint and joints of foot and toes 9 C2371890

Ankle pulse
type: Class
subclass of: Cardiovascular system function (Body measurement)
comment: 1 M00200 2 Ankle pulse 3 None 4 Ankle pulse 5 35048002 6 Ankle pulse 7 Ankle pulse, function (observable entity) 8 Ankle pulse 9 C0232154

Annum
type: Class
subclass of: Year
comment: 1 M03783 2 Annum 3 None 4 Annum 5 767525000 6 Unit 7 Unit (qualifier value) 8 Unit 9 C0439148

Anogenital region
type: Class
subclass of: Urogenital function (Body region)
comment: 1 M01965 2 Anogenital region 3 None 4 Anogenital region 5 38864007 6 Anogenital region 7 Perineal structure (body structure) 8 Anogenital region 9 C0031066

Anorexia
type: Class
subclass of: Digestive function (Symptom)
comment: 1 M00681 2 Anorexia 3 Anorexias Anorexic anorectic 4 Anorexia 5 79890006 6 Anorexia 7 Loss of appetite (finding) 8 Anorexia 9 C1971624
alternative label: Anorexias
alternative label: Anorexic
alternative label: anorectic

Antecardium
type: Class
subclass of: Digestive function (Body region)
comment: 1 M01272 2 Antecardium 3 None 4 Antecardium 5 27947004 6 Antecardium 7 Epigastric region structure (body structure) 8 Antecardium 9 C0230185

Anti-criminal psychotherapy
type: Class
subclass of: Nervous system and Mental function (Therapy)
comment: 1 M00604 2 Anti-criminal psychotherapy 3 None 4 Anti-criminal psychotherapy 5 183405004 6 Anti-criminal psychotherapy 7 Anti-criminal psychotherapy (regime/therapy) 8 Anti-criminal psychotherapy 9 C0419164

Anti-suicide psychotherapy
type: Class
subclass of: Nervous system and Mental function (Therapy)
comment: 1 M00605 2 Anti-suicide psychotherapy 3 None 4 Anti-suicide psychotherapy 5 183401008 6 Anti-suicide psychotherapy 7 Anti-suicide psychotherapy (regime/therapy) 8 Anti-suicide psychotherapy 9 C0419161

Anxiety about body function or health
type: Class
subclass of: Nervous system and Mental function (Symptom)
comment: 1 M05824 2 Anxiety about body function or health 3 None 4 Anxiety about body function or health 5 247808006 6 Anxiety about body function or health 7 Anxiety about body function or health (finding) 8 Anxiety about body function or health 9 C0424145

Anxiety about health
type: Class
subclass of: Nervous system and Mental function (Symptom)
comment: 1 M05823 2 Anxiety about health 3 None 4 Anxiety about health 5 247808006 6 Anxiety about health 7 Anxiety about body function or health (finding) 8 Anxiety about health 9 C0424145

Anxiety level
type: Class
subclass of: Hospital information, examination/diagnosis/treatment data
comment: 1 M00570 2 Anxiety level 3 anxiety levels 4 Anxiety level 5 405051006 6 Anxiety level 7 Level of anxiety (observable entity) 8 Anxiety level 9 C0564474
alternative label: anxiety levels

Anxiety reaction
type: Class
subclass of: Nervous system and Mental function (Symptom)
comment: 1 M05821 2 Anxiety reaction 3 None 4 Anxiety reaction 5 48694002 6 Anxiety reaction 7 Anxiety (finding) 8 Anxiety reaction 9 C0003467

Anxiety social
type: Class
subclass of: Nervous system and Mental function (Symptom)
comment: 1 M05828 2 Anxiety social 3 None 4 Anxiety social 5 25501002 6 Social phobia 7 Social phobia (disorder) 8 Social Anxiety 9 C0424166

Anxious cognitions
type: Class
subclass of: Nervous system and Mental function (Symptom)
comment: 1 M05841 2 Anxious cognitions 3 None 4 Anxious cognitions 5 79015004 6 Anxious cognitions 7 Worried (finding) 8 Anxious cognitions 9 C0233481

Anxiousness
type: Class
subclass of: Nervous system and Mental function (Symptom)
comment: 1 M05819 2 Anxiousness 3 None 4 Anxiousness 5 48694002 6 Anxiousness 7 Anxiety (finding) 8 Anxiousness 9 C0003467

Apert syndrome
type: Class
subclass of: Hospital information, examination/diagnosis/treatment data
comment: 1 MD00447 2 Apert syndrome 3 None 4 Apert syndrome 5 205258009 6 Apert syndrome 7 Acrocephalosyndactyly type I (disorder) 8 Apert syndrome 9 C0001193

Apical expansion exercises
type: Class
subclass of: Active exercise
comment: 1 M00267 2 Apical expansion exercises 3 None 4 Apical expansion exercises 5 229290003 6 Apical expansion exercises 7 Apical expansion exercises (regime/therapy) 8 Apical expansion exercises 9 C0454499

Apnea of newborn
type: Class
subclass of: Respiratory function (Symptom)
comment: 1 M01887 2 Apnea of newborn 3 Apnoea of newborn Apnea in the newborn Apnea neonatorum apnea newborn Apnoea in the newborn Apnoea neonatorum 4 Apnea of newborn 5 13094009 6 Apnea of newborn 7 Apnea in newborn (finding) 8 Apnea of newborn 9 C0232058
alternative label: Apnoea of newborn
alternative label: Apnoea neonatorum
alternative label: Apnea neonatorum
alternative label: Apnoea in the newborn
alternative label: Apnea in the newborn
alternative label: apnea newborn

Applicatorful
type: Class
subclass of: Units
comment: 1 M03595 2 Applicatorful 3 None 4 Applicatorful 5 1651000175105 6 Applicatorful 7 Applicatorful - unit of product usage (qualifier value) 8 Applicatorful Dosing Unit 9 C2698173

Applicatorful Dosing Unit
type: Class
subclass of: Units
comment: 1 M05700 2 Applicatorful Dosing Unit 3 None 4 Applicatorful Dosing Unit 5 1651000175105 6 Applicatorful 7 Applicatorful - unit of product usage (qualifier value) 8 Applicatorful Dosing Unit 9 C2698173

Appreciation in relationships
type: Class
subclass of: Individual Related Factors
comment: 1 MD06462 2 Respect and warmth in relationships 3 None 4 Respect and warmth in relationships 5 272151006 6 Relationships 7 Relationships (qualifier value) 8 Respect and warmth in relationships 9 C2371533

Appropriateness of emotion
type: Class
subclass of: Nervous system and Mental function (Body measurement)
comment: 1 MD05666 2 Appropriateness of emotion 3 None 4 Appropriateness of emotion 5 285854004 6 Emotion 7 Emotion (observable entity) 8 Appropriateness of emotion 9 C2370883

Approved accidental disease name
type: Class
subclass of: Hospital information, examination/diagnosis/treatment data
comment: 1 MD04878 2 Approved accidental disease name 3 None 4 Approved accidental disease name 5 64572001 6 Disease 7 Disease (disorder) 8 Disease 9 C0012634

Aquaerobic exercises
type: Class
subclass of: Active exercise
comment: 1 M00329 2 Aquaerobic exercises 3 aqua exercise 4 Aquaerobic exercises 5 229197007 6 Aquaerobic exercises 7 Aquaerobic exercises (regime/therapy) 8 Aquaerobic exercises 9 C0454405
alternative label: aqua exercise

Aquafit
type: Class
subclass of: Conditioning exercise
comment: 1 M05886 2 Aquafit 3 None 4 Aquafit 5 719333006 6 Fitness for activity 7 Fitness for activity (observable entity) 8 Fitness for activity 9 C4305181

Aquafitness
type: Class
subclass of: Conditioning exercise
comment: 1 M05885 2 Aquafitness 3 None 4 Aquafitness 5 719333006 6 Fitness for activity 7 Fitness for activity (observable entity) 8 Fitness for activity 9 C4305181

Aquatic fitness
type: Class
subclass of: Conditioning exercise
comment: 1 M05884 2 Aquatic fitness 3 None 4 Aquatic fitness 5 719333006 6 Fitness for activity 7 Fitness for activity (observable entity) 8 Fitness for activity 9 C4305181

Architecture and construction policies
type: Class
subclass of: Public Policy Factors
comment: 1 MD06719 2 Architecture and construction policies 3 None 4 Architecture and construction policies 5 276339004 6 environment 7 Environment (environment) 8 Architecture and construction policies 9 C2371751

Architecture and construction services
type: Class
subclass of: Public Policy Factors
comment: 1 MD06717 2 Architecture and construction services 3 None 4 Architecture and construction services 5 224930009 6 services 7 Services (qualifier value) 8 Architecture and construction services 9 C2371749

Architecture and construction systems
type: Class
subclass of: Public Policy Factors
comment: 1 MD06718 2 Architecture and construction systems 3 None 4 Architecture and construction systems 5 246333005 6 system 7 System (attribute) 8 Architecture and construction systems 9 C2371750

Are your leisure and recreational activities limited by your shoulder
type: Class
subclass of: Questionnaire
comment: 1 MD04807 2 Are your leisure and recreational activities limited by your shoulder 3 None 4 Are your leisure and recreational activities limited by your shoulder 5 273389003 6 Daily activities questionnaire 7 Daily activities questionnaire (assessment scale) 8 Daily activities questionnaire 9 C0451094

Armpit
type: Class
subclass of: Musculoskeletal function (Body region)
comment: 1 M01158 2 Armpit 3 armpits 4 Armpit 5 422543003 6 Armpit 7 Structure of axillary fossa (body structure) 8 Axilla 9 C0004454
alternative label: armpits

Arnold-Chiari syndrome
type: Class
subclass of: Nervous system and Mental function (Symptom)
comment: 1 MD00359 2 Arnold-Chiari syndrome 3 None 4 Arnold-Chiari syndrome 5 253184003 6 Arnold-Chiari syndrome 7 Chiari malformation (disorder) 8 Arnold Chiari Malformation 9 C0003803

Aromatherapy
type: Class
subclass of: Sensory function, Pain and Skin function (Therapy)
comment: 1 M00596 2 Aromatherapy 3 None 4 Aromatherapy 5 394615007 6 Aromatherapy 7 Aromatherapy (regime/therapy) 8 Aromatherapy 9 C0376547

Art therapy
type: Class
subclass of: Nervous system and Mental function (Therapy)
comment: 1 M00575 2 Art therapy 3 Art Therapies arts therapies arts therapy 4 Art therapy 5 65153003 6 Art therapy 7 Art therapy (regime/therapy) 8 Art therapy 9 C0003827
alternative label: Art Therapies
alternative label: arts therapy
alternative label: arts therapies

Arterial blood pressure
type: Class
subclass of: Cardiovascular system function (Body measurement)
comment: 1 M00123 2 Arterial blood pressure 3 Arterial pressure, ABP - Arterial blood pressure, Blood pressure arterial 4 Arterial blood pressure 5 386534000 6 Arterial blood pressure 7 Arterial blood pressure (observable entity) 8 Systemic arterial pressure 9 C1272641
alternative label: Arterial pressure
alternative label: Blood pressure arterial
alternative label: ABP - Arterial blood pressure

Arterial hypertension
type: Class
subclass of: Cardiovascular system function (Symptom)
comment: 1 M01135 2 Arterial hypertension 3 HYPERTENSION ARTERIAL 4 Arterial hypertension 5 38341003 6 Systemic arterial hypertension 7 Hypertensive disorder, systemic arterial (disorder) 8 Hypertensive disease 9 C1963138
alternative label: HYPERTENSION ARTERIAL

Arterial hypotension
type: Class
subclass of: Cardiovascular system function (Symptom)
comment: 1 M01181 2 Arterial hypotension 3 None 4 Arterial hypotension 5 45007003 6 Arterial hypotension 7 Low blood pressure (disorder) 8 Hypotension 9 C0020649

Arteries
type: Class
subclass of: Cardiovascular system function (Body region)
comment: 1 MD06928 2 Arteries 3 None 4 Arteries 5 59652004 6 atrial structure 7 Atrial structure (body structure) 8 Arteries 9 C0003842

Articulation functions
type: Class
subclass of: Voice and Speaking (Body measurement)
comment: 1 MD05818 2 Articulation functions 3 None 4 Articulation functions 5 735384006 6 vocal articulation 7 Vocal articulation (observable entity) 8 Articulation functions 9 C0234830

Artificial hydration and nutrition
type: Class
subclass of: Nutritional status
comment: 1 M02019 2 Artificial hydration and nutrition 3 None 4 Artificial hydration and nutrition 5 278906000 6 Nutritional support 7 Nutritional support (regime/therapy) 8 Nutritional Support 9 C0242739

Arts-based therapy
type: Class
subclass of: Nervous system and Mental function (Therapy)
comment: 1 M00695 2 Arts-based therapy 3 Arts-based approach 4 Arts-based therapy 5 65153003 6 Art therapy 7 Art therapy (regime/therapy) 8 Art Therapy 9 C0003827
alternative label: Arts-based approach

Arts and culture
type: Class
subclass of: Characteristics of the individual
comment: 1 MD06552 2 Arts and culture 3 None 4 Arts and culture 5 703725008 6 Culture 7 Culture technique (qualifier value) 8 Arts and culture 9 C2371612

Assembly of ballpoint pen size
type: Class
subclass of: Questionnaire
comment: 1 MD05096 2 Assembly of ballpoint pen size 3 None 4 Assembly of ballpoint pen size 5 844005 6 Behavior finding 7 Behavior finding (finding) 8 Behavior 9 C0004927

Assembly of small parts
type: Class
subclass of: Questionnaire
comment: 1 MD05093 2 Assembly of small parts 3 None 4 Assembly of small parts 5 273389003 6 Daily activities questionnaire 7 Daily activities questionnaire (assessment scale) 8 questionnaire 9 C0034394

Assessor
type: Class
subclass of: Hospital information, examination/diagnosis/treatment data
comment: 1 MD04983 2 Assessor 3 None 4 Assessor 5 265916008 6 Estimator/valuer/assessor 7 Estimator/valuer/assessor (occupation) 8 Assessor (genus) 9 C2646699

Assimilation functions
type: Class
subclass of: Digestive function (Body measurement)
comment: 1 MD05931 2 Assimilation functions 3 None 4 Assimilation functions 5 54709006 6 Body measurement (procedure) 7 Body measurement (procedure) 8 Assimilation functions 9 C2371129

Assistant or Environmental Modification A
type: Class
subclass of: Questionnaire
comment: 1 MD05560 2 Assistant or Environmental Modification A 3 None 4 Assistant or Environmental Modification A 5 371152001 6 Assisted 7 Assisted (qualifier value) 8 Assisted (qualifier value) 9 C1269765

Assisting others
type: Class
subclass of: Health Related Factors
comment: 1 MD06449 2 Assisting others 3 None 4 Assisting others 5 119265000 6 Assisting 7 Assisting (procedure) 8 Assisting others 9 C2371518

Assisting others in communication
type: Class
subclass of: Health Related Factors
comment: 1 MD06452 2 Assisting others in communication 3 None 4 Assisting others in communication 5 119265000 6 Assisting 7 Assisting (procedure) 8 Assisting others in communication 9 C2371521

Assisting others in health maintenance
type: Class
subclass of: Health Related Factors
comment: 1 MD06455 2 Assisting others in health maintenance 3 None 4 Assisting others in health maintenance 5 119265000 6 Assisting 7 Assisting (procedure) 8 Assisting others in health maintenance 9 C2371524

Assisting others in interpersonal relations
type: Class
subclass of: Health Related Factors
comment: 1 MD06453 2 Assisting others in interpersonal relations 3 None 4 Assisting others in interpersonal relations 5 119265000 6 Assisting 7 Assisting (procedure) 8 Assisting others in interpersonal relations 9 C2371522

Assisting others in movement
type: Class
subclass of: Health Related Factors
comment: 1 MD06451 2 Assisting others in movement 3 None 4 Assisting others in movement 5 119265000 6 Assisting 7 Assisting (procedure) 8 Assisting others in movement 9 C2371520

Assisting others in nutrition
type: Class
subclass of: Health Related Factors
comment: 1 MD06454 2 Assisting others in nutrition 3 None 4 Assisting others in nutrition 5 119265000 6 Assisting 7 Assisting (procedure) 8 Assisting others in nutrition 9 C2371523

Assisting others with self-care
type: Class
subclass of: Health Related Factors
comment: 1 MD06450 2 Assisting others with self-care 3 None 4 Assisting others with self-care 5 710204004 6 Assisting with self-care 7 Assisting with self-care (procedure) 8 Assisting others with self-care 9 C2371519

Assistive Device
type: Class
subclass of: Device
comment: 1 MD03076 2 Assistive device 3 Assist device, assist device 4 Assistive Device 5 1141802005 6 Assistive device 7 Assistive device (physical object) 8 Assistive device 9 C0036605
alternative label: Assist device

Assistive products and technology for communication
type: Class
subclass of: Device
comment: 1 MD06585 2 Assistive products and technology for communication 3 None 4 Assistive products and technology for communication 5 272394005 6 Technique 7 Technique (qualifier value) 8 Assistive products and technology for communication 9 C2371637

Assistive products and technology for education
type: Class
subclass of: Device
comment: 1 MD06590 2 Assistive products and technology for education 3 None 4 Assistive products and technology for education 5 272394005 6 Technique 7 Technique (qualifier value) 8 Assistive products and technology for education 9 C2371642

Assistive products and technology for employment
type: Class
subclass of: Device
comment: 1 MD06595 2 Assistive products and technology for employment 3 None 4 Assistive products and technology for employment 5 272394005 6 Technique 7 Technique (qualifier value) 8 Assistive products and technology for employment 9 C2371647

Assistive products and technology for personal indoor and outdoor mobility and transportation
type: Class
subclass of: Device
comment: 1 MD06580 2 Assistive products and technology for personal indoor and outdoor mobility and transportation 3 None 4 Assistive products and technology for personal indoor and outdoor mobility and transportation 5 272394005 6 Technique 7 Technique (qualifier value) 8 Assistive products and technology for personal indoor and outdoor mobility and transportation 9 C2371632

Assistive products and technology for personal use in daily living
type: Class
subclass of: Device
comment: 1 MD06575 2 Assistive products and technology for personal use in daily living 3 None 4 Assistive products and technology for personal use in daily living 5 272394005 6 Technique 7 Technique (qualifier value) 8 Assistive products and technology for personal use in daily living 9 C2371627

Assistive products and technology for the practice of religion or spirituality
type: Class
subclass of: Device
comment: 1 MD06605 2 Assistive products and technology for the practice of religion or spirituality 3 None 4 Assistive products and technology for the practice of religion or spirituality 5 272394005 6 Technique 7 Technique (qualifier value) 8 Assistive products and technology for the practice of religion or spirituality 9 C2371657

Assistive technology
type: Class
subclass of: Device
comment: 1 MD05583 2 Assistive technology 3 None 4 Assistive technology 5 1141802005 6 Assistive device 7 Assistive device (physical object) 8 assistive device/technology 9 C0872018

Assistive technology or Environmental modification
type: Class
subclass of: Health Related Factors
comment: 1 MD05582 2 Assistive technology or Environmental modification 3 None 4 Assistive technology or Environmental modification 5 844005 6 Behavior finding 7 Behavior finding (finding) 8 Behavior 9 C0004927

Associations and organizational policies
type: Class
subclass of: Public Policy Factors
comment: 1 MD06767 2 Associations and organizational policies 3 None 4 Associations and organizational policies 5 276339004 6 environment 7 Environment (environment) 8 Associations and organizational policies 9 C2371793

Associations and organizational services
type: Class
subclass of: Public Policy Factors
comment: 1 MD06765 2 Associations and organizational services 3 None 4 Associations and organizational services 5 224930009 6 services 7 Services (qualifier value) 8 Associations and organizational services 9 C2371791

Associations and organizational systems
type: Class
subclass of: Public Policy Factors
comment: 1 MD06766 2 Associations and organizational systems 3 None 4 Associations and organizational systems 5 246333005 6 system 7 System (attribute) 8 Associations and organizational systems 9 C2371792

Athrepsia
type: Class
subclass of: Digestive function (Symptom)
comment: 1 M01681 2 Athrepsia 3 None 4 Athrepsia 5 29740003 6 Athrepsia 7 Nutritional marasmus (disorder) 8 Athrepsia 9 C0086588

Atkins Diet
type: Class
subclass of: Nutritional management
comment: 1 MD02033 2 Atkins Diet 3 None 4 Atkins Diet 5 765024005 6 Atkins diet 7 Atkins diet (regime/therapy) 8 Atkins diet 9 C1319849

Atmosphere
type: Class
subclass of: Units
comment: 1 M04702 2 Atmosphere 3 atmos 4 Atmosphere 5 304607008 6 atmosphere 7 atmosphere (qualifier value) 8 atmosphere 9 C0678214
alternative label: atmos

Atmospheric pressure
type: Class
subclass of: Physical/Chemical Environment
comment: 1 MD06653 2 Atmospheric pressure 3 None 4 Atmospheric pressure 5 40513000 6 Atmospheric pressure 7 Atmospheric pressure (observable entity) 8 Atmospheric pressure 9 C0004180
comment: 1 MD06653-1 2 Atmospheric pressure 3 None 4 Atmospheric pressure 5 40513000 6 Atmospheric pressure 7 Atmospheric pressure (observable entity) 8 Atmospheric pressure 9 C0595910

Atria
type: Class
subclass of: Cardiovascular system function (Body region)
comment: 1 MD06924 2 Atria 3 None 4 Atria 5 59652004 6 atrial structure 7 Atrial structure (body structure) 8 Atria 9 C0018792

Attendees
type: Class
subclass of: Questionnaire
comment: 1 MD05548 2 Attendees 3 None 4 Attendees 5 410542002 6 Attended 7 Attended (qualifier value) 8 Attending (action) 9 C1999232

Attogram
type: Class
subclass of: Units
comment: 1 M05365 2 Attogram 3 None 4 Attogram 5 767525000 6 unit 7 Unit (qualifier value) 8 Unit 9 C0439190

Attogram per Nanogram
type: Class
subclass of: Units
comment: 1 M05153 2 Attogram per Nanogram 3 None 4 Attogram per Nanogram 5 767525000 6 unit 7 Unit (qualifier value) 8 Unit 9 C0439175

Attogram per Picogram
type: Class
subclass of: Units
comment: 1 M03877 2 Attogram per Picogram 3 None 4 Attogram per Picogram 5 767525000 6 Unit 7 Unit (qualifier value) 8 Unit 9 C0439148

Attokatal
type: Class
subclass of: Units
comment: 1 M03818 2 Attokatal 3 None 4 Attokatal 5 258783003 6 Attokatal 7 Attokatal (qualifier value) 8 Attokatal 9 C0439251

Attokatal per Picoliter
type: Class
subclass of: Units
comment: 1 M05387 2 Attokatal per Picoliter 3 None 4 Attokatal per Picoliter 5 767525000 6 unit 7 Unit (qualifier value) 8 Unit 9 C0439200

Attoliter
type: Class
subclass of: Units
comment: 1 M03531 2 Attoliter 3 None 4 Attoliter 5 767525000 6 Unit 7 Unit (qualifier value) 8 Attoliter 9 C2346871

Attomole
type: Class
subclass of: Units
comment: 1 M03707 2 Attomole 3 None 4 Attomole 5 258723000 6 attomole 7 attomole (qualifier value) 8 attomole 9 C0439193

Attomole per Attogram
type: Class
subclass of: Units
comment: 1 M05558 2 Attomole per Attogram 3 None 4 Attomole per Attogram 5 258723000 6 attomole 7 attomole (qualifier value) 8 amol unit of substance 9 C0439193

Attomole per Femtogram
type: Class
subclass of: Units
comment: 1 M05577 2 Attomole per Femtogram 3 amol/fg 4 Attomole per Femtogram 5 258723000 6 attomole 7 attomole (qualifier value) 8 amol unit of substance 9 C0439193
alternative label: amol/fg

Attomole per Microliter
type: Class
subclass of: Units
comment: 1 M03932 2 Attomole per Microliter 3 None 4 Attomole per Microliter 5 767525000 6 Unit 7 Unit (qualifier value) 8 Unit 9 C0439148

Attomole per Milliliter
type: Class
subclass of: Units
comment: 1 M03945 2 Attomole per Milliliter 3 None 4 Attomole per Milliliter 5 767525000 6 Unit 7 Unit (qualifier value) 8 Unit 9 C0439148

Attomole per Nanoliter
type: Class
subclass of: Units
comment: 1 M03916 2 Attomole per Nanoliter 3 None 4 Attomole per Nanoliter 5 767525000 6 Unit 7 Unit (qualifier value) 8 Unit 9 C0439148

Attomole per Picogram
type: Class
subclass of: Units
comment: 1 M03970 2 Attomole per Picogram 3 None 4 Attomole per Picogram 5 767525000 6 Unit 7 Unit (qualifier value) 8 Unit 9 C0439148

Attomole per Picoliter
type: Class
subclass of: Units
comment: 1 M04029 2 Attomole per Picoliter 3 None 4 Attomole per Picoliter 5 767525000 6 Unit 7 Unit (qualifier value) 8 Unit 9 C0439148

Attomole per Zeptogram
type: Class
subclass of: Units
comment: 1 M05594 2 Attomole per Zeptogram 3 None 4 Attomole per Zeptogram 5 258723000 6 attomole 7 attomole (qualifier value) 8 amol unit of substance 9 C0439193

Attomole per Zeptoliter
type: Class
subclass of: Units
comment: 1 M05610 2 Attomole per Zeptoliter 3 None 4 Attomole per Zeptoliter 5 258723000 6 attomole 7 attomole (qualifier value) 8 amol unit of substance 9 C0439193

Atypical virus
type: Class
subclass of: Hospital information, examination/diagnosis/treatment data
comment: 1 MD00297 2 Atypical virus 3 None 4 Atypical virus 5 49872002 6 Virus 7 Virus (organism) 8 Virus 9 C0042776

Audition
type: Class
subclass of: Sensory function, Pain and Skin function (Body measurement)
comment: 1 MD00007 2 Audition 3 auditory 4 Audition 5 47078008 6 Audition 7 Hearing, function (observable entity) 8 Hearing 9 C0018767
alternative label: auditory

Auditory alteration
type: Class
subclass of: Body functions of disability
comment: 1 MD00080 2 Auditory alteration 3 None 4 Auditory alteration 5 128540005 6 Auditory alteration 7 Hearing disorder (disorder) 8 Hearing problem 9 C0260662

Auditory perception
type: Class
subclass of: Nervous system and Mental function (Body measurement)
comment: 1 MD05672 2 Auditory perception 3 None 4 Auditory perception 5 1173048002 6 Auditory perception 7 Auditory perception function (observable entity) 8 Auditory perception 9 C0004309

Aural pressure
type: Class
subclass of: Sensory function, Pain and Skin function (Body measurement)
comment: 1 MD05777 2 Aural pressure 3 None 4 Aural pressure 5 278462009 6 Middle ear pressure 7 Middle ear pressure (observable entity) 8 Aural pressure 9 C2370950

Autistic disorder
type: Class
subclass of: Body functions of disability
comment: 1 MD00083 2 Autistic disorder 3 None 4 Autistic disorder 5 43614003 6 Autistic disorder of childhood onset 7 Autistic disorder of childhood onset (disorder) 8 Autistic disorder 9 C0004352

Autologous hematopoietic stem cell
type: Class
subclass of: Hospital information, examination/diagnosis/treatment data
comment: 1 MD00285 2 Autologous hematopoietic stem cell 3 None 4 Autologous hematopoietic stem cell 5 418318001 6 Hematopoietic stem cell 7 Hematopoietic stem cell (cell) 8 Hematopoietic stem cells 9 C0018956

Average Peak Torque
type: Class
subclass of: Units
comment: 1 MD03702 2 Average Peak Torque 3 None 4 Average Peak Torque 5 54709006 6 Body measurement 7 Body measurement (procedure) 8 Body measure procedure 9 C0203910

Average Torque
type: Class
subclass of: Units
comment: 1 MD03136 2 Average Torque 3 None 4 Average Torque 5 767524001 6 Unit of measure 7 Unit of measure (qualifier value) 8 Unit 9 C0439148

Average left
type: Class
subclass of: Units
comment: 1 MD04659 2 Average left 3 None 4 Average left 5 7771000 6 Left 7 Left (qualifier value) 8 Left 9 C0205091

Average right
type: Class
subclass of: Units
comment: 1 MD04656 2 Average right 3 None 4 Average right 5 24028007 6 Right 7 Right (qualifier value) 8 Right 9 C0205090

Average value of 1 to 3 measurements
type: Class
subclass of: Units
comment: 1 MD04388 2 Average value of 1 to 3 measurements 3 None 4 Average value of 1 to 3 measurements 5 255586005 6 Mean 7 Mean (qualifier value) 8 Average 9 C1510992

Avoirdupois Dram
type: Class
subclass of: Units
comment: 1 M05373 2 Avoirdupois Dram 3 None 4 Avoirdupois Dram 5 767525000 6 unit 7 Unit (qualifier value) 8 Unit 9 C0439190

Avoirdupois Ounce
type: Class
subclass of: Units
comment: 1 M03759 2 Avoirdupois Ounce 3 None 4 Avoirdupois Ounce 5 258692008 6 ounce 7 ounces (qualifier value) 8 ounce 9 C0439218

Axillary hair
type: Class
subclass of: Sensory function, Pain and Skin function (Body region)
comment: 1 MD07125 2 Axillary hair 3 None 4 Axillary hair 5 280911007 6 Entire axillary hair 7 Entire hair of axilla (body structure) 8 Axillary hair 9 C0221984

Axillary region structure
type: Class
subclass of: Musculoskeletal function (Body region)
comment: 1 M01219 2 Axillary region structure 3 Axilla, Axillas, Axillary region, Axilla structure, Axillary, Regio axillaris 4 Axillary region structure 5 91470000 6 Axillary region structure 7 Axillary region structure (body structure) 8 Axilla 9 C0004454
alternative label: Axilla structure
alternative label: Axillary
alternative label: Axillary region
alternative label: Regio axillaris
alternative label: Axilla
alternative label: Axillas

BG
type: Class
subclass of: Units
comment: 1 M05310 2 BG 3 None 4 BG 5 767525000 6 unit 7 Unit (qualifier value) 8 Unit 9 C0439180

BICEPS
type: Class
subclass of: Musculoskeletal function (Body region)
comment: 1 MD01997 2 BICEPS 3 None 4 BICEPS 5 362928008 6 Biceps brachii muscle part (body structure) 7 Biceps brachii muscle part (body structure) 8 Biceps brachii muscle part 9 C1285136

BICEPS CURL
type: Class
subclass of: Aerobic Exercise
comment: 1 MD01998 2 BICEPS CURL 3 None 4 BICEPS CURL 5 183301007 6 Physical exercises 7 Physical exercises (regime/therapy) 8 Physical therapy exercises 9 C0452240

BICEPS HOLD
type: Class
subclass of: Musculoskeletal function (Body region)
comment: 1 MD02001 2 BICEPS HOLD 3 None 4 BICEPS HOLD 5 362928008 6 Biceps brachii muscle part (body structure) 7 Biceps brachii muscle part (body structure) 8 Biceps brachii muscle part 9 C1285136

BLADDER INABILITY TO EMPTY
type: Class
subclass of: Urogenital function (Symptom)
comment: 1 M01644 2 BLADDER INABILITY TO EMPTY 3 inability to empty bladder Unable to empty bladder 4 BLADDER INABILITY TO EMPTY 5 267064002 6 Unable to empty bladder 7 Retention of urine (disorder) 8 Unable to empty bath 9 C0563793
alternative label: Unable to empty bladder
alternative label: inability to empty bladder

BLOODY SPUTUM
type: Class
subclass of: Digestive function (Symptom)
comment: 1 M01104 2 BLOODY SPUTUM 3 None 4 BLOODY SPUTUM 5 270031000 6 Sputum: contains blood 7 Sputum: contains blood (finding) 8 Sputum: contains blood 9 C0555114

BLOOD PRESSURE DROP ARTERIAL
type: Class
subclass of: Cardiovascular system function (Symptom)
comment: 1 M01193 2 BLOOD PRESSURE DROP ARTERIAL 3 None 4 BLOOD PRESSURE DROP ARTERIAL 5 386534000 6 Arterial blood pressure 7 Arterial blood pressure (observable entity) 8 Hypotension 9 C0020649

BMI
type: Class
subclass of: Musculoskeletal function (Body measurement)
comment: 1 M00139 2 BMI 3 None 4 BMI 5 60621009 6 Body mass index 7 Body mass index (observable entity) 8 Body mass index:Relative Density:Point in time:^Patient:Quantitative 9 C1542867

BOL
type: Class
subclass of: Units
comment: 1 M05286 2 BOL 3 None 4 BOL 5 767525000 6 unit 7 Unit (qualifier value) 8 Unit 9 C0439178

BONE MASS
type: Class
subclass of: Musculoskeletal function (Body measurement)
comment: 1 M00775 2 BONE MASS 3 bone masses 4 BONE MASS 5 4147007 6 Mass 7 Mass (morphologic abnormality) 8 Mass of body structure 9 C0577559
alternative label: bone masses

BX
type: Class
subclass of: Units
comment: 1 M05304 2 BX 3 None 4 BX 5 767525000 6 unit 7 Unit (qualifier value) 8 Unit 9 C0439180

Back exercises
type: Class
subclass of: Limb
comment: 1 M00319 2 Back exercises 3 back exercise, exercise back 4 Back exercises 5 229138000 6 Back exercises 7 Back exercises (regime/therapy) 8 Back exercises 9 C0454348
alternative label: exercise back
alternative label: back exercise

Back exercises in water
type: Class
subclass of: Active exercise
comment: 1 M00320 2 Back exercises in water 3 None 4 Back exercises in water 5 229186007 6 Back exercises in water 7 Back exercises in water (regime/therapy) 8 Back exercises in water 9 C0454395

Back function check
type: Class
subclass of: Tool
comment: 1 MD04307 2 Back function check 3 None 4 Back function check 5 246137000 6 equipment 7 Equipment (attribute) 8 equipment 9 C0014672

Back of
type: Class
subclass of: Units
comment: 1 M05860 2 Back of 3 None 4 Back of 5 255551008 6 Back of 7 Posterior (qualifier value) 8 Back of 9 C0205095

Back pain
type: Class
subclass of: Sensory function, Pain and Skin function (Symptom)
comment: 1 MD04259 2 Back pain 3 Pain in back 4 Back pain 5 161891005 6 Back pain 7 Backache (finding) 8 Back pain 9 C0004604
alternative label: Pain in back

Back pain during activities
type: Class
subclass of: Sensory function, Pain and Skin function (Symptom)
comment: 1 MD04263 2 Back pain during activities 3 None 4 Back pain during activities 5 161891005 6 Back pain 7 Backache (finding) 8 Back pain 9 C0004604

Badminton
type: Class
subclass of: Sport
comment: 1 M00382 2 Badminton 3 None 4 Badminton 5 415577004 6 Sport 7 Sport (qualifier value) 8 Badminton 9 C0004678

Bag - unit of product usage
type: Class
subclass of: Units
comment: 1 M05312 2 Bag - unit of product usage 3 None 4 Bag - unit of product usage 5 428672001 6 Bag - unit of product usage 7 Bag - unit of product usage (qualifier value) 8 Bag - unit of product usage 9 C1706249

Bag Dosing Unit
type: Class
subclass of: Units
comment: 1 M05311 2 Bag Dosing Unit 3 None 4 Bag Dosing Unit 5 428672001 6 Bag 7 Bag - unit of product usage (qualifier value) 8 Bag - unit of product usage 9 C1706249

Balance ability test
type: Class
subclass of: Tool
comment: 1 MD04367 2 Balance ability test 3 None 4 Balance ability test 5 404933001 6 Berg balance test 7 Berg balance test (procedure) 8 Berg balance test 9 C1321053

Balance and Fall Risk Assessment
type: Class
subclass of: Tool
comment: 1 MD04710 2 Balance and Fall Risk Assessment 3 None 4 Balance and Fall Risk Assessment 5 427226009 6 Balance Assessment 7 Assessment of sense of balance (procedure) 8 Balance Assessment Test 9 C1960377

Bald
type: Class
subclass of: Sensory function, Pain and Skin function (Symptom)
comment: 1 M00677 2 Bald 3 Baldness 4 Bald 5 56317004 6 Bald 7 Alopecia (disorder) 8 Bald 9 C0002170
alternative label: Baldness

Bar - unit of product usage
type: Class
subclass of: Units
comment: 1 M05269 2 Bar - unit of product usage 3 None 4 Bar - unit of product usage 5 428003006 6 Bar - unit of product usage 7 Bar - unit of product usage (qualifier value) 8 Bar - unit of product usage 9 C1704759

Bar Dosing Unit
type: Class
subclass of: Units
comment: 1 M05268 2 Bar Dosing Unit 3 None 4 Bar Dosing Unit 5 428003006 6 bar 7 Bar - unit of product usage (qualifier value) 8 Bar - unit of product usage 9 C1704759

Basal ganglia and related structures
type: Class
subclass of: Nervous system and Mental function (Body region)
comment: 1 MD06830 2 Basal ganglia and related structures 3 None 4 Basal ganglia and related structures 5 32610002 6 basal ganglia 7 Basal ganglion structure (body structure) 8 Basal ganglia and related structures 9 C2371845

Base
type: Class
subclass of: Units
comment: 1 M03414 2 Base 3 Unit dose - Base Bases Base - unit of product usage 4 Base 5 63813000 6 Base 7 Alkali (substance) 8 Base 9 C0178499
comment: 1 M03414-1 2 Base 3 Unit dose - Base Bases Base - unit of product usage 4 Base 5 63813000 6 Base 7 Alkali (substance) 8 Unit dose - Base 9 C1626935
comment: 1 M03414-2 2 Base 3 Unit dose - Base Bases Base - unit of product usage 4 Base 5 418836005 6 Base 7 Base - unit of product usage (qualifier value) 8 Base 9 C0178499
comment: 1 M03414-3 2 Base 3 Unit dose - Base Bases Base - unit of product usage 4 Base 5 418836005 6 Base 7 Base - unit of product usage (qualifier value) 8 Unit dose - Base 9 C1626935
alternative label: Unit dose - Base
alternative label: Bases
alternative label: Base - unit of product usage

Baseball
type: Class
subclass of: Sport
comment: 1 M00383 2 baseball 3 Baseball, baseball, Baseballs 4 Baseball 5 21471008 6 Baseball 7 Baseball (qualifier value) 8 Manufactured Baseball 9 C0004796
comment: 1 MD01237 2 baseball 3 Baseballs 4 baseball 5 23699001 6 Baseball 7 Baseball, device (physical object) 8 Baseball Game 9 C0004795
comment: 1 MD01237-1 2 baseball 3 Baseballs 4 baseball 5 23699001 6 Baseball 7 Baseball, device (physical object) 8 Manufactured Baseball 9 C0004796
comment: 1 MD01237-2 2 baseball 3 Baseballs 4 baseball 5 21471008 6 Baseball 7 Baseball (qualifier value) 8 Baseball Game 9 C0004795
comment: 1 MD01237-3 2 baseball 3 Baseballs 4 baseball 5 21471008 6 Baseball 7 Baseball (qualifier value) 8 Manufactured Baseball 9 C0004796
alternative label: Baseballs

Basic daily life movements that require training
type: Class
subclass of: Questionnaire
comment: 1 MD05172 2 Basic daily life movements that require training 3 None 4 Basic daily life movements that require training 5 398636004 6 Physical activity assessment 7 Physical activity assessment (procedure) 8 Physical activity assessment 9 C1301988

Basic economic transactions
type: Class
subclass of: Individual Related Factors
comment: 1 MD06533 2 Basic economic transactions 3 None 4 Basic economic transactions 5 844005 6 Behavior finding 7 Behavior finding (finding) 8 Basic economic transactions 9 C2371594

Basic information
type: Class
subclass of: Questionnaire
comment: 1 MD04876 2 Basic information 3 None 4 Basic information 5 310385006 6 Information status 7 Information status (finding) 8 Information 9 C1533716
comment: 1 MD05541 2 Basic information 3 None 4 Basic information 5 706593004 6 Information system 7 Information system (physical object) 8 Information system 9 C0021428

Basic information for task performance assessment
type: Class
subclass of: Questionnaire
comment: 1 MD05540 2 Basic information for task performance assessment 3 None 4 Basic information for task performance assessment 5 386053000 6 Assessment 7 Evaluation procedure (procedure) 8 Evaluation 9 C0220825

Basic information survey
type: Class
subclass of: Tool
comment: 1 MD04411 2 Basic information survey 3 None 4 Basic information survey 5 311791003 6 Information gathering 7 Information gathering (procedure) 8 Information gathering 9 C0589362

Basic interpersonal interactions
type: Class
subclass of: Individual Related Factors
comment: 1 MD06461 2 Basic interpersonal interactions 3 None 4 Basic interpersonal interactions 5 304879008 6 Recording interpersonal interactions 7 Recording interpersonal interactions (procedure) 8 Basic interpersonal interactions 9 C2371532

Basketball
type: Class
subclass of: Sport
comment: 1 M00384 2 Basketball 3 Basketballs 4 Basketball 5 25731005 6 Basketball 7 Basketball (qualifier value) 8 Basketball game 9 C0004818
comment: 1 M00384-1 2 Basketball 3 Basketballs 4 Basketball 5 25731005 6 Basketball 7 Basketball (qualifier value) 8 Manufactured basketball 9 C0336987
comment: 1 M00384-2 2 Basketball 3 Basketballs 4 Basketball 5 46440007 6 Basketball 7 Basketball, device (physical object) 8 Basketball game 9 C0004818
comment: 1 M00384-3 2 Basketball 3 Basketballs 4 Basketball 5 46440007 6 Basketball 7 Basketball, device (physical object) 8 Manufactured basketball 9 C0336987
alternative label: Basketballs

Beats
type: Class
subclass of: Units
comment: 1 MD02579 2 Beats 3 None 4 Beats 5 258983007 6 bpm-beats per minute 7 Beats/minute (qualifier value) 8 beats per minute 9 C0439385

Beats per Minute
type: Class
subclass of: Units
comment: 1 M04108 2 Beats per Minute 3 "beats/min Heart Beats per Minute Beats/Minute beats minute per" 4 Beats per Minute 5 258983007 6 beats per minute 7 Beats/minute (qualifier value) 8 beats per minute 9 C0439385
alternative label: Heart Beats per Minute
alternative label: beats minute per
alternative label: Beats/Minute
alternative label: beats/min

Becquerel per Gram
type: Class
subclass of: Units
comment: 1 M05462 2 Becquerel per Gram 3 None 4 Becquerel per Gram 5 767525000 6 unit 7 Unit (qualifier value) 8 Unit 9 C0439190

Becquerel per Kilogram
type: Class
subclass of: Units
comment: 1 M05465 2 Becquerel/Liter 3 None 4 Becquerel/Liter 5 767525000 6 unit 7 Unit (qualifier value) 8 Unit 9 C0439190

Becquerel per Liter
type: Class
subclass of: Units
comment: 1 M05466 2 Becquerel per Liter 3 None 4 Becquerel per Liter 5 767525000 6 unit 7 Unit (qualifier value) 8 Unit 9 C0439190

Becquerel per Microgram
type: Class
subclass of: Units
comment: 1 M05476 2 Becquerel per Microgram 3 None 4 Becquerel per Microgram 5 767525000 6 unit 7 Unit (qualifier value) 8 Unit 9 C0439190

Becquerel per Microliter
type: Class
subclass of: Units
comment: 1 M05219 2 Becquerel per Microliter 3 None 4 Becquerel per Microliter 5 767525000 6 unit 7 Unit (qualifier value) 8 Unit 9 C0439178

Becquerel per Milligram
type: Class
subclass of: Units
comment: 1 M05482 2 Becquerel per Milligram 3 None 4 Becquerel per Milligram 5 282141004 6 Becquerel 7 Becquerel (qualifier value) 8 Becquerel per Milligram 9 C2346983

Becquerel per Milliliter
type: Class
subclass of: Units
comment: 1 M05487 2 Becquerel per Milliliter 3 None 4 Becquerel per Milliliter 5 282141004 6 Becquerel 7 Becquerel (qualifier value) 8 Becquerel per Milliliter 9 C2346984

Beer drinker
type: Class
subclass of: Sub-Cultural Level
comment: 1 M00005 2 Beer drinker 3 beer drinkers 4 Beer drinker 5 160589000 6 Beer drinker 7 Beer drinker (finding) 8 Beer drinker 9 C0425330
alternative label: beer drinkers

Behavior
type: Class
subclass of: Health Related Factors
comment: 1 M00001 2 Behavior 3 Behaviors, Behaviours, Behavioral, behaviour 4 Behavior 5 844005 6 Behavior finding 7 Behavior finding (finding) 8 Behavior 9 C0004927
alternative label: behaviour
alternative label: Behaviors
alternative label: Behavioral
alternative label: Behaviours

Behavior conditioning therapy
type: Class
subclass of: Nervous system and Mental function (Therapy)
comment: 1 M00736 2 Behavior conditioning therapy 3 Behaviour conditioning therapy 4 Behavior conditioning therapy 5 166001 6 Behavior conditioning therapy 7 Behavioral therapy (regime/therapy) 8 Behavior conditioning therapy 9 C0004933
alternative label: Behaviour conditioning therapy

Behavior finding
type: Class
subclass of: Health Related Factors
comment: 1 M00710 2 Behavior finding 3 Behaviour finding, Behavioral finding, Behavioural finding 4 Behavior finding 5 844005 6 Behavior finding 7 Behavior finding (finding) 8 Behavior 9 C0004927
alternative label: Behaviour finding
alternative label: Behavioral finding
alternative label: Behavioural finding

Behavior modification technique
type: Class
subclass of: Tool
comment: 1 M00731 2 Behavior modification technique 3 behavior modification techniques 4 Behavior modification technique 5 166001 6 Behavior modification technique 7 Behavioral therapy (regime/therapy) 8 Behavior modification technique 9 C0004933

Behavior modification treatments and procedures
type: Class
subclass of: Nervous system and Mental function (Therapy)
comment: 1 M00740 2 Behavior modification treatments and procedures 3 Behaviour modification treatments and procedures 4 Behavior modification treatments and procedures 5 166001 6 Behavior modification treatments and procedures 7 Behavioral therapy (regime/therapy) 8 Behavior modification treatments and procedures 9 C0004933
alternative label: Behaviour modification treatments and procedures

Behavior or Life Style Modifications
type: Class
subclass of: Nervous system and Mental function (Therapy)
comment: 1 M00742 2 Behavior or Life Style Modifications 3 None 4 Behavior or Life Style Modifications 5 166001 6 Behaviour modification treatments and procedures 7 Behavioral therapy (regime/therapy) 8 Behaviour modification treatments and procedures 9 C0004933

Behavioral Intervention
type: Class
subclass of: Nervous system and Mental function (Therapy)
comment: 1 M00738 2 Behavioral Intervention 3 behavioral interventions 4 Behavioral Intervention 5 408452007 6 Behavioral intervention team 7 Behavioral intervention team (qualifier value) 8 Behavioral intervention team 9 C1321165
alternative label: behavioral interventions

Behavioral Modification
type: Class
subclass of: Health Related Factors
comment: 1 M00743 2 Behavioral Modification 3 Behavior Modification, Behavior Modifications, Behaviour modification 4 Behavioral Modification 5 166001 6 Behaviour modification treatments and procedures 7 Behavioral therapy (regime/therapy) 8 Behaviour modification treatments and procedures 9 C0004933
alternative label: Behavior Modifications
alternative label: Behaviour modification
alternative label: Behavior Modification

Behavioral Treatment
type: Class
subclass of: Musculoskeletal function (Therapy)
comment: 1 M00744 2 Behavioral Treatment 3 Behavioral Treatments 4 Behavioral Treatment 5 405086008 6 Treatment behavior: illness and injury 7 Treatment behavior: illness and injury (observable entity) 8 Behavior Therapy 9 C0004933
alternative label: Behavioral Treatments

Behavioral psychotherapy
type: Class
subclass of: Nervous system and Mental function (Therapy)
comment: 1 M00734 2 Behavioral psychotherapy 3 Behavior modification psychotherapy Behaviour modification psychotherapy Behavioural psychotherapy 4 Behavioral psychotherapy 5 166001 6 Behavioral psychotherapy 7 Behavioral therapy (regime/therapy) 8 Behavioral psychotherapy 9 C0004933
alternative label: Behaviour modification psychotherapy
alternative label: Behavior modification psychotherapy
alternative label: Behavioural psychotherapy

Behavioral therapy
type: Class
subclass of: Musculoskeletal function (Therapy)
comment: 1 M00729 2 Behavioral therapy 3 Behavior therapy Behavior Therapies behaviour therapy Behavioural therapy 4 Behavioral therapy 5 166001 6 Behavioral therapy 7 Behavioral therapy (regime/therapy) 8 Behavioral therapy 9 C0004933
alternative label: behaviour therapy
alternative label: Behavior Therapies
alternative label: Behavior therapy
alternative label: Behavioural therapy

Behaviour modification technique
type: Class
subclass of: Tool
comment: 1 M00732 2 Behaviour modification technique 3 None 4 Behaviour modification technique 5 166001 6 Behaviour modification technique 7 Behavioral therapy (regime/therapy) 8 Behaviour modification technique 9 C0004933

Bel
type: Class
subclass of: Units
comment: 1 M03409 2 Bel 3 Units Of Measure - bel 4 Bel 5 767524001 6 Unit of measure 7 Unit of measure (qualifier value) 8 Units Of Measure - bel 9 C1553005
alternative label: Units Of Measure - bel

Bellyache
type: Class
subclass of: Hospital information, examination/diagnosis/treatment data
comment: 1 M00656 2 Bellyache 3 None 4 Bellyache 5 271681002 6 Belly ache 7 Stomach ache (finding) 8 Abdominal Pain 9 C0000737

Below
type: Class
subclass of: Units
comment: 1 MD01747 2 Below 3 None 4 Below 5 351726001 6 Below 7 Below (qualifier value) 8 Inferior 9 C0542339

Bending
type: Class
subclass of: Health Related Factors
comment: 1 MD06281 2 Bending 3 None 4 Bending 5 417188003 6 Forward bending 7 Forward bending (observable entity) 8 Bending 9 C2584296

Benign
type: Class
subclass of: Hospital information, examination/diagnosis/treatment data
comment: 1 MD00398 2 Benign 3 None 4 Benign 5 30807003 6 Benign 7 Benign (qualifier value) 8 Benign 9 C0205183

Berg Balance Scale
type: Class
subclass of: Tool
comment: 1 MD03099 2 Berg Balance Scale 3 None 4 Berg Balance Scale 5 428203000 6 Berg balance scale 7 Berg balance scale (assessment scale) 8 Berg balance scale 9 C1998325

Berg Balance Scale Note
type: Class
subclass of: Questionnaire
comment: 1 MD04738 2 Berg Balance Scale Note 3 None 4 Berg Balance Scale Note 5 428203000 6 Berg Balance Scale 7 Berg Balance Scale (assessment scale) 8 Berg Balance Scale 9 C1998325

Biathlon
type: Class
subclass of: Sport
comment: 1 MD00994 2 Biathlon 3 None 4 Biathlon 5 14468000 6 Sports 7 Sports activity (observable entity) 8 Sports 9 C0038039
comment: 1 MD00994-1 2 Biathlon 3 None 4 Biathlon 5 415577004 6 Sport 7 Sport (qualifier value) 8 Sports 9 C0038039

Bicycle racing
type: Class
subclass of: Sport
comment: 1 M00385 2 Bicycle racing 3 None 4 Bicycle racing 5 300648001 6 Rides a bicycle 7 Does ride a bicycle (finding) 8 Does ride a bicycle 9 C0577368

Bike Cadence
type: Class
subclass of: Units
comment: 1 MD02577 2 Bike Cadence 3 None 4 Bike Cadence 5 260698009 6 Method of cycling 7 Method of cycling (attribute) 8 Method of cycling 9 C0449334

Bilateral comparison
type: Class
subclass of: Hospital information, examination/diagnosis/treatment data
comment: 1 MD03139 2 Bilateral comparison 3 None 4 Bilateral comparison 5 51440002 6 Bilateral 7 Right and left (qualifier value) 8 Bilateral 9 C0238767

Billiard sports
type: Class
subclass of: Sport
comment: 1 M05848 2 Billiard sports 3 None 4 Billiard sports 5 415577004 6 Sport 7 Sport (qualifier value) 8 Sports 9 C0038039

Billiards
type: Class
subclass of: Sport
comment: 1 M00386 2 Billiards 3 None 4 Billiards 5 415577004 6 Sport 7 Sport (qualifier value) 8 Shoot Pool or Billiards 9 C3842662

Billion per Liter
type: Class
subclass of: Units
comment: 1 M04393 2 Billion per Liter 3 Billion/Liter 4 Billion per Liter 5 767525000 6 Unit 7 Unit (qualifier value) 8 Billion per Liter 9 C0456615
alternative label: Billion/Liter

Binocular acuity of distant vision
type: Class
subclass of: Sensory function, Pain and Skin function (Body measurement)
comment: 1 MD05732 2 Binocular acuity of distant vision 3 None 4 Binocular acuity of distant vision 5 251742009 6 Distance visual acuity - binocular 7 Distance visual acuity - binocular (observable entity) 8 Binocular acuity of distant vision 9 C2370922

Binocular acuity of near vision
type: Class
subclass of: Sensory function, Pain and Skin function (Body measurement)
comment: 1 MD05734 2 Binocular acuity of near vision 3 None 4 Binocular acuity of near vision 5 251746007 6 Near visual acuity - binocular 7 Near visual acuity - binocular (observable entity) 8 Binocular acuity of near vision 9 C2370924

Birthing center
type: Class
subclass of: Classification of Hospital
comment: 1 MD00605 2 Birthing center 3 None 4 Birthing center 5 52668009 6 Hospital-based birthing center 7 Hospital-based birthing center (environment) 8 Hospital-based birthing center 9 C0338001

Biting
type: Class
subclass of: Digestive function (Body measurement)
comment: 1 MD05909 2 Biting 3 None 4 Biting 5 736649005 6 object biting 7 Object biting (finding) 8 Biting 9 C2584293

Bladder Distention
type: Class
subclass of: Urogenital function (Symptom)
comment: 1 M01643 2 Bladder Distention 3 None 4 Bladder Distention 5 54768000 6 Bladder distention 7 Bladder distention (finding) 8 Bladder distention 9 C0005687

Bladder retention of urine
type: Class
subclass of: Urogenital function (Symptom)
comment: 1 M01646 2 Bladder retention of urine 3 BLADDER RETENTION Bladder retention of urine -RETIRED- bladder urine retention 4 Bladder retention of urine 5 130951007 6 Bladder retention of urine 7 Bladder retention of urine (observable entity) 8 Bladder retention of urine 9 C0080274
alternative label: BLADDER RETENTION
alternative label: bladder urine retention
alternative label: Bladder retention of urine -RETIRED-

Blinking
type: Class
subclass of: Individual Related Factors
comment: 1 M00228 2 Blinking 3 blinks, blink 4 Blinking 5 3585009 6 Blinking 7 Blinking (finding) 8 Blinking 9 C0005757
alternative label: blinks
alternative label: blink

Blinking exercises
type: Class
subclass of: Active exercise
comment: 1 M00262 2 Blinking exercises 3 None 4 Blinking exercises 5 229124007 6 Blinking exercises 7 Blinking exercises (regime/therapy) 8 Blinking exercises 9 C0454334

Block
type: Class
subclass of: Questionnaire
comment: 1 MD04482 2 Block 3 None 4 Block 5 26036001 6 Block 7 Obstruction (morphologic abnormality) 8 Block 9 C0028778
comment: 1 MD04482-1 2 Block 3 None 4 Block 5 26036001 6 Block 7 Obstruction (morphologic abnormality) 8 Block 9 C4319518
comment: 1 MD04482-2 2 Block 3 None 4 Block 5 732985006 6 Block 7 Block (unit of presentation) 8 Block 9 C0028778
comment: 1 MD04482-3 2 Block 3 None 4 Block 5 732985006 6 Block 7 Block (unit of presentation) 8 Block 9 C4319518

Blood Sugar
type: Class
subclass of: Functions of Blood System, Metabolic system and Endocrine system (Body measurement)
comment: 1 M00755 2 Blood sugar 3 blood sugars, bloods sugar. sugar blood 4 Blood Sugar 5 33747003 6 Blood sugar level 7 Glucose measurement, blood (procedure) 8 blood sugar check 9 C2186398
comment: 1 M00755-1 2 Blood sugar 3 blood sugars, bloods sugar. sugar blood 4 Blood Sugar 5 33747003 6 Blood sugar level 7 Glucose measurement, blood (procedure) 8 blood glucose 9 C0005802
alternative label: blood sugars
alternative label: sugar blood
alternative label: bloods sugar

Blood Urea Nitrogen
type: Class
subclass of: Urogenital function (Body measurement)
comment: 1 MD03057 2 Blood Urea Nitrogen 3 None 4 Blood Urea Nitrogen 5 105011006 6 Blood urea nitrogen measurement 7 Blood urea nitrogen measurement (procedure) 8 Blood urea nitrogen measurement 9 C0005845

Blood glucose abnormal
type: Class
subclass of: Functions of Blood System, Metabolic system and Endocrine system (Symptom)
comment: 1 M00119 2 Blood glucose abnormal 3 None 4 Blood glucose abnormal 5 166922008 6 Blood glucose abnormal 7 Blood glucose abnormal (finding) 8 Blood glucose abnormal 9 C0580546

Blood glucose level
type: Class
subclass of: Functions of Blood System, Metabolic system and Endocrine system (Body measurement)
comment: 1 M02342 2 Blood glucose level 3 blood glucose levels 4 Blood glucose level 5 365812005 6 Blood glucose level 7 Finding of blood glucose level (finding) 8 Finding of blood glucose level 9 C0428554
alternative label: blood glucose levels

Blood glucose result
type: Class
subclass of: Functions of Blood System, Metabolic system and Endocrine system (Body measurement)
comment: 1 M00118 2 Blood glucose result 3 None 4 Blood glucose result 5 365812005 6 Blood glucose result 7 Finding of blood glucose level (finding) 8 Finding of blood glucose level 9 C0428554
alternative label: blood glucose results

Blood in sputum - haemoptysis
type: Class
subclass of: Digestive function (Symptom)
comment: 1 M01099 2 Blood in sputum - haemoptysis 3 None 4 Blood in sputum - haemoptysis 5 270031000 6 Hemoptysis 7 Hemoptysis (finding) 8 Hemoptysis 9 C0019079

Blood in sputum - hemoptysis
type: Class
subclass of: Digestive function (Symptom)
comment: 1 M01100 2 Blood in sputum - hemoptysis 3 None 4 Blood in sputum - hemoptysis 5 270031000 6 Haemoptysis 7 Hemoptysis (finding) 8 Hemoptysis 9 C0019079

Blood oxygen
type: Class
subclass of: Functions of Blood System, Metabolic system and Endocrine system (Body measurement)
comment: 1 MD01576 2 Blood oxygen 3 None 4 Blood oxygen 5 250555002 6 Blood oxygen concentration 7 Blood oxygen concentration measurement (procedure) 8 Measurement of oxygen dissolved in blood 9 C0428185

Blood streaked sputum
type: Class
subclass of: Digestive function (Symptom)
comment: 1 M01103 2 Blood streaked sputum 3 None 4 Blood streaked sputum 5 6686005 6 Blood streaked sputum 7 Blood streaked sputum (finding) 8 Blood streaked sputum 9 C0019079

Blood sugar result
type: Class
subclass of: Functions of Blood System, Metabolic system and Endocrine system (Body measurement)
comment: 1 M02348 2 Blood sugar result 3 Sugar result - blood 4 Blood sugar result 5 418389000 6 Blood sugar management (procedure) 7 Blood sugar management (procedure) 8 Blood sugar result 9 C1571816
alternative label: Sugar result - blood

Blood supply to the heart
type: Class
subclass of: Cardiovascular system function (Body measurement)
comment: 1 MD05837 2 Blood supply to the heart 3 None 4 Blood supply to the heart 5 54622005 6 normal oxygen supply 7 Normal oxygen supply (finding) 8 Blood supply to the heart 9 C2371010

Blood vessel functions
type: Class
subclass of: Cardiovascular system function (Body measurement)
comment: 1 MD05840 2 Blood vessel functions 3 None 4 Blood vessel functions 5 21829004 6 blood vessel finding 7 Blood vessel finding (finding) 8 Blood vessel functions 9 C2371016

Blow -accident
type: Class
subclass of: Health Related Factors
comment: 1 M02214 2 Blow -accident 3 None 4 Blow -accident 5 125667009 6 blow 7 Contusion (disorder) 8 Blow -accident 9 C0413399

Blowing exercises
type: Class
subclass of: Active exercise
comment: 1 M00268 2 Blowing exercises 3 None 4 Blowing exercises 5 229128005 6 Blowing exercises 7 Blowing exercises (regime/therapy) 8 Blowing exercises 9 C0454338

Board board
type: Class
subclass of: Tool
comment: 1 MD05454 2 Board board 3 None 4 Board board 5 367556001 6 Work board 7 Work board (physical object) 8 Work board 9 C1288292

Body
type: Class
subclass of: Musculoskeletal function (Body region)
comment: 1 M00116 2 body 3 None 4 Body 5 123037004 6 Body structure 7 Body structure (body structure) 8 Body structure 9 C1268086

Body Battery
type: Class
subclass of: Equipment
comment: 1 MD02570 2 Body Battery 3 None 4 Body Battery 5 54709006 6 Body measurement 7 Body measurement (procedure) 8 Body measure procedure 9 C0203910

Body Temperature Change
type: Class
subclass of: Hospital information, examination/diagnosis/treatment data
comment: 1 M00765 2 Body Temperature Change 3 Body temperature changes Body Temperature Changes body changes temperature body change temperature body changes temperatures 4 Body Temperature Change 5 386725007 6 Body temperature 7 Body temperature (observable entity) 8 Body Temperature Changes 9 C0005904
alternative label: Body Temperature Changes
alternative label: body changes temperatures
alternative label: body changes temperature
alternative label: body change temperature

Body Weight decreased
type: Class
subclass of: Hospital information, examination/diagnosis/treatment data
comment: 1 M01609 2 Body Weight decreased 3 None 4 Body Weight decreased 5 262285001 6 Weight decreased 7 Weight decreased (finding) 8 Weight decreased 9 C1262477

Body and pubic hair development
type: Class
subclass of: Functions of Blood System, Metabolic system and Endocrine system (Body measurement)
comment: 1 MD05971 2 Body and pubic hair development 3 None 4 Body and pubic hair development 5 247532006 6 Development of pubic hair 7 Development pattern of pubic hair (observable entity) 8 Body and pubic hair development 9 C2371942

Body bone
type: Class
subclass of: Musculoskeletal function (Body region)
comment: 1 M00140 2 Body bone 3 bone, Bones 4 Body bone 5 272673000 6 Bone structure 7 Bone structure (body structure) 8 Bone and Bones 9 C0005931
alternative label: Bones

Body growth problem
type: Class
subclass of: Disorder of nutrition
comment: 1 M00476 2 Body growth problem 3 None 4 Body growth problem 5 301329004 6 Body growth problem 7 Body growth problem (finding) 8 Body growth problem 9 C0578020

Body hair
type: Class
subclass of: Sensory function, Pain and Skin function (Body region)
comment: 1 MD07127 2 Body hair 3 None 4 Body hair 5 386045008 6 Hair 7 Hair structure (body structure) 8 Body hair 9 C2371961

Body height
type: Class
subclass of: Musculoskeletal function (Body measurement)
comment: 1 M00143 2 Body height 3 Bdy height 4 Body height 5 1153637007 6 Body height 7 Body height (observable entity) 8 Body height 9 C0005890
alternative label: Bdy height

Body image
type: Class
subclass of: Nervous system and Mental function (Body measurement)
comment: 1 MD05723 2 Body image 3 None 4 Body image 5 405045001 6 Body image 7 Body image (observable entity) 8 Body image 9 C0005891

Body of uterus
type: Class
subclass of: Urogenital function (Body region)
comment: 1 MD06989 2 Body of uterus 3 None 4 Body of uterus 5 23952005 6 Body of uterus 7 Body of uterus structure (body structure) 8 Body of uterus 9 C0227813

Body part structure
type: Class
subclass of: Hospital information, examination/diagnosis/treatment data
comment: 1 M00471 2 Body part structure 3 Body part body parts 4 Body part structure 5 38866009 6 Body part structure 7 Body part structure (body structure) 8 Body part structure 9 C0229962
alternative label: body parts

Body region structure
type: Class
subclass of: Hospital information, examination/diagnosis/treatment data
comment: 1 M01203 2 Body region structure 3 Body region Body regions 4 Body region structure 5 52530000 6 Body region structure 7 Body region structure (body structure) 8 Body Regions 9 C0005898
alternative label: Body region
alternative label: Body regions

Bodymedia FIT
type: Class
subclass of: Units
comment: 1 M05730 2 Bodymedia FIT 3 None 4 Bodymedia FIT 5 413568008 6 Application - unit of product usage (qualifier value) 7 Application - unit of product usage (qualifier value) 8 Application dose 9 C1533134

Bolus
type: Class
subclass of: Units
comment: 1 M03463 2 Bolus 3 None 4 Bolus 5 767524001 6 Unit of measure 7 Unit of measure (qualifier value) 8 Bolus Dosing Unit 9 C1705509

Bolus Dosing Unit
type: Class
subclass of: Units
comment: 1 M05285 2 Bolus Dosing Unit 3 None 4 Bolus Dosing Unit 5 767525000 6 unit 7 Unit (qualifier value) 8 Unit 9 C0439178

Bone Density
type: Class
subclass of: Musculoskeletal function (Body measurement)
comment: 1 M00772 2 Bone Density 3 Bone Densities 4 Bone Density 5 385342005 6 Bone density finding 7 Bone density finding (finding) 8 Bone Density 9 C0005938
alternative label: Bone Densities

Bone mineral density
type: Class
subclass of: Musculoskeletal function (Body measurement)
comment: 1 M00146 2 Bone mineral density 3 Bone Mineral Densities 4 Bone mineral density 5 385342005 6 Bone density finding 7 Bone density finding (finding) 8 Bone density 9 C0005938
alternative label: Bone Mineral Densities

Bone structure of hip
type: Class
subclass of: Musculoskeletal function (Body region)
comment: 1 M01573 2 Bone structure of hip 3 None 4 Bone structure of hip 5 304907005 6 Bone structure of hip joint region 7 Bone structure of hip joint region (body structure) 8 Bone structure of hip joint region 9 C5399828

Bone structure of sacrum
type: Class
subclass of: Musculoskeletal function (Body region)
comment: 1 M02114 2 Bone structure of sacrum 3 None 4 Bone structure of sacrum 5 54735007 6 Bone structure of sacrum 7 Bone structure of sacrum (body structure) 8 Bone structure of sacrum 9 C0036037

Bones of ankle and foot
type: Class
subclass of: Musculoskeletal function (Body region)
comment: 1 MD07074 2 Bones of ankle and foot 3 None 4 Bones of ankle and foot 5 304691001 6 Bone structure of ankle and/or foot 7 Bone structure of ankle and/or foot (body structure) 8 Bones of ankle and foot 9 C2371889

Bones of cranium
type: Class
subclass of: Musculoskeletal function (Body region)
comment: 1 MD07012 2 Bones of cranium 3 None 4 Bones of cranium 5 89546000 6 Cranium 7 Bone structure of cranium (body structure) 8 Bones of cranium 9 C0037303

Bones of face
type: Class
subclass of: Musculoskeletal function (Body region)
comment: 1 MD07013 2 Bones of face 3 None 4 Bones of face 5 91397008 6 Bone of face 7 Bone structure of face (body structure) 8 Bones of face 9 C0015455

Bones of forearm
type: Class
subclass of: Musculoskeletal function (Body region)
comment: 1 MD07036 2 Bones of forearm 3 None 4 Bones of forearm 5 299701004 6 Bone of forearm 7 Structure of bone of forearm (body structure) 8 Bones of forearm 9 C0223680

Bones of hand
type: Class
subclass of: Musculoskeletal function (Body region)
comment: 1 MD07043 2 Bones of hand 3 None 4 Bones of hand 5 85562004 6 Hand bone 7 Hand structure (body structure) 8 Bones of hand 9 C0448064

Bones of lower leg
type: Class
subclass of: Musculoskeletal function (Body region)
comment: 1 MD07067 2 Bones of lower leg 3 None 4 Bones of lower leg 5 702468001 6 Bone structure of lower leg 7 Bone structure of lower leg (body structure) 8 Bones of lower leg 9 C2371885

Bones of neck region
type: Class
subclass of: Musculoskeletal function (Body region)
comment: 1 MD07014 2 Bones of neck region 3 None 4 Bones of neck region 5 312779009 6 Bone structure of head and neck 7 Bone structure of head and/or neck (body structure) 8 Bones of neck region 9 C2371057

Bones of pelvic region
type: Class
subclass of: Musculoskeletal function (Body region)
comment: 1 MD07052 2 Bones of pelvic region 3 None 4 Bones of pelvic region 5 46633002 6 Entire pelvic bone 7 Entire bony pelvis (body structure) 8 Bones of pelvic region 9 C2371078

Bones of shoulder region
type: Class
subclass of: Musculoskeletal function (Body region)
comment: 1 MD07021 2 Bones of shoulder region 3 None 4 Bones of shoulder region 5 774007 6 Bone structure of shoulder region 7 Structure of head and/or neck (body structure) 8 Bones of shoulder region 9 C2371063

Bones of thigh
type: Class
subclass of: Musculoskeletal function (Body region)
comment: 1 MD07060 2 Bones of thigh 3 None 4 Bones of thigh 5 304692008 6 Bone structure of pelvic region and thigh 7 Bone structure of pelvic region and/or thigh (body structure) 8 Bones of thigh 9 C0015811

Bones of upper arm
type: Class
subclass of: Musculoskeletal function (Body region)
comment: 1 MD07029 2 Bones of upper arm 3 None 4 Bones of upper arm 5 40983000 6 Upper arm 7 Structure of upper extremity between shoulder and elbow (body structure) 8 Bones of upper arm 9 C0020164

Booster
type: Class
subclass of: Hospital information, examination/diagnosis/treatment data
comment: 1 MD00970 2 Booster 3 None 4 Booster 5 359953009 6 Booster vaccination 7 Booster vaccination (procedure) 8 Booster 1 9 C3842581

Both
type: Class
subclass of: Units
comment: 1 MD02642 2 Both 3 None 4 Both 5 51440002 6 both side 7 Right and left (qualifier value) 8 Both 9 C1706086

Bottle
type: Class
subclass of: Units
comment: 1 M05160 2 Bottle 3 Bottles 4 Bottle 5 68276009 6 Bottle 7 Bottle, device (physical object) 8 Bottle 9 C0179376
comment: 1 M05160-1 2 Bottle 3 Bottles 4 Bottle 5 68276009 6 Bottle 7 Bottle, device (physical object) 8 Bottle 9 C1633989
comment: 1 M05160-2 2 Bottle 3 Bottles 4 Bottle 5 68276009 6 Bottle 7 Bottle, device (physical object) 8 Bottle 9 C4319838
comment: 1 M05160-3 2 Bottle 3 Bottles 4 Bottle 5 419672006 6 Bottle 7 Bottle - unit of product usage (qualifier value) 8 Bottle 9 C0179376
comment: 1 M05160-4 2 Bottle 3 Bottles 4 Bottle 5 419672006 6 Bottle 7 Bottle - unit of product usage (qualifier value) 8 Bottle 9 C1633989
comment: 1 M05160-5 2 Bottle 3 Bottles 4 Bottle 5 419672006 6 Bottle 7 Bottle - unit of product usage (qualifier value) 8 Bottle 9 C4319838
comment: 1 M05160-6 2 Bottle 3 Bottles 4 Bottle 5 732986007 6 Bottle 7 Bottle (unit of presentation) 8 Bottle 9 C0179376
comment: 1 M05160-7 2 Bottle 3 Bottles 4 Bottle 5 732986007 6 Bottle 7 Bottle (unit of presentation) 8 Bottle 9 C1633989
comment: 1 M05160-8 2 Bottle 3 Bottles 4 Bottle 5 732986007 6 Bottle 7 Bottle (unit of presentation) 8 Bottle 9 C4319838
alternative label: Bottles

Bottle - unit of product usage
type: Class
subclass of: Units
comment: 1 M05158 2 Bottle - unit of product usage 3 None 4 Bottle - unit of product usage 5 419672006 6 Bottle - unit of product usage 7 Bottle - unit of product usage (qualifier value) 8 Bottle - unit of product usage 9 C1633989

Bottle Dosing Unit
type: Class
subclass of: Units
comment: 1 M05157 2 Bottle Dosing Unit 3 None 4 Bottle Dosing Unit 5 68276009 6 Bottle 7 Bottle, device (physical object) 8 Bottle 9 C0179376

Bowling
type: Class
subclass of: Sport
comment: 1 M00387 2 Bowling 3 None 4 Bowling 5 40376000 6 Bowling 7 Bowling (qualifier value) 8 Bowling (activity) 9 C0336949

Box
type: Class
subclass of: Device
comment: 1 M03471 2 Box 3 None 4 Box 5 415183006 6 Box 7 Protective cup, device (physical object) 8 Protective cup 9 C1533124
comment: 1 M03471-1 2 Box 3 None 4 Box 5 415183006 6 Box 7 Protective cup, device (physical object) 8 Box - unit dose 9 C1638312
comment: 1 M03471-2 2 Box 3 None 4 Box 5 418445004 6 Box 7 Box - unit of product usage (qualifier value) 8 Protective cup 9 C1533124
comment: 1 M03471-3 2 Box 3 None 4 Box 5 418445004 6 Box 7 Box - unit of product usage (qualifier value) 8 Box - unit dose 9 C1638312

Box Dosing Unit
type: Class
subclass of: Units
comment: 1 M05305 2 Box Dosing Unit 3 None 4 Box Dosing Unit 5 418445004 6 Box 7 Box - unit of product usage (qualifier value) 8 Box Dosing Unit 9 C1706087

Box and Block Test
type: Class
subclass of: Questionnaire
comment: 1 MD04483 2 Box and Block Test 3 None 4 Box and Block Test 5 272393004 6 Tests 7 Tests (qualifier value) 8 Tests (qualifier value) 9 C0392366

Brachial pulse absent
type: Class
subclass of: Cardiovascular system function (Symptom)
comment: 1 M00190 2 Brachial pulse absent 3 None 4 Brachial pulse absent 5 301164000 6 Brachial pulse absent 7 Brachial pulse absent (finding) 8 Brachial pulse absent 9 C0577853

Brachial pulse present
type: Class
subclass of: Cardiovascular system function (Body measurement)
comment: 1 M00191 2 Brachial pulse present 3 None 4 Brachial pulse present 5 301154009 6 Brachial pulse present 7 Brachial pulse present (finding) 8 Brachial pulse present 9 C0577843

Bradycardia - pulse
type: Class
subclass of: Cardiovascular system function (Symptom)
comment: 1 M02839 2 Bradycardia - pulse 3 low heart rate 4 Bradycardia - pulse 5 42177007 6 Bradycardia - pulse 7 Pulse slow (finding) 8 Pulse slow (finding) 9 C2230138
alternative label: low heart rate

Bradypnea
type: Class
subclass of: Respiratory function (Symptom)
comment: 1 M01872 2 Bradypnea 3 BRADYPNOEA low respiratory rate 4 Bradypnea 5 86684002 6 Bradypnea 7 Slow respiration (finding) 8 Bradypnea 9 C0231837
alternative label: low respiratory rate
alternative label: BRADYPNOEA

Break Set
type: Class
subclass of: Units
comment: 1 MD02652 2 Break Set 3 None 4 Break Set 5 767525000 6 Unit 7 Unit (qualifier value) 8 Unit 9 C0439148

Breakdown of food
type: Class
subclass of: Digestive function (Body measurement)
comment: 1 MD05926 2 Breakdown of food 3 None 4 Breakdown of food 5 1202003 6 mastication 7 Mastication (observable entity) 8 Breakdown of food 9 C2371125

Breaking out - eruption
type: Class
subclass of: Sensory function, Pain and Skin function (Symptom)
comment: 1 M00951 2 Breaking out - eruption 3 None 4 Breaking out - eruption 5 271807003 6 Breaking out - eruption 7 Eruption of skin (disorder) 8 Eruption 9 C5445217

Breast and nipple
type: Class
subclass of: Urogenital function (Body region)
comment: 1 MD06994 2 Breast and nipple 3 None 4 Breast and nipple 5 76752008 6 Breast 7 Breast structure (body structure) 8 Breast and nipple 9 C2371047
comment: 1 MD06994-1 2 Breast and nipple 3 None 4 Breast and nipple 5 24142002 6 Nipple 7 Nipple structure (body structure) 8 Breast and nipple 9 C2371047

Breast and nipple development
type: Class
subclass of: Functions of Blood System, Metabolic system and Endocrine system (Body measurement)
comment: 1 MD05972 2 Breast and nipple development 3 None 4 Breast and nipple development 5 364375002 6 Development of the breasts 7 Development of the breasts (observable entity) 8 Breast and nipple development 9 C2371943

Breath
type: Class
subclass of: Respiratory function (Body measurement)
comment: 1 MD00900 2 Breath 3 Breaths, breathe 4 Breath 5 11891009 6 Breath 7 Breath (substance) 8 Breath 9 C0225386
alternative label: breathe
alternative label: Breaths

Breath Shortnesses
type: Class
subclass of: Respiratory function (Symptom)
comment: 1 M00887 2 Breath Shortnesses 3 shortness of breath, breathing shortness, Short of breath symptom, Shortness of breath symptom, SOB - Shortness of breath 4 Breath Shortnesses 5 267036007 6 shortness of breath 7 Dyspnea (finding) 8 Dyspnea 9 C0013404
alternative label: breathing shortness
alternative label: Shortness of breath symptom
alternative label: Short of breath symptom
alternative label: SOB - Shortness of breath
alternative label: shortness of breath

Breathing Reserve
type: Class
subclass of: Hospital information, examination/diagnosis/treatment data
comment: 1 MD03177 2 Breathing Reserve 3 None 4 Breathing Reserve 5 8064003 6 Breathing 7 Respiratory function (observable entity) 8 Respiration 9 C0035203

Breathing frequency
type: Class
subclass of: Respiratory function (Body measurement)
comment: 1 M05896 2 Breathing frequency 3 None 4 Breathing frequency 5 86290005 6 Respiratory frequency 7 Respiratory rate (observable entity) 8 Respiratory flow rate 9 C0429714

Breathing painful
type: Class
subclass of: Respiratory function (Symptom)
comment: 1 M02242 2 Breathing painful 3 Painful breathing breath pain breathing pain breathing pains breaths painful pain breathing painful breath 4 Breathing painful 5 75483001 6 Breathing painful 7 Breathing painful (finding) 8 Breathing painful 9 C0423729
alternative label: breaths painful
alternative label: breath pain
alternative label: breathing pains
alternative label: pain breathing
alternative label: Painful breathing
alternative label: painful breath
alternative label: breathing pain

Breathing score
type: Class
subclass of: Units
comment: 1 MD01799 2 Breathing score 3 None 4 Breathing score 5 251880004 6 Breathing rate 7 Respiratory measure (observable entity) 8 Respiratory rate 9 C0231832

Breathless
type: Class
subclass of: Respiratory function (Symptom)
comment: 1 M00890 2 Breathless 3 Breathlessness, Breathlessness symptom 4 Breathless 5 267036007 6 Breathless 7 Dyspnea (finding) 8 Dyspnea 9 C0013404
alternative label: Breathlessness
alternative label: Breathlessness symptom

Brief measure of activity performance
type: Class
subclass of: Tool
comment: 1 MD04507 2 Brief measure of activity performance 3 None 4 Brief measure of activity performance 5 491000124103 6 Clinical performance measure 7 Clinical performance measure (observable entity) 8 Clinical performance measure 9 C3266594

Brief measure of activity performance for Upper Limb Amputee
type: Class
subclass of: Tool
comment: 1 MD04505 2 Brief measure of activity performance for Upper Limb Amputee 3 None 4 Brief measure of activity performance for Upper Limb Amputee 5 491000124103 6 Clinical performance measure 7 Clinical performance measure (observable entity) 8 Clinical performance measure 9 C3266594

Bronchial tree
type: Class
subclass of: Respiratory function (Body region)
comment: 1 MD06944 2 Bronchial tree 3 None 4 Bronchial tree 5 372170000 6 bronchial part 7 Bronchial part (body structure) 8 Bronchial tree 9 C0819141

Broomball
type: Class
subclass of: Sport
comment: 1 M00389 2 Broomball 3 None 4 Broomball 5 415577004 6 Sport 7 Sport (qualifier value) 8 Sports 9 C0038039

Brunnstrom Stage
type: Class
subclass of: Units
comment: 1 MD03098 2 Brunnstrom Stage 3 None 4 Brunnstrom Stage 5 261612004 6 Stages 7 Stages (qualifier value) 8 Stage 9 C1306673

Budd-Chiari syndrome
type: Class
subclass of: Digestive function (Symptom)
comment: 1 MD00424 2 Budd-Chiari syndrome 3 None 4 Budd-Chiari syndrome 5 82385007 6 Budd-Chiari syndrome 7 Budd-Chiari syndrome (disorder) 8 Budd-Chiari syndrome 9 C0856761

Bullous
type: Class
subclass of: Sensory function, Pain and Skin function (Symptom)
comment: 1 MD00342 2 Bullous 3 None 4 Bullous 5 46077008 6 Bullous 7 Bullous (qualifier value) 8 Bullous 9 C0205405

Bullous disorders
type: Class
subclass of: Structures of disability
subclass of: Sensory function, Pain and Skin function (Symptom)
comment: 1 MD00485 2 Bullous disorders 3 None 4 Bullous disorders 5 46077008 6 Bullous 7 Bullous (qualifier value) 8 Bullous disease 9 C3149269
comment: Clinical+Disability Classification of disability Structures of disability 1 MD00050 2 Bullous disorders 3 None 4 Bullous disorders 5 46077008 6 Bullous 7 Bullous (qualifier value) 8 Other specified bullous disorders 9 C0477471

Bullous pemphigoid
type: Class
subclass of: Sensory function, Pain and Skin function (Symptom)
comment: 1 MD00487 2 Bullous pemphigoid 3 None 4 Bullous pemphigoid 5 77090002 6 Bullous pemphigoid 7 Bullous pemphigoid (disorder) 8 Bullous pemphigoid 9 C0030805

Burden work
type: Class
subclass of: Questionnaire
comment: 1 MD05054 2 Burden work 3 None 4 Burden work 5 261041009 6 Working 7 Working, function (observable entity) 8 work 9 C0043227

Burden work in case of disaster investigation
type: Class
subclass of: Questionnaire
comment: 1 MD04883 2 Burden work in case of disaster investigation 3 None 4 Burden work in case of disaster investigation 5 261041009 6 Working 7 Working, function (observable entity) 8 equipment 9 C0014672

Bus
type: Class
subclass of: Equipment
comment: 1 MD05482 2 Bus 3 None 4 Bus 5 22674006 6 Bus 7 Motor bus, device (physical object) 8 Bus 9 C0336815

Business date
type: Class
subclass of: Day
comment: 1 MD04919 2 Business date 3 None 4 Business date 5 410671006 6 Date 7 Date (attribute) 8 Business Day 9 C1707064

Business visit
type: Class
subclass of: Questionnaire
comment: 1 MD04909 2 Business visit 3 None 4 Business visit 5 103324002 6 Visit for 7 Patient visit for (contextual qualifier) (qualifier value) 8 visit 9 C0545082

Buying a place to live
type: Class
subclass of: Health Related Factors
comment: 1 MD06412 2 Buying a place to live 3 None 4 Buying a place to live 5 264362003 6 Home 7 Home (environment) 8 Buying a place to live 9 C2371483

http://www.semanticweb.org/user/ontologies/2023/10/untitled-ontology-5#C
type: Class
subclass of: Units
comment: 1 M02918 2 C 3 None 4 C 5 257962003 6 C 7 Upper case Roman letter C (qualifier value) 8 C 9 C0439106

CARBON MONOXIDE EXPOSURE
type: Class
subclass of: Individual Related Factors
comment: 1 M01994 2 CARBON MONOXIDE EXPOSURE 3 None 4 CARBON MONOXIDE EXPOSURE 5 95875007 6 Carbon monoxide exposure 7 Exposure to carbon monoxide (event) 8 Carbon monoxide exposure 9 C0238889

CATCH22 syndrome
type: Class
subclass of: Hospital information, examination/diagnosis/treatment data
comment: 1 MD00496 2 CATCH22 syndrome 3 None 4 CATCH22 syndrome 5 767263007 6 22q11.2 deletion syndrome 7 22q11.2 deletion syndrome (disorder) 8 CATCH22 syndrome gene 9 C1440212

CH
type: Class
subclass of: Units
comment: 1 M05289 2 CH 3 None 4 CH 5 767525000 6 unit 7 Unit (qualifier value) 8 Unit 9 C0439180

CMC ROM
type: Class
subclass of: Musculoskeletal function (Body measurement)
comment: 1 MD04001 2 CMC ROM 3 None 4 CMC ROM 5 364564000 6 Range of motion 7 Range of joint movement (observable entity) 8 range of motion of hand 9 C2237184

COLLAPSE FLEETING
type: Class
subclass of: Nervous system and Mental function (Symptom)
comment: 1 M01453 2 COLLAPSE FLEETING 3 None 4 COLLAPSE FLEETING 5 271594007 6 Syncope 7 Syncope (finding) 8 Head 9 C0018670

COLLAPSE TRANSIENT
type: Class
subclass of: Nervous system and Mental function (Symptom)
comment: 1 M01455 2 COLLAPSE TRANSIENT 3 None 4 COLLAPSE TRANSIENT 5 271594007 6 Syncope 7 Syncope (finding) 8 Head 9 C0018670

COORDINATION ABNORMAL
type: Class
subclass of: Nervous system and Mental function (Symptom)
comment: 1 M02566 2 COORDINATION ABNORMAL 3 None 4 COORDINATION ABNORMAL 5 302289002 6 Abnormal coordination 7 Coordination problem (finding) 8 Abnormal coordination 9 C0520966

COORDINATION IMPAIRED
type: Class
subclass of: Nervous system and Mental function (Symptom)
comment: 1 M02570 2 COORDINATION IMPAIRED 3 None 4 COORDINATION IMPAIRED 5 302289002 6 Coordination problem 7 Coordination problem (finding) 8 Abnormal coordination 9 C0520966

CORE
type: Class
subclass of: Musculoskeletal function (Body region)
comment: 1 MD02012 2 CORE 3 None 4 CORE 5 26216008 6 Central 7 Central (qualifier value) 8 Core 9 C0444669
comment: 1 MD02012-1 2 CORE 3 None 4 CORE 5 260235002 6 Core 7 Core (qualifier value) 8 Core 9 C0444669

CORE TWIST
type: Class
subclass of: Aerobic Exercise
comment: 1 MD02022 2 CORE TWIST 3 None 4 CORE TWIST 5 51795009 6 Twisting 7 Musculoskeletal torsion (observable entity) 8 Musculoskeletal torsion, function 9 C0040480

COUGHING BLOOD
type: Class
subclass of: Respiratory function (Symptom)
comment: 1 M01106 2 COUGHING BLOOD 3 Coughing up blood 4 COUGHING BLOOD 5 66857006 6 Coughing up blood 7 Hemoptysis (finding) 8 Hemoptysis 9 C0019079

CQ
type: Class
subclass of: Units
comment: 1 M05296 2 CQ 3 None 4 CQ 5 767525000 6 unit 7 Unit (qualifier value) 8 Unit 9 C0439180

CTG
type: Class
subclass of: Units
comment: 1 M05295 2 CTG 3 None 4 CTG 5 767525000 6 unit 7 Unit (qualifier value) 8 Unit 9 C0439180

CTR
type: Class
subclass of: Units
comment: 1 M05287 2 CTR 3 None 4 CTR 5 767525000 6 unit 7 Unit (qualifier value) 8 Unit 9 C0439178

CT diagnosis
type: Class
subclass of: Hospital information, examination/diagnosis/treatment data
comment: 1 MD00208 2 CT diagnosis 3 None 4 CT diagnosis 5 4261000179100 6 Computed tomography imaging report 7 Computed tomography imaging report (record artifact) 8 Computed tomography imaging report 9 C4274378

CYL
type: Class
subclass of: Units
comment: 1 M05261 2 CYL 3 None 4 CYL 5 732992001 6 Cylinder 7 Cylinder (unit of presentation) 8 Cylinder (unit of presentation) 9 C4319645

Cable machine based
type: Class
subclass of: Aerobic Exercise
comment: 1 MD02752 2 Cable machine based 3 None 4 Cable machine based 5 256235009 6 Exercise 7 Exercise (observable entity) 8 Exercise 9 C0015259

Calculating
type: Class
subclass of: Health Related Factors
comment: 1 MD06182 2 Calculating 3 Calculation functions 4 Calculating 5 844005 6 Behavior finding 7 Behavior finding (finding) 8 Calculating 9 C1441506
alternative label: Calculation functions

Calf
type: Class
subclass of: Musculoskeletal function (Body region)
comment: 1 M00349 2 Calf 3 None 4 Calf 5 53840002 6 calf of leg 7 Structure of calf of leg (body structure) 8 Structure of calf of leg 9 C0230445

Calisthenic
type: Class
subclass of: Active exercise
comment: 1 M00782 2 Calisthenic 3 Calisthenics 4 Calisthenic 5 30870002 6 General calisthenic exercise regimen 7 General calisthenic exercise regimen (regime/therapy) 8 Calisthenics 9 C0006759
alternative label: Calisthenics

Caloric Intake
type: Class
subclass of: Nutrient intake
comment: 1 M00784 2 Caloric Intake 3 None 4 Caloric Intake 5 87787004 6 Calorie intake 7 Energy intake (observable entity) 8 Energy Intake 9 C0006777

Caloric dietary content
type: Class
subclass of: Nutrient intake
comment: 1 M00783 2 Caloric dietary content 3 None 4 Caloric dietary content 5 87276001 6 Dietary status 7 Nutritional status (observable entity) 8 Energy Intake 9 C0006777

Calorie intake 24h
type: Class
subclass of: Units
comment: 1 M03097 2 Calorie intake 24h 3 None 4 Calorie intake 24h 5 787787004 6 Calorie intake 7 Energy intake (observable entity) 8 Calorie intake.total:EngRat:24H:^Patient:Qn 9 C0489069

Calorie intake total 24 hour
type: Class
subclass of: Units
comment: 1 M04491 2 Calorie intake total 24 hour 3 None 4 Calorie intake total 24 hour 5 767525000 6 Unit 7 Unit (qualifier value) 8 Unit 9 C0439148

Calories burned in 24 hour Calculated
type: Class
subclass of: Nutritional status
comment: 1 M05203 2 Calories burned in 24 hour Calculated 3 Calories burned 24h Calc 4 Calories burned in 24 hour Calculated 5 258790008 6 calories 7 calorie (qualifier value) 8 calories 9 C1879985
alternative label: Calories burned 24h Calc

Calories per unit time
type: Class
subclass of: Units
comment: 1 M03183 2 Calories per unit time 3 None 4 Calories per unit time 5 282407004 6 Calories per unit time 7 Calories per unit time (qualifier value) 8 Calories per unit time 9 C0560294

Can
type: Class
subclass of: Units
comment: 1 M03454 2 Can 3 None 4 Can 5 429308001 6 Can 7 Can - unit of product usage (qualifier value) 8 Can Dosing Unit 9 C1704713

Can - unit of product usage
type: Class
subclass of: Units
comment: 1 M05267 2 Can - unit of product usage 3 None 4 Can - unit of product usage 5 429308001 6 Can - unit of product usage 7 Can - unit of product usage (qualifier value) 8 Can - unit of product usage 9 C1704713

Can Dosing Unit
type: Class
subclass of: Units
comment: 1 M05266 2 Can Dosing Unit 3 None 4 Can Dosing Unit 5 429308001 6 can 7 Can - unit of product usage (qualifier value) 8 Can Dosing Unit 9 C1704713

Canadian Occupational Performance Measure
type: Class
subclass of: Questionnaire
comment: 1 MD04572 2 Canadian Occupational Performance Measure 3 None 4 Canadian Occupational Performance Measure 5 439313007 6 Canadian occupational performance measure 7 Canadian occupational performance measure (assessment scale) 8 Canadian occupational performance measure 9 C2585956

Canalis inguinalis
type: Class
subclass of: Sensory function, Pain and Skin function (Body region)
comment: 1 M01759 2 Canalis inguinalis 3 None 4 Canalis inguinalis 5 90785001 6 Inguinal canal 7 Inguinal canal structure (body structure) 8 Inguinal canal structure 9 C0021445

Cancer patient
type: Class
subclass of: Classification of Patient
comment: 1 MD00275 2 Cancer patient 3 cancer patients 4 Cancer patient 5 395672005 6 Cancer diagnosis discussed with patient 7 Cancer diagnosis discussed with patient (situation) 8 Cancer Patient 9 C1516213
alternative label: cancer patients

Candela
type: Class
subclass of: Units
comment: 1 M04707 2 Candela 3 None 4 Candela 5 282254003 6 candela 7 candela (qualifier value) 8 candela 9 C0700300

Canites
type: Class
subclass of: Sensory function, Pain and Skin function (Symptom)
comment: 1 M02637 2 Canites 3 None 4 Canites 5 297994000 6 Canites 7 Gray hair (finding) 8 Gray hair 9 C0574765

Cannonball pulse
type: Class
subclass of: Cardiovascular system function (Symptom)
comment: 1 M01901 2 Cannonball pulse 3 None 4 Cannonball pulse 5 44922000 6 Cannonball pulse 7 Collapsing pulse (finding) 8 Cannonball pulse 9 C0232123

Cannot feel pulse
type: Class
subclass of: Cardiovascular system function (Symptom)
comment: 1 M02083 2 Cannot feel pulse 3 Can't feel pulse 4 Cannot feel pulse 5 54518005 6 Cannot feel pulse 7 Absent pulse (finding) 8 Cannot feel pulse 9 C0277899
alternative label: Can't feel pulse

Cannot pass urine - retention
type: Class
subclass of: Urogenital function (Symptom)
comment: 1 M01649 2 Cannot pass urine - retention 3 None 4 Cannot pass urine - retention 5 267064002 6 Cannot pass urine - retention 7 Retention of urine (disorder) 8 Cannot pass urine - retention 9 C0080274

Cannot sleep at all
type: Class
subclass of: Nervous system and Mental function (Symptom)
comment: 1 M00032 2 Cannot sleep at all 3 cannot sleep, Cannot sleep - insomnia 4 Cannot sleep at all 5 248255005 6 Cannot sleep at all 7 Cannot sleep at all (finding) 8 Cannot sleep at all 9 C0424565
alternative label: Cannot sleep - insomnia
alternative label: Unable to sleep
alternative label: cannot sleep

Cannot wake up
type: Class
subclass of: Nervous system and Mental function (Symptom)
comment: 1 M02285 2 Cannot wake up 3 None 4 Cannot wake up 5 248261008 6 Cannot wake up 7 Oversleeps (disorder) 8 Oversleeps 9 C0424572

Canoeing
type: Class
subclass of: Sport
comment: 1 M00391 2 Canoeing 3 canoe, Engaged in canoeing 4 Canoeing 5 102399007 6 Canoeing 7 Canoeing (qualifier value) 8 Canoeing 9 C0522726
alternative label: Engaged in canoeing
alternative label: canoe

Capillaries
type: Class
subclass of: Cardiovascular system function (Body region)
comment: 1 MD06930 2 Capillaries 3 Functions of capillaries 4 Capillaries 5 20982000 6 capillary 7 Structure of capillary blood vessel (body structure) 8 Capillaries 9 C0935624
alternative label: Functions of capillaries

Caplet
type: Class
subclass of: Units
comment: 1 M03498 2 Caplet 3 None 4 Caplet 5 767525000 6 Unit 7 Unit (qualifier value) 8 Caplet Dosing Unit 9 C1879996

Caplet Dosing Unit
type: Class
subclass of: Units
comment: 1 M05370 2 Caplet Dosing Unit 3 None 4 Caplet Dosing Unit 5 767525000 6 unit 7 Unit (qualifier value) 8 Caplet Dosing Unit 9 C1879996

Capsule
type: Class
subclass of: Units
comment: 1 M03479 2 Capsule 3 None 4 Capsule 5 385049006 6 Capsule 7 Capsule (basic dose form) 8 capsule (pharmacologic) 9 C0006935
comment: 1 M03479-1 2 Capsule 3 None 4 Capsule 5 385049006 6 Capsule 7 Capsule (basic dose form) 8 Capsule Dosing Unit 9 C1706433
comment: 1 M03479-2 2 Capsule 3 None 4 Capsule 5 385049006 6 Capsule 7 Capsule (basic dose form) 8 Capsule (unit of presentation) 9 C4319574
comment: 1 M03479-3 2 Capsule 3 None 4 Capsule 5 428641000 6 Capsule 7 Capsule - unit of product usage (qualifier value) 8 capsule (pharmacologic) 9 C0006935
comment: 1 M03479-4 2 Capsule 3 None 4 Capsule 5 428641000 6 Capsule 7 Capsule - unit of product usage (qualifier value) 8 Capsule Dosing Unit 9 C1706433
comment: 1 M03479-5 2 Capsule 3 None 4 Capsule 5 428641000 6 Capsule 7 Capsule - unit of product usage (qualifier value) 8 Capsule (unit of presentation) 9 C4319574
comment: 1 M03479-6 2 Capsule 3 None 4 Capsule 5 732937005 6 Capsule 7 Capsule (unit of presentation) 8 capsule (pharmacologic) 9 C0006935
comment: 1 M03479-7 2 Capsule 3 None 4 Capsule 5 732937005 6 Capsule 7 Capsule (unit of presentation) 8 Capsule Dosing Unit 9 C1706433
comment: 1 M03479-8 2 Capsule 3 None 4 Capsule 5 732937005 6 Capsule 7 Capsule (unit of presentation) 8 Capsule (unit of presentation) 9 C4319574

Capsule - unit of product usage
type: Class
subclass of: Units
comment: 1 M05318 2 Capsule - unit of product usage 3 None 4 Capsule - unit of product usage 5 428641000 6 Capsule - unit of product usage 7 Capsule - unit of product usage (qualifier value) 8 Capsule - unit of product usage 9 C1706433

Capsule Dosing Unit
type: Class
subclass of: Units
comment: 1 M05317 2 Capsule Dosing Unit 3 None 4 Capsule Dosing Unit 5 428641000 6 Capsule 7 Capsule - unit of product usage (qualifier value) 8 Capsule - unit of product usage 9 C1706433

Caput
type: Class
subclass of: Musculoskeletal function (Body region)
comment: 1 M01449 2 Caput 3 None 4 Caput 5 271594007 6 Faint 7 Syncope (finding) 8 Head 9 C0018670

Carbohydrate metabolism
type: Class
subclass of: Functions of Blood System, Metabolic system and Endocrine system (Body measurement)
comment: 1 MD05950 2 Carbohydrate metabolism 3 None 4 Carbohydrate metabolism 5 47722004 6 metabolism 7 General metabolic function (observable entity) 8 Carbohydrate metabolism 9 C0302820

Carbon Dioxide uptake
type: Class
subclass of: Hospital information, examination/diagnosis/treatment data
comment: 1 MD03736 2 Carbon Dioxide uptake 3 None 4 Carbon Dioxide uptake 5 251408004 6 VCO2-Carbon dioxide output 7 Carbon dioxide output (observable entity) 8 Carbon dioxide output 9 C0429247

Carbon monoxide exposure
type: Class
subclass of: Physical/Chemical Environment
comment: 1 M00247 2 Carbon monoxide exposure 3 None 4 Carbon monoxide exposure 5 95875007 6 Carbon monoxide exposure 7 Exposure to carbon monoxide (event) 8 Exposure to carbon monoxide (event) 9 C0238889

Card
type: Class
subclass of: Tool
comment: 1 MD04188 2 Card 3 None 4 Card 5 246137000 6 equipment 7 Equipment (attribute) 8 equipment 9 C0014672

Cardiac murmur
type: Class
subclass of: Cardiovascular system function (Symptom)
comment: 1 M01083 2 Cardiac murmur 3 Cardiac Murmurs 4 Cardiac murmur 5 59935001 6 Functional cardiac murmur 7 Functional heart murmur (finding) 8 Heart murmur 9 C0018808
alternative label: Cardiac Murmurs

Cardiio
type: Class
subclass of: Units
comment: 1 M05731 2 Cardiio 3 None 4 Cardiio 5 413568008 6 Application - unit of product usage (qualifier value) 7 Application - unit of product usage (qualifier value) 8 Application dose 9 C1533134

Cardinal body part
type: Class
subclass of: Hospital information, examination/diagnosis/treatment data
comment: 1 M01803 2 Cardinal body part 3 None 4 Cardinal body part 5 4703008 6 Cardinal vein structure 7 Cardinal vein structure (body structure) 8 Body part 9 C0229962

Cardiology
type: Class
subclass of: Classification of Hospital
comment: 1 MD00679 2 Cardiology 3 None 4 Cardiology 5 394579002 6 Cardiology 7 Cardiology (qualifier value) 8 Cardiology discipline 9 C0007189

Cardiovascular endurance
type: Class
subclass of: Hospital information, examination/diagnosis/treatment data
comment: 1 MD02735 2 Cardiovascular endurance 3 None 4 Cardiovascular endurance 5 406203001 6 endurance 7 Endurance (observable entity) 8 Endurance 9 C0518031

Caring for body parts
type: Class
subclass of: Health Related Factors
comment: 1 MD06378 2 Caring for body parts 3 None 4 Caring for body parts 5 225364005 6 Care of body sites 7 Care of body sites (regime/therapy) 8 Caring for body parts 9 C2371459

Caring for fingernails
type: Class
subclass of: Health Related Factors
comment: 1 MD06382 2 Caring for fingernails 3 None 4 Caring for fingernails 5 286850002 6 Caring for general hygiene 7 Personal hygiene activities, function (observable entity) 8 Caring for fingernails 9 C2371461

Caring for hair
type: Class
subclass of: Health Related Factors
comment: 1 MD06381 2 Caring for hair 3 None 4 Caring for hair 5 21510004 6 Hair care 7 Care of hair (procedure) 8 Caring for hair 9 C0204713

Caring for household objects
type: Class
subclass of: Health Related Factors
comment: 1 MD06438 2 Caring for household objects 3 None 4 Caring for household objects 5 35359004 6 Family 7 Family (social concept) 8 Caring for household objects 9 C2371508

Caring for nose
type: Class
subclass of: Health Related Factors
comment: 1 MD06384 2 Caring for nose 3 None 4 Caring for nose 5 1230039003 6 Nose care 7 Nose care (regime/therapy) 8 Caring for nose 9 C2372049

Caring for skin
type: Class
subclass of: Health Related Factors
comment: 1 MD06379 2 Caring for skin 3 None 4 Caring for skin 5 225360001 6 Skin care 7 Skin care (regime/therapy) 8 Caring for skin 9 C0150773

Caring for teeth
type: Class
subclass of: Health Related Factors
comment: 1 MD06380 2 Caring for teeth 3 None 4 Caring for teeth 5 286850002 6 Caring for general hygiene 7 Personal hygiene activities, function (observable entity) 8 Caring for teeth 9 C2371460

Caring for toenails
type: Class
subclass of: Health Related Factors
comment: 1 MD06383 2 Caring for toenails 3 None 4 Caring for toenails 5 286850002 6 Caring for general hygiene 7 Personal hygiene activities, function (observable entity) 8 Caring for toenails 9 C0749563

Carry
type: Class
subclass of: Health Related Factors
comment: 1 MD04598 2 Carry 3 None 4 Carry 5 288345009 6 Does carry 7 Does carry (finding) 8 Does carry 9 C0699809

Carrying in the arms
type: Class
subclass of: Health Related Factors
comment: 1 MD06304 2 Carrying in the arms 3 None 4 Carrying in the arms 5 714970009 6 Ability to carry object with both arms 7 Ability to carry object with both arms (observable entity) 8 Carrying in the arms 9 C2371398

Carrying in the hands
type: Class
subclass of: Health Related Factors
comment: 1 MD06303 2 Carrying in the hands 3 None 4 Carrying in the hands 5 714968000 6 Ability to carry object with both hands 7 Ability to carry object with both hands (observable entity) 8 Carrying in the hands 9 C2371397

Carrying on the head
type: Class
subclass of: Health Related Factors
comment: 1 MD06306 2 Carrying on the head 3 None 4 Carrying on the head 5 714973006 6 Ability to carry object on head 7 Ability to carry object on head (observable entity) 8 Carrying on the head 9 C2371400

Carrying out daily routine
type: Class
subclass of: Health Related Factors
comment: 1 MD06210 2 Carrying out daily routine 3 None 4 Carrying out daily routine 5 844005 6 Behavior finding 7 Behavior finding (finding) 8 Carrying out daily routine 9 C2371320

Carrying out multiple tasks
type: Class
subclass of: Health Related Factors
comment: 1 MD06204 2 Carrying out multiple tasks 3 None 4 Carrying out multiple tasks 5 844005 6 Behavior finding 7 Behavior finding (finding) 8 Carrying out multiple tasks 9 C2371314

Cartridge
type: Class
subclass of: Units
comment: 1 M03468 2 Cartridge 3 None 4 Cartridge 5 706440002 6 Cartridge 7 Cartridge (physical object) 8 Cartridge device 9 C0179630
comment: 1 M03468-1 2 Cartridge 3 None 4 Cartridge 5 706440002 6 Cartridge 7 Cartridge (physical object) 8 Cartridge (unit of presentation) 9 C4319642
comment: 1 M03468-2 2 Cartridge 3 None 4 Cartridge 5 732988008 6 Cartridge 7 Cartridge (unit of presentation) 8 Cartridge device 9 C0179630
comment: 1 M03468-3 2 Cartridge 3 None 4 Cartridge 5 732988008 6 Cartridge 7 Cartridge (unit of presentation) 8 Cartridge (unit of presentation) 9 C4319642

Cartridge Dosing Unit
type: Class
subclass of: Units
comment: 1 M05297 2 Cartridge Dosing Unit 3 None 4 Cartridge Dosing Unit 5 732988008 6 Cartridge 7 Cartridge (unit of presentation) 8 Cartridge Dosing Unit 9 C1705968

Cast body substance
type: Class
subclass of: Units
comment: 1 M02855 2 Cast body substance 3 Casts body substance 4 Cast body substance 5 118413007 6 Body cast 7 Body cast, device (physical object) 8 Cast body substance 9 C0302143
alternative label: Casts body substance

Casts per high power field
type: Class
subclass of: Units
comment: 1 M04098 2 Casts per high power field 3 casts/high power field casts/HPF 4 Casts per high power field 5 258874003 6 Casts per high power field 7 Casts per high power field (qualifier value) 8 Casts per high power field 9 C0439377
alternative label: casts/high power field
alternative label: casts/HPF

Catathrenia
type: Class
subclass of: Voice and Speaking (Symptom)
comment: 1 M02838 2 Catathrenia 3 None 4 Catathrenia 5 429266002 6 Catathrenia 7 Sleep-related groaning (disorder) 8 Sleep-related groaning 9 C1997918

Catching
type: Class
subclass of: Health Related Factors
comment: 1 MD06328 2 Catching 3 None 4 Catching 5 30623001 6 Catch 7 Catch (finding) 8 Catching 9 C2584298

Cause of Onset
type: Class
subclass of: Hospital information, examination/diagnosis/treatment data
comment: 1 MD03043 2 Cause of Onset 3 None 4 Cause of Onset 5 370139004 6 Onsets 7 Onsets (qualifier value) 8 Onsets (qualifier value) 9 C1299997

Cause of disease
type: Class
subclass of: Hospital information, examination/diagnosis/treatment data
comment: 1 MD03297 2 Cause of disease 3 None 4 Cause of disease 5 410666004 6 Reason for 7 Reason for (attribute) 8 reason for 9 C0392360

Centare
type: Class
subclass of: Units
comment: 1 M04463 2 Centare 3 None 4 Centare 5 767525000 6 Unit 7 Unit (qualifier value) 8 Unit 9 C0439148

Centigram
type: Class
subclass of: Units
comment: 1 M04721 2 Centigram 3 None 4 Centigram 5 396156008 6 Centigram 7 Centigram (qualifier value) 8 Centigram 9 C1275572

Centiliter
type: Class
subclass of: Units
comment: 1 M04487 2 Centiliter 3 centilitre 4 Centiliter 5 258772007 6 Centiliter 7 Centiliter (qualifier value) 8 Centiliter 9 C0475212
alternative label: centilitre

Centimeter
type: Class
subclass of: Units
comment: 1 M04480 2 Centimeter 3 centimetre centimeters 4 Centimeter 5 258672001 6 Centimeter 7 Centimeter (qualifier value) 8 Centimeter 9 C0475210
alternative label: centimeters
alternative label: centimetre

Centimeters of Water Column
type: Class
subclass of: Units
comment: 1 M04325 2 Centimeters of Water Column 3 None 4 Centimeters of Water Column 5 259019009 6 Centimetre of water 7 Centimeter of water (qualifier value) 8 Centimetre of water 9 C0439476

Centimole per Liter
type: Class
subclass of: Units
comment: 1 M05048 2 Centimole per Liter 3 Centimole/Liter 4 Centimole per Liter 5 767525000 6 unit 7 Unit (qualifier value) 8 Unit 9 C0439157
alternative label: Centimole/Liter

Central Sleep Disordered Breathing
type: Class
subclass of: Respiratory function (Symptom)
comment: 1 M02557 2 Central Sleep Disordered Breathing 3 Central Sleep-Disordered Breathings 4 Central Sleep Disordered Breathing 5 27405005 6 Central sleep apnea 7 Central sleep apnea syndrome (disorder) 8 Sleep-Disordered Breathing 9 C4551689
alternative label: Central Sleep-Disordered Breathings

Central hyperalimentation
type: Class
subclass of: Nutritional status
comment: 1 M01273 2 Central hyperalimentation 3 None 4 Central hyperalimentation 5 230114001 6 Central hyperalimentation 7 Central line feeding (regime/therapy) 8 Central hyperalimentation 9 C0559665

Central sleep apnea
type: Class
subclass of: Respiratory function (Symptom)
comment: 1 M02553 2 Central sleep apnea 3 Central sleep apnoea central apnea Central Apneas Central Sleep Apnea Syndrome Central Sleep Apneas Central sleep apnoea syndrome CSA - Central sleep apnea CSA - Central sleep apnoea sleep apnea central apnea central sleep apnea central 4 Central sleep apnea 5 27405005 6 Central sleep apnea 7 Central sleep apnea syndrome (disorder) 8 Sleep Apnea, Central 9 C0520680
alternative label: Central sleep apnoea
alternative label: Central sleep apnoea syndrome
alternative label: Central Sleep Apneas
alternative label: apnea central sleep
alternative label: Central Apneas
alternative label: sleep apnea central
alternative label: Central Sleep Apnea Syndrome
alternative label: central apnea
alternative label: apnea central
alternative label: CSA - Central sleep apnea
alternative label: CSA - Central sleep apnoea

Cephalalgia
type: Class
subclass of: Nervous system and Mental function (Symptom)
comment: 1 M01065 2 Cephalalgia 3 Cephalalgias 4 Cephalalgia 5 25064002 6 Cephalalgia 7 Headache (finding) 8 Cephalalgia or cephalgia 9 C0858544
alternative label: Cephalalgias

Cephalgia
type: Class
subclass of: Nervous system and Mental function (Symptom)
comment: 1 M01067 2 Cephalgia 3 cephalgias 4 Cephalgia 5 25064002 6 Cephalgia 7 Headache (finding) 8 Cephalalgia or cephalgia 9 C0858544
alternative label: cephalgias

Cephalodynia
type: Class
subclass of: Nervous system and Mental function (Symptom)
comment: 1 M01069 2 Cephalodynia 3 Cephalodynias 4 Cephalodynia 5 25064002 6 Cephalodynia 7 Headache (finding) 8 Cephalalgia or cephalgia 9 C0858544
alternative label: Cephalodynias

Ceremonies
type: Class
subclass of: Individual Related Factors
comment: 1 MD06546 2 Ceremonies 3 None 4 Ceremonies 5 272379006 6 Event 7 Event (event) 8 Ceremonies 9 C2371608

Cervical Cancer
type: Class
subclass of: Hospital information, examination/diagnosis/treatment data
comment: 1 MD00734 2 Cervical Cancer 3 None 4 Cervical Cancer 5 363354003 6 Cervical cancer 7 Malignant tumor of cervix (disorder) 8 cervical cancer 9 C4048328

Cervical Esophagus
type: Class
subclass of: Digestive function (Body region)
comment: 1 M00283 2 Cervical Esophagus 3 None 4 Cervical Esophagus 5 60075002 6 Cervical esophagus 7 Cervical esophagus structure (body structure) 8 Cervical part of esophagus 9 C0227186

Cervical Neck Region
type: Class
subclass of: Voice and Speaking (Body region)
comment: 1 M00342 2 Cervical Neck Region 3 None 4 Cervical Neck Region 5 45048000 6 Neck 7 Neck structure (body structure) 8 Cervical Neck Region 9 C1516428

Cervical mucus
type: Class
subclass of: Hospital information, examination/diagnosis/treatment data
comment: 1 MD01160 2 Cervical mucus 3 None 4 Cervical mucus 5 26859008 6 Cervical mucus 7 Cervical mucus (substance) 8 Cervical mucus 9 C0007872

Cervical position
type: Class
subclass of: Hospital information, examination/diagnosis/treatment data
comment: 1 MD01161 2 Cervical position 3 None 4 Cervical position 5 127898005 6 cervix part 7 Part of uterine cervix (body structure) 8 Part of uterine cervix 9 C1267666

Cervical vertebral column
type: Class
subclass of: Musculoskeletal function (Body region)
comment: 1 MD07084 2 Cervical vertebral column 3 None 4 Cervical vertebral column 5 1141983003 6 Cervical vertebral column region 7 Structure of cervical vertebral column region (body structure) 8 Cervical vertebral column 9 C0728985

Cessation of hair growth
type: Class
subclass of: Sensory function, Pain and Skin function (Symptom)
comment: 1 M01950 2 Cessation of hair growth 3 None 4 Cessation of hair growth 5 399289002 6 Cessation of hair growth 7 Failure of hair growth (finding) 8 Cessation of hair growth 9 C0232412

Cessation of smoking
type: Class
subclass of: Sub-Cultural Level
comment: 1 M02139 2 Cessation of smoking 3 cessation smoke, cessation smoking, of smoking cessation, smoke cessation 4 Cessation of smoking 5 8392000 6 non-smoker 7 Non-smoker (finding) 8 Cessation of smoking 9 C0337671
alternative label: of smoking cessation
alternative label: cessation smoking
alternative label: cessation smoke
alternative label: smoke cessation

Chair Make
type: Class
subclass of: Equipment
comment: 1 MD01928 2 Chair Make 3 None 4 Chair Make 5 49062001 6 Device 7 Device (physical object) 8 Devices 9 C0699733

Chair Type
type: Class
subclass of: Units
comment: 1 MD01924 2 Chair Type 3 None 4 Chair Type 5 410657003 6 Type 7 Type (attribute) 8 Type - attribute 9 C0332307

Changing basic body position
type: Class
subclass of: Health Related Factors
comment: 1 MD06275 2 Changing basic body position 3 None 4 Changing basic body position 5 397155001 6 Body position 7 Body position (observable entity) 8 Changing basic body position 9 C2371379

Character of fever
type: Class
subclass of: Hospital information, examination/diagnosis/treatment data
comment: 1 M02293 2 Character of fever 3 None 4 Character of fever 5 248430002 6 Character of fever 7 Pattern of fever (observable entity) 8 Pattern of fever 9 C0424758

Charcot-Marie-Tooth disease
type: Class
subclass of: Hospital information, examination/diagnosis/treatment data
comment: 1 MD00419 2 Charcot-Marie-Tooth disease 3 None 4 Charcot-Marie-Tooth disease 5 398100001 6 CMT - Charcot-Marie-Tooth disease 7 Hereditary motor and sensory neuropathy (disorder) 8 Charcot-Marie-Tooth Disease 9 C0007959

Charts
type: Class
subclass of: Units
comment: 1 MD01894 2 Charts 3 None 4 Charts 5 706825008 6 Chart 7 Chart (physical object) 8 Charts (device) 9 C0007963

Checker
type: Class
subclass of: Tool
comment: 1 MD04194 2 Checkr 3 None 4 Checker 5 246137000 6 equipment 7 Equipment (attribute) 8 equipment 9 C0014672

Chest CT
type: Class
subclass of: Digestive function (Body measurement)
comment: 1 MD00941 2 Chest CT 3 None 4 Chest CT 5 169069000 6 Chest CT 7 Computed tomography of chest (procedure) 8 Chest CT 9 C0202823

Chest Press
type: Class
subclass of: Muscle Strengthening Exercise
comment: 1 MD02630 2 Chest Press 3 None 4 Chest Press 5 256235009 6 exercise 7 Exercise (observable entity) 8 Exercise 9 C0015259

Chest pain on breathing
type: Class
subclass of: Respiratory function (Symptom)
comment: 1 M02247 2 Chest pain on breathing 3 breath chest pain breath chest pains breathing chest pain breathing chest pains chest breathing pain chest pain breathing pain chest breathing 4 Chest pain on breathing 5 274664007 6 Chest pain on breathing 7 Chest pain on breathing (finding) 8 Chest pain on breathing 9 C0423729
alternative label: breathing chest pains
alternative label: breath chest pains
alternative label: pain chest breathing
alternative label: breath chest pain
alternative label: chest pain breathing
alternative label: chest breathing pain
alternative label: breathing chest pain

Chewing
type: Class
subclass of: Health Related Factors
comment: 1 M00233 2 Chewing 3 chew, chewed 4 Chewing 5 1202003 6 Chewing 7 Mastication (observable entity) 8 Chewing 9 C0024888
alternative label: chewed
alternative label: chew

Chewing exercises
type: Class
subclass of: Active exercise
comment: 1 M00269 2 Chewing exercises 3 None 4 Chewing exercises 5 311681003 6 Chewing exercises 7 Chewing exercises (regime/therapy) 8 Chewing exercises 9 C0589278

Child-parent relationships
type: Class
subclass of: Individual Related Factors
comment: 1 MD06497 2 Child-parent relationships 3 Parent-child relationships 4 Child-parent relationships 5 272151006 6 Relationships 7 Relationships (qualifier value) 8 Child-parent relationships 9 C0030542
alternative label: Parent-child relationships

Child psychotherapy
type: Class
subclass of: Nervous system and Mental function (Therapy)
comment: 1 M00606 2 Child psychotherapy 3 None 4 Child psychotherapy 5 429159005 6 Child psychotherapy 7 Child psychotherapy (regime/therapy) 8 Child psychotherapy 9 C0870270

Child status
type: Class
subclass of: Units
comment: 1 MD03291 2 Child status 3 None 4 Child status 5 224118004 6 Number of offspring 7 Number of offspring (observable entity) 8 Offspring 9 C0680063

Children
type: Class
subclass of: Classification of Patient
comment: 1 MD00177 2 Children 3 None 4 Children 5 255398004 6 Childhood 7 Childhood (qualifier value) 8 Childhood 9 C0231335

Ching Lo
type: Class
subclass of: Hospital information, examination/diagnosis/treatment data
comment: 1 M01922 2 Ching Lo 3 None 4 Ching Lo 5 723688009 6 Traditional Chinese Medicine 7 Traditional Chinese Medicine (regime/therapy) 8 Meridians 9 C0085282

Chondromatosis
type: Class
subclass of: Musculoskeletal function (Symptom)
comment: 1 MD00517 2 Chondromatosis 3 None 4 Chondromatosis 5 83944004 6 Chondromatosis 7 Chondromatosis (morphologic abnormality) 8 Chondromatosis 9 C0206636
comment: 1 MD00517-1 2 Chondromatosis 3 None 4 Chondromatosis 5 302861008 6 Chondromatosis 7 Chondromatosis (disorder) 8 Chondromatosis 9 C0206636

Choosing appropriate clothing
type: Class
subclass of: Health Related Factors
comment: 1 MD06398 2 Choosing appropriate clothing 3 None 4 Choosing appropriate clothing 5 272180002 6 Clothing 7 Garment (physical object) 8 Choosing appropriate clothing 9 C2371469

Chromosome microdeletion
type: Class
subclass of: Hospital information, examination/diagnosis/treatment data
comment: 1 MD00498 2 Chromosome microdeletion panel 3 None 4 Chromosome microdeletion 5 471282000 6 Chromosome microdeletion 7 Chromosome microdeletion (finding) 8 471282000 9 C3532201

Chronological age
type: Class
subclass of: Units
comment: 1 MD01171 2 Chronological age 3 None 4 Chronological age 5 424144002 6 Current Chronological age 7 Current chronological age (observable entity) 8 Age 9 C0001779

Ci
type: Class
subclass of: Units
comment: 1 M03300 2 Ci 3 None 4 Ci 5 282109005 6 Ci 7 Curie (qualifier value) 8 Curie 9 C0700085

Cicatricial
type: Class
subclass of: Sensory function, Pain and Skin function (Symptom)
comment: 1 MD00488 2 Cicatricial 3 None 4 Cicatricial 5 76857007 6 Cicatricial 7 Cicatricial (qualifier value) 8 Cicatricial 9 C0205192

Cigarette cough
type: Class
subclass of: Respiratory function (Symptom)
comment: 1 M02049 2 Cigarette cough 3 None 4 Cigarette cough 5 46802002 6 Cigarette cough 7 Smokers' cough (disorder) 8 Cigarette cough 9 C0264345

Cigarette smoker
type: Class
subclass of: Sub-Cultural Level
comment: 1 M00104 2 Cigarette smoker 3 cigarette smokers 4 Cigarette smoker 5 65568007 6 Cigarette smoker 7 Cigarette smoker (finding) 8 Cigarette smoker (finding) 9 C0337667
alternative label: cigarette smokers

Cigarette smoking habits
type: Class
subclass of: Sub-Cultural Level
comment: 1 M05897 2 Cigarette smoking habits 3 None 4 Cigarette smoking habits 5 108333003 6 Smoking AND/OR drinking habits 7 Smoking/drinking/substance abuse habits (navigational concept) 8 Cigarette smoking behavior 9 C0700219

Circadian rhythm sleep disorder
type: Class
subclass of: Nervous system and Mental function (Symptom)
comment: 1 M00043 2 Circadian rhythm sleep disorder 3 circadian rhythm sleep disorders 4 Circadian rhythm sleep disorder 5 271794005 6 Circadian rhythm sleep-wake disorder 7 Disorder of sleep-wake cycle (disorder) 8 Sleep Disorders, Circadian Rhythm 9 C0877792
alternative label: circadian rhythm sleep disorders

Circuit training
type: Class
subclass of: Limb
comment: 1 M00392 2 Circuit training 3 circuit training 4 Circuit training 5 118629009 6 Training 7 Functional training (procedure) 8 Circuit training 9 C2712423

Civil protection policies
type: Class
subclass of: Public Policy Factors
comment: 1 MD06755 2 Civil protection policies 3 None 4 Civil protection policies 5 276339004 6 environment 7 Environment (environment) 8 Civil protection policies 9 C2371783

Civil protection services
type: Class
subclass of: Public Policy Factors
comment: 1 MD06753 2 Civil protection services 3 None 4 Civil protection services 5 224930009 6 services 7 Services (qualifier value) 8 Civil protection services 9 C2371781

Civil protection systems
type: Class
subclass of: Public Policy Factors
comment: 1 MD06754 2 Civil protection systems 3 None 4 Civil protection systems 5 246333005 6 system 7 System (attribute) 8 Civil protection systems 9 C2371782

Cleaning cooking area and utensils
type: Class
subclass of: Health Related Factors
comment: 1 MD06430 2 Cleaning cooking area and utensils 3 None 4 Cleaning cooking area and utensils 5 311903001 6 Kitchen cleaning material 7 Kitchen cleaning material (substance) 8 Cleaning cooking area and utensils 9 C2371499

Cleaning living area
type: Class
subclass of: Health Related Factors
comment: 1 MD06431 2 Cleaning living area 3 None 4 Cleaning living area 5 441869008 6 Completion time of procedure room cleaning 7 Completion time of procedure room cleaning (observable entity) 8 Cleaning living area 9 C2371500

Climate
type: Class
subclass of: Physical/Chemical Environment
comment: 1 MD06651 2 Climate 3 None 4 Climate 5 276339004 6 Environment 7 Environment (environment) 8 Climate 9 C0008946

Climb
type: Class
subclass of: Active exercise
comment: 1 M02845 2 Climb 3 climbing 4 Climb 5 284097000 6 Does climb 7 Does climb (finding) 8 Climbing 9 C2584300
alternative label: climbing

Clinic
type: Class
subclass of: Classification of Hospital
comment: 1 MD00132 2 Clinic 3 None 4 Clinic 5 257585005 6 Clinic 7 Clinic (environment) 8 Clinic 9 C0442592

Clitoris
type: Class
subclass of: Urogenital function (Body region)
comment: 1 MD06996 2 Clitoris 3 None 4 Clitoris 5 65439009 6 Clitoris 7 Clitoral structure (body structure) 8 Clitoris 9 C0008984

Closing eyes exercises
type: Class
subclass of: Active exercise
comment: 1 M00263 2 Closing eyes exercises 3 None 4 Closing eyes exercises 5 229125008 6 Closing eyes exercises 7 Closing eyes exercises (regime/therapy) 8 Closing eyes exercises 9 C0454335

Clotting functions
type: Class
subclass of: Functions of Blood System, Metabolic system and Endocrine system (Body measurement)
comment: 1 MD05857 2 Clotting functions 3 None 4 Clotting functions 5 74848003 6 blood clotting 7 Hemostatic function (observable entity) 8 Clotting functions 9 C0005778

Coast Time
type: Class
subclass of: Time
comment: 1 MD01912 2 Coast Time 3 None 4 Coast Time 5 410670007 6 Time 7 Time (attribute) 8 Time 9 C0040223

Coat
type: Class
subclass of: Units
comment: 1 M03466 2 Coat 3 None 4 Coat 5 228224007 6 Coat 7 Coat (physical object) 8 Coat (physical object) 9 C0453946

Coat Dosing Unit
type: Class
subclass of: Units
comment: 1 M05293 2 Coat Dosing Unit 3 None 4 Coat Dosing Unit 5 767525000 6 unit 7 Unit (qualifier value) 8 Unit 9 C0439180

Coccyx
type: Class
subclass of: Musculoskeletal function (Body region)
comment: 1 M00105 2 Coccyx 3 Regio coxae 4 Coccyx 5 278915007 6 Coccyx 7 Structure of coccygeal vertebral column (body structure) 8 Bone structure of coccyx 9 C0009194
alternative label: Regio coxae

Coefficient of variation
type: Class
subclass of: Units
comment: 1 MD03126 2 Coefficient of variation 3 None 4 Coefficient of variation 5 767524001 6 Unit of measure 7 Unit of measure (qualifier value) 8 Unit 9 C0439148

Coffee or Tea
type: Class
subclass of: Health Related Factors
comment: 1 MD05352 2 Coffee or Tea 3 None 4 Coffee or Tea 5 844005 6 Behavior finding 7 Behavior finding (finding) 8 Behavior 9 C0004927

Cognition Therapy
type: Class
subclass of: Nervous system and Mental function (Therapy)
comment: 1 M00808 2 Cognition Therapy 3 Cognition Therapies 4 Cognition Therapy 5 228553007 6 cognitive therapy 7 cognitive therapy (regime/therapy) 8 Cognitive Therapy 9 C0009244
alternative label: Cognition Therapies

Cognitive ability
type: Class
subclass of: Nervous system and Mental function (Body measurement)
comment: 1 MD03079 2 Cognitive ability 3 None 4 Cognitive ability 5 413384008 6 Cognitive ability 7 Ability to perform cognitive activity (observable entity) 8 Cognitive ability 9 C0392334

Cognitive and behavioral therapy
type: Class
subclass of: Nervous system and Mental function (Therapy)
comment: 1 M00811 2 Cognitive and behavioral therapy 3 Cognitive and behavioural therapy Cognitive-behavioral therapy approach Cognitive-behavioural therapy approach 4 Cognitive and behavioral therapy 5 228557008 6 Cognitive-behavior therapy 7 Cognitive and behavioral therapy (regime/therapy) 8 Generic cognitive behavioral therapy 9 C0579049
alternative label: Cognitive and behavioural therapy
alternative label: Cognitive-behavioral therapy approach
alternative label: Cognitive-behavioural therapy approach

Cognitive approach
type: Class
subclass of: Nervous system and Mental function (Therapy)
comment: 1 M00813 2 Cognitive approach 3 None 4 Cognitive approach 5 228553007 6 Cognitive approach 7 Cognitive therapy (regime/therapy) 8 Cognitive Therapy 9 C0009244

Cognitive dysfunction
type: Class
subclass of: Hospital information, examination/diagnosis/treatment data
comment: 1 MD00749 2 Cognitive dysfunction 3 None 4 Cognitive dysfunction 5 386806002 6 Cognitive dysfunction 7 Impaired cognition (finding) 8 Impaired cognition 9 C0338656

Cognitive flexibility
type: Class
subclass of: Nervous system and Mental function (Body measurement)
comment: 1 MD05691 2 Cognitive flexibility 3 None 4 Cognitive flexibility 5 261012000 6 Flexible 7 Flexible (qualifier value) 8 Cognitive flexibility 9 C2370892

Cognitive function disorder
type: Class
subclass of: Nervous system and Mental function (Symptom)
comment: 1 MD00948 2 Cognitive function disorder 3 None 4 Cognitive function disorder 5 443265004 6 Cognitive disorder 7 Cognitive disorder (disorder) 8 cognitive disorders 9 C0009241

Cognitive functional
type: Class
subclass of: Nervous system and Mental function (Body measurement)
comment: 1 MD05141 2 Cognitive functional 3 None 4 Cognitive functional 5 311465003 6 Cognitive functions 7 Cognitive functions (observable entity) 8 Cognitive functions 9 C0392335

Cognitive therapy
type: Class
subclass of: Nervous system and Mental function (Therapy)
comment: 1 M00576 2 Cognitive therapy 3 therapy cognitive Cognitive Therapies Cognitive therapy approach 4 Cognitive therapy 5 228553007 6 Cognitive therapy 7 Cognitive therapy (regime/therapy) 8 Cognitive therapy 9 C0009244
alternative label: Cognitive therapy approach
alternative label: therapy cognitive
alternative label: Cognitive Therapies

Collapsing pulse
type: Class
subclass of: Cardiovascular system function (Symptom)
comment: 1 M00184 2 Collapsing pulse 3 None 4 Collapsing pulse 5 44922000 6 Collapsing pulse 7 Collapsing pulse (finding) 8 Collapsing pulse 9 C0232123

Collection of urine
type: Class
subclass of: Urogenital function (Body measurement)
comment: 1 MD05981 2 Collection of urine 3 None 4 Collection of urine 5 57617002 6 collection of urine specimen 7 Urine specimen collection (procedure) 8 Collection of urine 9 C2371162

Collum
type: Class
subclass of: Digestive function (Body region)
comment: 1 M01957 2 Collum 3 None 4 Collum 5 45048000 6 neck 7 Neck structure (body structure) 8 Neck 9 C0027530

Colony
type: Class
subclass of: Units
comment: 1 M02869 2 Colony 3 colonies 4 Colony 5 767525000 6 Unit 7 Unit (qualifier value) 8 colonies (qualifier value) 9 C0439158
alternative label: colonies

Colorectal Region
type: Class
subclass of: Digestive function (Body region)
comment: 1 M00301 2 Colorectal Region 3 None 4 Colorectal Region 5 245425000 6 region of colon 7 Structure of region of colon (body structure) 8 Colorectal Region 9 C1711309

Colour vision
type: Class
subclass of: Sensory function, Pain and Skin function (Body measurement)
comment: 1 MD05741 2 Colour vision 3 None 4 Colour vision 5 271726001 6 Colour vision 7 Color vision (observable entity) 8 Colour vision 9 C0086032

Colours
type: Class
subclass of: Units
comment: 1 MD01929 2 Colours 3 None 4 Colours 5 263714004 6 Colours 7 Colors (qualifier value) 8 Color 9 C0009393

Combination
type: Class
subclass of: Health Related Factors
comment: 1 MD04497 2 Combination 3 None 4 Combination 5 89780004 6 Combination 7 Combined (qualifier value) 8 Combination 9 C0205195

Combining words into phrases
type: Class
subclass of: Health Related Factors
comment: 1 MD06133 2 Combining words into phrases 3 None 4 Combining words into phrases 5 844005 6 Behavior finding 7 Behavior finding (finding) 8 Combining words into phrases 9 C2371976

Comfort Score
type: Class
subclass of: Units
comment: 1 MD04344 2 Comfort Score 3 None 4 Comfort Score 5 246262008 6 Score 7 "Score (attribute) " 8 Score 9 C0449820

Communicating
type: Class
subclass of: Health Related Factors
comment: 1 MD06225 2 Communicating 3 None 4 Communicating 5 288577006 6 Communicates 7 Does communicate (finding) 8 Communicating 9 C0205196

Communicating with receiving body gestures
type: Class
subclass of: Health Related Factors
comment: 1 MD06232 2 Communicating with receiving body gestures 3 None 4 Communicating with receiving body gestures 5 288577006 6 Communicates 7 Does communicate (finding) 8 Communicating with - receiving - body gestures 9 C2371338

Communicating with receiving complex spoken messages
type: Class
subclass of: Health Related Factors
comment: 1 MD06228 2 Communicating with receiving complex spoken messages 3 None 4 Communicating with receiving complex spoken messages 5 288577006 6 Communicates 7 Does communicate (finding) 8 Communicating with - receiving - spoken messages 9 C2371336

Communicating with receiving drawings and photographs
type: Class
subclass of: Health Related Factors
comment: 1 MD06234 2 Communicating with receiving drawings and photographs 3 None 4 Communicating with receiving drawings and photographs 5 288577006 6 Communicates 7 Does communicate (finding) 8 Communicating with - receiving - drawings and photographs 9 C2371340

Communicating with receiving formal sign language messages
type: Class
subclass of: Health Related Factors
comment: 1 MD06237 2 Communicating with receiving formal sign language messages 3 None 4 Communicating with receiving formal sign language messages 5 288577006 6 Communicates 7 Does communicate (finding) 8 Communicating with - receiving - formal sign language messages 9 C2371343

Communicating with receiving general signs and symbols
type: Class
subclass of: Health Related Factors
comment: 1 MD06233 2 Communicating with receiving general signs and symbols 3 None 4 Communicating with receiving general signs and symbols 5 288577006 6 Communicates 7 Does communicate (finding) 8 Communicating with - receiving - general signs and symbols 9 C2371339

Communicating with receiving nonverbal messages
type: Class
subclass of: Health Related Factors
comment: 1 MD06231 2 Communicating with receiving nonverbal messages 3 None 4 Communicating with receiving nonverbal messages 5 288577006 6 Communicates 7 Does communicate (finding) 8 Communicating with - receiving - nonverbal messages 9 C2371337

Communicating with receiving simple spoken messages
type: Class
subclass of: Health Related Factors
comment: 1 MD06227 2 Communicating with receiving simple spoken messages 3 None 4 Communicating with receiving simple spoken messages 5 288577006 6 Communicates 7 Does communicate (finding) 8 Communicating with - receiving - spoken messages 9 C2371336

Communicating with receiving spoken messages
type: Class
subclass of: Health Related Factors
comment: 1 MD06226 2 Communicating with receiving spoken messages 3 None 4 Communicating with receiving spoken messages 5 288577006 6 Communicates 7 Does communicate (finding) 8 Communicating with - receiving - spoken messages 9 C2371336

Communicating with receiving written messages
type: Class
subclass of: Health Related Factors
comment: 1 MD06238 2 Communicating with receiving written messages 3 None 4 Communicating with receiving written messages 5 288577006 6 Communicates 7 Does communicate (finding) 8 Communicating with - receiving - written messages 9 C2371344

Communication management
type: Class
subclass of: Health Related Factors
comment: 1 MD05509 2 Communication management 3 None 4 Communication management 5 410216003 6 Communication care management 7 Communication care management (procedure) 8 Communication care management 9 C1444355

Communication policies
type: Class
subclass of: Public Policy Factors
comment: 1 MD06743 2 Communication policies 3 None 4 Communication policies 5 276339004 6 environment 7 Environment (environment) 8 Communication policies 9 C2371772

Communication services
type: Class
subclass of: Public Policy Factors
comment: 1 MD06741 2 Communication services 3 None 4 Communication services 5 224930009 6 services 7 Services (qualifier value) 8 Communication services 9 C1999114

Communication systems
type: Class
subclass of: Public Policy Factors
comment: 1 MD06742 2 Communication systems 3 None 4 Communication systems 5 246333005 6 system 7 System (attribute) 8 Communication systems 9 C2584338

Community health center
type: Class
subclass of: Classification of Hospital
comment: 1 MD00606 2 Community health centre 3 None 4 Community health center 5 6827000 6 Local community health center 7 Local community health center (environment) 8 Local community health center 9 C0338050

Community health post
type: Class
subclass of: Classification of Hospital
comment: 1 MD00138 2 Community health post 3 None 4 Community health post 5 6827000 6 Local community health center 7 Local community health center (environment) 8 Community Health Centers 9 C0009469

Community life
type: Class
subclass of: Individual Related Factors
comment: 1 MD06543 2 Community life 3 None 4 Community life 5 133928008 6 Community 7 Community (social concept) 8 Community life 9 C2371605

Company address
type: Class
subclass of: Hospital Administration
comment: 1 MD04913 2 Company address 3 None 4 Company address 5 734004005 6 Address 7 Address (property) (qualifier value) 8 Address 9 C1442065

Compass value
type: Class
subclass of: Units
comment: 1 MD02658 2 Compass value 3 None 4 Compass value 5 767525000 6 unit 7 Unit (qualifier value) 8 Unit 9 C0439148

Competitive fencing
type: Class
subclass of: Sport
comment: 1 M05856 2 Competitive fencing 3 None 4 Competitive fencing 5 415577004 6 Sport 7 Sport (qualifier value) 8 Sports 9 C0038039

Competitive games psychotherapy
type: Class
subclass of: Nervous system and Mental function (Therapy)
comment: 1 M00607 2 Competitive games psychotherapy 3 None 4 Competitive games psychotherapy 5 299695005 6 Competitive games psychotherapy 7 Competitive games psychotherapy (regime/therapy) 8 Competitive games psychotherapy 9 C0204582

Completely disabled or exaggerated patient lying down
type: Class
subclass of: Hospital information, examination/diagnosis/treatment data
comment: 1 MD04313 2 Completely disabled or exaggerated patient lying down 3 None 4 Completely disabled or exaggerated patient lying down 5 116154003 6 Patient 7 Patient (person) 8 completely disabled 9 C4035397

Completely need physical help from others
type: Class
subclass of: Questionnaire
comment: 1 MD05581 2 Completely need physical help from others 3 None 4 Completely need physical help from others 5 273820006 6 Social support questionnaire 7 Functional status index (assessment scale) 8 Questionnaire 9 C0034394

Completing multiple tasks
type: Class
subclass of: Health Related Factors
comment: 1 MD06205 2 Completing multiple tasks 3 None 4 Completing multiple tasks 5 255594003 6 Complete 7 Complete (qualifier value) 8 Completing multiple tasks 9 C2371315

Completing the daily routine
type: Class
subclass of: Health Related Factors
comment: 1 MD06212 2 Completing the daily routine 3 None 4 Completing the daily routine 5 255594003 6 Complete 7 Complete (qualifier value) 8 Completing the daily routine 9 C2371322

Complex
type: Class
subclass of: Hospital information, examination/diagnosis/treatment data
comment: 1 MD00413 2 Complex 3 None 4 Complex 5 103360007 6 Complex 7 Complex (qualifier value) 8 Complex 9 C0439855

Complex calculation
type: Class
subclass of: Nervous system and Mental function (Body measurement)
comment: 1 MD05717 2 Complex calculation 3 None 4 Complex calculation 5 258090004 6 Calculated 7 Calculated (qualifier value) 8 Complex calculation 9 C2370910

Complex economic transactions
type: Class
subclass of: Individual Related Factors
comment: 1 MD06534 2 Complex economic transactions 3 None 4 Complex economic transactions 5 844005 6 Behavior finding 7 Behavior finding (finding) 8 Complex economic transactions 9 C2371595

Complex interpersonal interactions
type: Class
subclass of: Individual Related Factors
comment: 1 MD06471 2 Complex interpersonal interactions 3 None 4 Complex interpersonal interactions 5 304879008 6 Recording interpersonal interactions 7 Recording interpersonal interactions (procedure) 8 Complex interpersonal interactions 9 C2371541

Complex rotation
type: Class
subclass of: Musculoskeletal function (Body measurement)
comment: 1 MD04123 2 Complex rotation 3 None 4 Complex rotation 5 70433009 6 Rotation 7 Musculoskeletal rotation (observable entity) 8 Rotation 9 C0035868

Comprehensive Cognitive Functional Assessment Results
type: Class
subclass of: Questionnaire
comment: 1 MD05140 2 Comprehensive Cognitive Functional Assessment Results 3 None 4 Comprehensive Cognitive Functional Assessment Results 5 12894003 6 Functional assessment 7 Functional assessment (procedure) 8 Functional assessment 9 C0278372

Comprehensive analysis results
type: Class
subclass of: Questionnaire
comment: 1 MD04975 2 Comprehensive analysis results 3 None 4 Comprehensive analysis results 5 394617004 6 Result 7 Result (navigational concept) 8 Result 9 C1274040

Compulsive tobacco user syndrome
type: Class
subclass of: Sub-Cultural Level
comment: 1 M01506 2 Compulsive tobacco user syndrome 3 None 4 Compulsive tobacco user syndrome 5 89765005 6 Compulsive tobacco user syndrome 7 Tobacco dependence syndrome (disorder) 8 Compulsive tobacco user syndrome 9 C0040332

Computed Tomography
type: Class
subclass of: Hospital information, examination/diagnosis/treatment data
comment: 1 MD03032 2 Computed Tomography 3 ct 4 Computed Tomography 5 77477000 6 Computed tomography 7 Computed tomography (procedure) 8 Computed tomography 9 C0040405

Conation
type: Class
subclass of: Individual Related Factors
comment: 1 M00704 2 Conation 3 None 4 Conation 5 844005 6 Conation 7 Behavior finding (finding) 8 Conation 9 C0004927

Conditioning Therapy
type: Class
subclass of: Musculoskeletal function (Therapy)
comment: 1 M00727 2 Conditioning Therapy 3 Conditioning Therapies 4 Conditioning Therapy 5 166001 6 Behavior conditioning therapy 7 Behavioral therapy (regime/therapy) 8 Conditioning (Psychology) 9 C0009647
alternative label: Conditioning Therapies

Conduct
type: Class
subclass of: Individual Related Factors
comment: 1 M00705 2 Conduct 3 conducting, conducts 4 Conduct 5 844005 6 Conduct 7 Behavior finding (finding) 8 Conduct 9 C0004927
alternative label: conducting
alternative label: conducts

Confidence
type: Class
subclass of: Nervous system and Mental function (Body measurement)
comment: 1 MD05625 2 Confidence 3 None 4 Confidence 5 225487001 6 Confidence 7 Self-confidence (observable entity) 8 Confidence 9 C1704726

Congenital dyserythropoietic anemia
type: Class
subclass of: Functions of Blood System, Metabolic system and Endocrine system (Symptom)
comment: 1 MD00502 2 Congenital dyserythropoietic anemia 3 None 4 Congenital dyserythropoietic anemia 5 52951008 6 Congenital dyserythropoietic anemia 7 Congenital dyserythropoietic anemia (disorder) 8 Congenital dyserythropoietic anemia 9 C0002876

Congenital malformation
type: Class
subclass of: Hospital information, examination/diagnosis/treatment data
comment: 1 MD00363 2 Congenital malformation 3 congenital deformity congenital deformity of nervous system Circulatory congenital malformation 4 Congenital malformation 5 276654001 6 Congenital malformation 7 Congenital malformation (disorder) 8 Congenital Abnormality 9 C0000768
alternative label: congenital deformity
alternative label: Circulatory congenital malformation

Conscientiousness
type: Class
subclass of: Nervous system and Mental function (Body measurement)
comment: 1 MD05621 2 Conscientiousness 3 Consciousness functions 4 Conscientiousness 5 162328000 6 Conscientious 7 Conscientious (finding) 8 Conscientiousness 9 C0870341
alternative label: Consciousness functions

Conservative Dentistry
type: Class
subclass of: Classification of Hospital
comment: 1 MD00662 2 Conservative Dentistry 3 None 4 Conservative Dentistry 5 722163006 6 Dentistry 7 Dentistry (qualifier value) 8 Dentistry 9 C0011438

Consignment test
type: Class
subclass of: Tool
comment: 1 MD00202 2 Consignment test 3 None 4 Consignment test 5 272393004 6 Tests 7 Tests (qualifier value) 8 Tests (qualifier value) 9 C0392366

Constant Score
type: Class
subclass of: Units
comment: 1 MD04794 2 Constant Score 3 None 4 Constant Score 5 273383002 6 Constant and Murley shoulder assessment score 7 Constant and Murley shoulder assessment score (assessment scale) 8 Constant and Murley shoulder assessment score 9 C0451090

Constipation symptom
type: Class
subclass of: Digestive function (Symptom)
comment: 1 M00834 2 Constipation symptom 3 Costive symptom 4 Constipation symptom 5 14760008 6 Constipated 7 Constipation (finding) 8 Constipation 9 C0009806
alternative label: Costive symptom

Constricted pupil
type: Class
subclass of: Sensory function, Pain and Skin function (Symptom)
comment: 1 M02692 2 Constricted pupil 3 Pupil constriction, constrict pupils, constricted pupils, constriction pupil, pupil constrict 4 Constricted pupil 5 301939004 6 Constricted pupil 7 Constricted pupil (finding) 8 Constricted pupil 9 C0728710
alternative label: pupil constrict
alternative label: constricted pupils
alternative label: constriction pupil
alternative label: Pupil constriction

Consultation with business operators
type: Class
subclass of: Questionnaire
comment: 1 MD04904 2 Consultation with business operators 3 None 4 Consultation with business operators 5 11429006 6 Consultation 7 Consultation (procedure) 8 Consultation 9 C0009818

Container
type: Class
subclass of: Units
comment: 1 M03464 2 Container 3 None 4 Container 5 706437002 6 Container 7 Container (physical object) 8 Containers 9 C0180098
comment: 1 M03464-1 2 Container 3 None 4 Container 5 706437002 6 Container 7 Container (physical object) 8 Container (unit of presentation) 9 C4319643
comment: 1 M03464-2 2 Container 3 None 4 Container 5 732990009 6 Container 7 Container (unit of presentation) 8 Containers 9 C0180098
comment: 1 M03464-3 2 Container 3 None 4 Container 5 732990009 6 Container 7 Container (unit of presentation) 8 Container (unit of presentation) 9 C4319643

Container Dosing Unit
type: Class
subclass of: Units
comment: 1 M05288 2 Container Dosing Unit 3 None 4 Container Dosing Unit 5 767525000 6 unit 7 Unit (qualifier value) 8 Unit 9 C0439179

Content of thought
type: Class
subclass of: Nervous system and Mental function (Body measurement)
comment: 1 MD05683 2 Content of thought 3 None 4 Content of thought 5 363877005 6 Thought content 7 Thought content (observable entity) 8 Content of thought 9 C2584294

Continuity of consciousness
type: Class
subclass of: Nervous system and Mental function (Body measurement)
comment: 1 MD05600 2 Continuity of consciousness 3 None 4 Continuity of consciousness 5 106167005 6 Consciousness 7 Consciousness related finding (finding) 8 Continuity of consciousness 9 C2370996

Continuous
type: Class
subclass of: Health Related Factors
comment: 1 MD05032 2 Continuous 3 continue 4 Continuous 5 255238004 6 Continuous 7 Continuous (qualifier value) 8 Continuous 9 C0549178
alternative label: continue

Continuous fever
type: Class
subclass of: Immune system function (Symptom)
comment: 1 M00160 2 Continuous fever 3 fever continuous 4 Continuous fever 5 271751000 6 Continuous fever 7 Continuous fever (finding) 8 Continuous fever 9 C0424767
alternative label: fever continuous

Contraction force of ventricular muscles
type: Class
subclass of: Cardiovascular system function (Body measurement)
comment: 1 MD05836 2 Contraction force of ventricular muscles 3 None 4 Contraction force of ventricular muscles 5 12140005 6 muscle contraction 7 Muscle contraction, function (observable entity) 8 Contraction force of ventricular muscles 9 C2371009

Contrast sensitivity
type: Class
subclass of: Sensory function, Pain and Skin function (Body measurement)
comment: 1 MD05742 2 Contrast sensitivity 3 None 4 Contrast sensitivity 5 251686008 6 Contrast sensitivity 7 Contrast sensitivity (observable entity) 8 Contrast sensitivity 9 C0009928

Control of complex voluntary movements
type: Class
subclass of: Nervous system and Mental function (Body measurement)
comment: 1 MD06079 2 Control of complex voluntary movements 3 None 4 Control of complex voluntary movements 5 364807002 6 Control of movement - finding 7 Finding of control of movement (finding) 8 Control of complex voluntary movements 9 C2371249

Control of simple voluntary movements
type: Class
subclass of: Nervous system and Mental function (Body measurement)
comment: 1 MD06078 2 Control of simple voluntary movements 3 None 4 Control of simple voluntary movements 5 364807002 6 Control of movement - finding 7 Finding of control of movement (finding) 8 Control of simple voluntary movements 9 C2371248

Control of thought
type: Class
subclass of: Nervous system and Mental function (Body measurement)
comment: 1 MD05684 2 Control of thought 3 None 4 Control of thought 5 88952004 6 Thinking, function 7 Thinking, function (observable entity) 8 Control of thought 9 C0006122

Control of voluntary movement functions
type: Class
subclass of: Nervous system and Mental function (Body measurement)
comment: 1 MD06077 2 Control of voluntary movement functions 3 None 4 Control of voluntary movement functions 5 364807002 6 Control of movement - finding 7 Finding of control of movement (finding) 8 Control of voluntary movement functions 9 C2371247

Convenience Measurement
type: Class
subclass of: Health Related Factors
comment: 1 MD04343 2 Convenience Measurement 3 None 4 Convenience Measurement 5 122869004 6 Measurement 7 Measurement procedure (procedure) 8 measurement 9 C0242485
comment: 1 MD04343-1 2 Convenience Measurement 3 None 4 Convenience Measurement 5 272391002 6 Measurement 7 Measurement technique (qualifier value) 8 measurement 9 C0242485

Convenience Measurement of Walking Training Assistance Tools
type: Class
subclass of: Questionnaire
comment: 1 MD04341 2 Convenience Measurement of Walking Training Assistance Tools 3 None 4 Convenience Measurement of Walking Training Assistance Tools 5 122869004 6 Measurement 7 Measurement procedure (procedure) 8 measurement 9 C0242485
comment: 1 MD04341-1 2 Convenience Measurement of Walking Training Assistance Tools 3 None 4 Convenience Measurement of Walking Training Assistance Tools 5 272391002 6 Measurement 7 Measurement technique (qualifier value) 8 measurement 9 C0242485

Conversation
type: Class
subclass of: Health Related Factors
comment: 1 MD06252 2 Conversation 3 None 4 Conversation 5 288636002 6 Does make conversation 7 Does make conversation (finding) 8 Conversation 9 C0871703

Conversing with many people
type: Class
subclass of: Health Related Factors
comment: 1 MD06257 2 Conversing with many people 3 None 4 Conversing with many people 5 288636002 6 Makes conversation 7 Does make conversation (finding) 8 Conversing with many people 9 C2371361

Conversing with one person
type: Class
subclass of: Health Related Factors
comment: 1 MD06256 2 Conversing with one person 3 None 4 Conversing with one person 5 288636002 6 Makes conversation 7 Does make conversation (finding) 8 Conversing with one person 9 C2371360

Conversion disorder
type: Class
subclass of: Body functions of disability
comment: 1 MD00095 2 Conversion disorder 3 None 4 Conversion disorder 5 20734000 6 Conversion disorder 7 Psychologic conversion disorder (disorder) 8 Conversion disorder 9 C0009946

Conversion grade
type: Class
subclass of: Units
comment: 1 MD04749 2 Conversion grade 3 None 4 Conversion grade 5 272148004 6 conversions 7 Conversions (qualifier value) 8 Conversions (qualifier value) 9 C0439836

Conversion grade according to AMP score
type: Class
subclass of: Units
comment: 1 MD04747 2 Conversion grade according to AMP score 3 None 4 Conversion grade according to AMP score 5 272148004 6 conversions 7 Conversions (qualifier value) 8 Conversions (qualifier value) 9 C0439836

Conversion score
type: Class
subclass of: Units
comment: 1 MD04314 2 Conversion score 3 None 4 Conversion score 5 278061009 6 Scores 7 Scores (qualifier value) 8 score 9 C0449820

Convulsion
type: Class
subclass of: Musculoskeletal function (Symptom)
comment: 1 M01340 2 Convulsion 3 None 4 Convulsion 5 91175000 6 Convulsion 7 Seizure (finding) 8 Convulsion 9 C0036572

Cooking
type: Class
subclass of: Health Related Factors
comment: 1 MD05241 2 Cooking 3 cooking 4 Cooking 5 286516000 6 Cooks food 7 Does cook food (finding) 8 Cooking (activity) 9 C0335326
comment: 1 MD05241-1 2 Cooking 3 cooking 4 cooking 5 424226004 6 Cooks food 7 Using device (attribute) 8 Does cook food 9 C0564354

Cooking ramen
type: Class
subclass of: Health Related Factors
comment: 1 MD05364 2 Cooking ramen 3 None 4 Cooking ramen 5 424226004 6 Cooks food 7 Using device (attribute) 8 Does cook food 9 C0564354

Cookware
type: Class
subclass of: Equipment
comment: 1 MD05371 2 Cookware 3 None 4 Cookware 5 49062001 6 Device 7 Device (physical object) 8 Devices 9 C0699733

Coordination disorder
type: Class
subclass of: Nervous system and Mental function (Symptom)
comment: 1 M02567 2 Coordination disorder 3 coordination disorders 4 Coordination disorder 5 302289002 6 Coordination problem 7 Coordination problem (finding) 8 Abnormal coordination 9 C0520966
alternative label: coordination disorders

Coordination of voluntary movements
type: Class
subclass of: Nervous system and Mental function (Body measurement)
comment: 1 MD06080 2 Coordination of voluntary movements 3 None 4 Coordination of voluntary movements 5 106164003 6 Motor coordination function 7 Motor coordination function (observable entity) 8 Coordination of voluntary movements 9 C2371250

Coordination problem
type: Class
subclass of: Nervous system and Mental function (Symptom)
comment: 1 M02572 2 Coordination problem 3 coordination problems 4 Coordination problem 5 302289002 6 Coordination problem 7 Coordination problem (finding) 8 Abnormal coordination 9 C0520966
alternative label: coordination problems

Copying
type: Class
subclass of: Health Related Factors
comment: 1 MD06123 2 Copying 3 None 4 Copying 5 844005 6 Behavior finding 7 Behavior finding (finding) 8 Copying 9 C2584305

Cord Blood Stem cell
type: Class
subclass of: Hospital information, examination/diagnosis/treatment data
comment: 1 MD00283 2 Cord Blood Stem cell 3 None 4 Cord Blood Stem cell 5 419423006 6 Cord blood stem cell 7 Cord blood stem cell (cell) 8 Cord blood stem cell 9 C1636284

Core Crusher
type: Class
subclass of: Aerobic Exercise
comment: 1 MD02028 2 Core Crusher 3 None 4 Core Crusher 5 226029000 6 Exercises 7 Exercises (regime/therapy) 8 Exercise 9 C0015259

Core muscle endurance test
type: Class
subclass of: Tool
comment: 1 MD04299 2 Core muscle endurance test 3 None 4 Core muscle endurance test 5 272393004 6 Tests 7 Tests (qualifier value) 8 Tests (qualifier value) 9 C0392366

Corporate name
type: Class
subclass of: Hospital Administration
comment: 1 MD04910 2 Corporate name 3 None 4 Corporate name 5 734841007 6 Name 7 Name (property) (qualifier value) 8 Name 9 C0027365

Costiveness
type: Class
subclass of: Digestive function (Symptom)
comment: 1 M00836 2 Costiveness 3 None 4 Costiveness 5 14760008 6 Costiveness 7 Constipation (finding) 8 Constipation 9 C0009806

Cough Adverse Event
type: Class
subclass of: Respiratory function (Body measurement)
comment: 1 M02835 2 Cough Adverse Event 3 None 4 Cough Adverse Event 5 49727002 6 Cough 7 Cough (finding) 8 Cough, CTCAE 9 C1961131

Coughing up blood
type: Class
subclass of: Hospital information, examination/diagnosis/treatment data
comment: 1 M00480 2 Coughing up blood 3 COUGHING BLOOD 4 Coughing up blood 5 66857006 6 Coughing up blood 7 Hemoptysis (finding) 8 Coughing up blood 9 C0019079

Coulomb
type: Class
subclass of: Units
comment: 1 M04664 2 Coulomb 3 None 4 Coulomb 5 284482008 6 coulomb 7 coulomb (qualifier value) 8 coulomb 9 C0562424

Counts
type: Class
subclass of: Units
comment: 1 M02868 2 Counts 3 count (HealthVault) count 4 Counts 5 258734002 6 counts 7 counts (qualifier value) 8 counts 9 C0439157
alternative label: count
alternative label: (HealthVault) count

Coxa
type: Class
subclass of: Musculoskeletal function (Body region)
comment: 1 M01529 2 Coxa 3 Coxas 4 Coxa 5 29836001 6 Hip structure 7 Hip region structure (body structure) 8 Hip structure 9 C0019552
alternative label: Coxas

Crafts
type: Class
subclass of: Health Related Factors
comment: 1 MD06553 2 Crafts 3 None 4 Crafts 5 844005 6 Behavior finding 7 Behavior finding (finding) 8 Crafts 9 C2584324

Cranial Pain
type: Class
subclass of: Nervous system and Mental function (Symptom)
comment: 1 M01071 2 Cranial Pain 3 Cranial Pains 4 Cranial Pain 5 25064002 6 Head pain 7 Headache (finding) 8 Headache 9 C0018681
alternative label: Cranial Pains

Craniofacial dysostosis
type: Class
subclass of: Sensory function, Pain and Skin function (Symptom)
comment: 1 MD00376 2 Craniofacial dysostosis 3 None 4 Craniofacial dysostosis 5 109420003 6 Dysostosis 7 Dysostosis (disorder) 8 Craniofacial Dysostosis 9 C0010273

Craving
type: Class
subclass of: Nervous system and Mental function (Body measurement)
comment: 1 MD05633 2 Craving 3 None 4 Craving 5 225471004 6 Eager 7 Enthusiastic (finding) 8 Craving 9 C0870371

Crawling
type: Class
subclass of: Health Related Factors
comment: 1 MD06341 2 Crawling 3 None 4 Crawling 5 418594001 6 Crawling 7 Crawling (observable entity) 8 Crawling 9 C1635178

Cricket
type: Class
subclass of: Sport
comment: 1 M00393 2 Cricket 3 None 4 Cricket 5 89817000 6 Cricket 7 Cricket (organism) 8 Cricket - sport 9 C0851172

Cricket antigen
type: Class
subclass of: Sport
comment: 1 M02814 2 Cricket antigen 3 None 4 Cricket antigen 5 257593005 6 Cricket ground 7 Cricket ground (environment) 8 Cricket - sport 9 C0851172
alternative label: Squash antigen

Crisis of fever
type: Class
subclass of: Nervous system and Mental function (Symptom)
comment: 1 M02302 2 Crisis of fever 3 None 4 Crisis of fever 5 271754008 6 Crisis of fever 7 Rapid fall of fever (finding) 8 Rapid fall of fever 9 C0424765

Criticism in relationships
type: Class
subclass of: Individual Related Factors
comment: 1 MD06465 2 Criticism in relationships 3 None 4 Criticism in relationships 5 272151006 6 Relationships 7 Relationships (qualifier value) 8 Criticism in relationships 9 C2371536

Croquet
type: Class
subclass of: Sport
comment: 1 M00394 2 Croquet 3 None 4 Croquet 5 415577004 6 Sport 7 Sport (qualifier value) 8 Sports 9 C0038039

Cross-trainer
type: Class
subclass of: Sport
comment: 1 M05853 2 Cross-trainer 3 X-trainer 4 Cross-trainer 5 256235009 6 Exercise 7 Exercise (observable entity) 8 Exercise 9 C0015259
alternative label: X-trainer

Cross country skiing
type: Class
subclass of: Sport
comment: 1 M00395 2 Cross country skiing 3 XC skiing 4 Cross country skiing 5 415577004 6 Sport 7 Sport (qualifier value) 8 Activity, cross country skiing 9 C2712399
comment: 1 M00395-1 2 Cross country skiing 3 XC skiing 4 Cross country skiing 5 415577004 6 sports 7 Sport (qualifier value) 8 spors 9 C0038039
comment: 1 M00395-2 2 Cross country skiing 3 XC skiing 4 Cross country skiing 5 45033006 6 skiing 7 Sport (qualifier value) 8 Activity, cross country skiing 9 C2712399
alternative label: XC skiing

Cross skating
type: Class
subclass of: Sport
comment: 1 MD01051 2 Cross skating 3 None 4 Cross skating 5 7529004 6 Skating 7 Skating (qualifier value) 8 skating 9 C0037247

Crossfit
type: Class
subclass of: Sport
comment: 1 MD01006 2 Crossfit 3 None 4 Crossfit 5 256235009 6 exercise 7 Exercise (observable entity) 8 exercise 9 C0015259

Crutches
type: Class
subclass of: Equipment
comment: 1 MD04375 2 Crutches 3 None 4 Crutches 5 363753007 6 Crutches 7 Crutches (physical object) 8 Crutches 9 C0010397

Cryoprecipitate
type: Class
subclass of: Hospital information, examination/diagnosis/treatment data
comment: 1 MD00255 2 Cryoprecipitate 3 None 4 Cryoprecipitate 5 256401009 6 Cryoprecipitate 7 Cryoprecipitate (product) 8 Cryoprecipitate (product) 9 C0443121
comment: 1 MD00255-1 2 Cryoprecipitate 3 None 4 Cryoprecipitate 5 420599006 6 Cryoprecipitate 7 Cryoprecipitate (substance) 8 Cryoprecipitate (product) 9 C0443121

Cryptococcosis
type: Class
subclass of: Nervous system and Mental function (Symptom)
comment: 1 MD00301 2 Cryptococcosis 3 None 4 Cryptococcosis 5 42386007 6 Cryptococcosis 7 Cryptococcosis (disorder) 8 Cryptococcosis 9 C5235087

Cub. m
type: Class
subclass of: Units
comment: 1 M04729 2 Cub. m 3 None 4 Cub. m 5 396154007 6 Cubic meter 7 Cubic meter (qualifier value) 8 Cubic meter 9 C1300555

Cubic Centimeter
type: Class
subclass of: Units
comment: 1 M03797 2 Cubic Centimeter 3 cu cm 4 Cubic Centimeter 5 258773002 6 cm3 7 Milliliter (qualifier value) 8 cm3 9 C0439242
alternative label: cu cm

Cubic Decimeter
type: Class
subclass of: Units
comment: 1 M04485 2 Cubic Decimeter 3 None 4 Cubic Decimeter 5 767525000 6 Unit 7 Unit (qualifier value) 8 Unit 9 C0439148

Cubic Decimeter per Minute
type: Class
subclass of: Units
comment: 1 M04135 2 Cubic Decimeter per Minute 3 None 4 Cubic Decimeter per Minute 5 767525000 6 Unit 7 Unit (qualifier value) 8 Unit 9 C0439148

Cubic Micrometer
type: Class
subclass of: Units
comment: 1 M05456 2 Cubic Micrometer 3 Cubic Micron micrometer cubed Micron Cubed um3 4 Cubic Micrometer 5 767525000 6 unit 7 Unit (qualifier value) 8 Unit 9 C0439190
alternative label: Cubic Micron
alternative label: micrometer cubed
alternative label: Micron Cubed
alternative label: um3

Cubic Millimeter
type: Class
subclass of: Units
comment: 1 M03807 2 Cubic Millimeter 3 mm3 4 Cubic Millimeter 5 258774008 6 cubic millimeter 7 Microliter (qualifier value) 8 cubic millimeter 9 C0439243
alternative label: mm3
alternative label: cubic millimetre

Cue sports
type: Class
subclass of: Sport
comment: 1 M05849 2 Cue sports 3 None 4 Cue sports 5 415577004 6 Sport 7 Sport (qualifier value) 8 Sports 9 C0038039

Cuesports
type: Class
subclass of: Sport
comment: 1 M05850 2 Cuesports 3 None 4 Cuesports 5 415577004 6 Sport 7 Sport (qualifier value) 8 Sports 9 C0038039

Cup - unit of product usage
type: Class
subclass of: Units
comment: 1 M05721 2 Cup - unit of product usage 3 None 4 Cup - unit of product usage 5 428178003 6 Cup - unit of product usage 7 Cup - unit of product usage (qualifier value) 8 Cup - unit of product usage 9 C1880197

Cup Dosing Unit
type: Class
subclass of: Units
comment: 1 M05371 2 Cup Dosing Unit 3 None 4 Cup Dosing Unit 5 428178003 6 cup 7 Cup - unit of product usage (qualifier value) 8 Cup Dosing Unit 9 C1880197

Cup size and above
type: Class
subclass of: Units
comment: 1 MD05089 2 Cup size and above 3 None 4 Cup size and above 5 352730000 6 Above 7 Supra- (qualifier value) 8 Above 9 C1282910

Curie
type: Class
subclass of: Units
comment: 1 M04704 2 Curie 3 None 4 Curie 5 282109005 6 curie 7 Curie (qualifier value) 8 Curie 9 C0700085

Curl up exercise
type: Class
subclass of: Aerobic Exercise
comment: 1 M00361 2 Curl up exercise 3 None 4 Curl up exercise 5 229148003 6 Curl up exercise 7 Curl up exercise (regime/therapy) 8 Curl up exercise 9 C0454357

Curling
type: Class
subclass of: Sport
comment: 1 M00396 2 Curling 3 None 4 Curling 5 415577004 6 Sport 7 Sport (qualifier value) 8 Sports 9 C0038039
comment: 1 M00396-1 2 Curling 3 None 4 Curling 5 14468000 6 Sports 7 Sports activity (observable entity) 8 Sports 9 C0038039

Current drinker of alcohol
type: Class
subclass of: Sub-Cultural Level
comment: 1 M00015 2 Current drinker of alcohol 3 Current drinker 4 Current drinker of alcohol 5 219006 6 Current drinker of alcohol 7 Current drinker of alcohol (finding) 8 Current drinker of alcohol 9 C0556297
alternative label: Current drinker

Current execution
type: Class
subclass of: Questionnaire
comment: 1 MD05193 2 Current execution 3 None 4 Current execution 5 86967005 6 Tool 7 Tool, device (physical object) 8 Execution 9 C1705848

Current non-drinker of alcohol
type: Class
subclass of: Sub-Cultural Level
comment: 1 M00016 2 Current non-drinker of alcohol 3 None 4 Current non-drinker of alcohol 5 105542008 6 Current non-drinker of alcohol 7 Current non-drinker of alcohol (finding) 8 Current non-drinker of alcohol 9 C0457801

Current non-smoker
type: Class
subclass of: Sub-Cultural Level
comment: 1 M00102 2 Current non-smoker 3 None 4 Current non-smoker 5 8517006 6 Current non-smoker with past history of smoking. 7 Ex-smoker (finding) 8 Current non-smoker 9 C0425311

Cut
type: Class
subclass of: Health Related Factors
comment: 1 MD04227 2 Cut 3 None 4 Cut 5 283396008 6 Cut 7 Incised wound (disorder) 8 Cut 9 C0000925
comment: 1 MD04227 2 Cut 3 None 4 Cut 5 134352000 6 Cut 7 Incised wound - morphology (morphologic abnormality) 8 Cut 9 C0000925

Cutaneous eruption
type: Class
subclass of: Sensory function, Pain and Skin function (Symptom)
comment: 1 M00952 2 Cutaneous eruption 3 cutaneous eruptions 4 Cutaneous eruption 5 271807003 6 Eruption 7 Eruption of skin (disorder) 8 Eruption of skin present 9 C5395697
alternative label: cutaneous eruptions

Cycle per Minute
type: Class
subclass of: Units
comment: 1 M05627 2 Cycle per Minute 3 Cycle/min 4 Cycle per Minute 5 259025008 6 Cycles/s 7 Hertz (qualifier value) 8 Cycle per Minute 9 C2348028
alternative label: Cycle/min

Cycle per Second
type: Class
subclass of: Units
comment: 1 M05630 2 Cycle per Second 3 Cycle/s cycles/second cycles/s Cycle/Second cycle/sec 4 Cycle per Second 5 259025008 6 Cycles/s 7 Hertz (qualifier value) 8 Hertz (Hz) 9 C0439482
alternative label: cycles/second
alternative label: cycle/sec
alternative label: cycles/s
alternative label: Cycle/s
alternative label: Cycle/Second

Cycling
type: Class
subclass of: Sport
comment: 1 M05864 2 Cycling 3 None 4 Cycling 5 300648001 6 Rides a bicycle 7 Does ride a bicycle (finding) 8 Bicycling (recreational activity) 9 C0005377
comment: 1 M05864-1 2 Cycling 3 None 4 Cycling 5 229602008 6 Bicycle 7 Weight-bearing gait training (procedure) 8 Bicycle 9 C0005375
comment: 1 M05864-2 2 Cycling 3 None 4 Cycling 5 300648001 6 Rides a bicycle 7 Does ride a bicycle (finding) 8 Does ride a bicycle (finding) 9 C0577368

Cylinder
type: Class
subclass of: Units
comment: 1 M03452 2 Cylinder 3 None 4 Cylinder 5 732992001 6 Cylinder 7 Cylinder (unit of presentation) 8 Cylinder (unit of presentation) 9 C4319645

Cylinder Dosing Unit
type: Class
subclass of: Units
comment: 1 M05260 2 Cylinder Dosing Unit 3 None 4 Cylinder Dosing Unit 5 732992001 6 Cylinder 7 Cylinder (unit of presentation) 8 Cylinder Dosing Unit 9 C1704654

Cylindrical
type: Class
subclass of: Tool
comment: 1 MD04094 2 Cylindrical 3 None 4 Cylindrical 5 45226003 6 Cylindrical 7 Cylindrical (qualifier value) 8 Cylindrical 9 C0205114

Cylindrical Grasp
type: Class
subclass of: Health Related Factors
comment: 1 MD04093 2 Cylindrical Grasp 3 None 4 Cylindrical Grasp 5 242899004 6 Grasped with hand 7 Grasped with hand (event) 8 grasp 9 C0220843

Cystic fibrosis
type: Class
subclass of: Functions of Blood System, Metabolic system and Endocrine system (Symptom)
comment: 1 MD00325 2 Cystic fibrosis 3 None 4 Cystic fibrosis 5 190905008 6 Cystic fibrosis 7 Cystic fibrosis (disorder) 8 Cystic fibrosis 9 C0010674

Cytomegalovirus disease
type: Class
subclass of: Body functions of disability
comment: 1 MD00300 2 Cytomegalovirus disease 3 None 4 Cytomegalovirus disease 5 28944009 6 Cytomegalovirus disease 7 Cytomegalovirus infection (disorder) 8 Cytomegalovirus Infections 9 C0010823

DELTS
type: Class
subclass of: Musculoskeletal function (Body region)
comment: 1 MD02006 2 DELTS 3 None 4 DELTS 5 35259002 6 Deltoid muscle 7 Structure of deltoid muscle (body structure) 8 Structure of deltoid muscle 9 C0224234

DIABP
type: Class
subclass of: Cardiovascular system function (Body measurement)
comment: 1 M02357 2 DIABP 3 None 4 DIABP 5 271650006 6 Diastolic blood pressure 7 Diastolic blood pressure (observable entity) 8 Diastolic blood pressure 9 C0428883

DIP
type: Class
subclass of: Musculoskeletal function (Body region)
comment: 1 MD04047 2 DIP 3 DIPS 4 DIP 5 725412007 6 Distal interphalangeal joint 7 Structure of distal interphalangeal joint (body structure) 8 Structure of distal interphalangeal joint 9 C0932510
alternative label: DIPS

DIP flexion
type: Class
subclass of: Musculoskeletal function (Body measurement)
comment: 1 MD04046 2 DIP flexion 3 None 4 DIP flexion 5 299063008 6 Range of finger flexion 7 Range of finger flexion (observable entity) 8 Range of finger flexion 9 C0575831

DRY
type: Class
subclass of: Sensory function, Pain and Skin function (Symptom)
comment: 1 M01715 2 DRY 3 dryness 4 DRY 5 13880007 6 Dry 7 Dry (qualifier value) 8 Dry 9 C0205222
alternative label: dryness

Daily life movement test
type: Class
subclass of: Questionnaire
comment: 1 MD04548 2 Daily life movement test 3 None 4 Daily life movement test 5 273694006 6 Performance test of activities of daily living 7 Performance test of activities of daily living (assessment scale) 8 Performance test of activities of daily living 9 C0451375

Daily life psychotherapy
type: Class
subclass of: Nervous system and Mental function (Therapy)
comment: 1 M00608 2 Daily life psychotherapy 3 None 4 Daily life psychotherapy 5 183398005 6 Daily life psychotherapy 7 Daily life psychotherapy (regime/therapy) 8 Daily life psychotherapy 9 C0419159

Daily living work
type: Class
subclass of: Questionnaire
comment: 1 MD05499 2 Daily living work 3 None 4 Daily living work 5 129025006 6 Activity of daily living 7 Activity of daily living (observable entity) 8 Activities of Daily Living (activity) 9 C0001288

Dailymile
type: Class
subclass of: Units
comment: 1 M05732 2 Dailymile 3 None 4 Dailymile 5 413568008 6 Application - unit of product usage (qualifier value) 7 Application - unit of product usage (qualifier value) 8 Application dose 9 C1533134

Dance therapy
type: Class
subclass of: Musculoskeletal function (Therapy)
comment: 1 M00577 2 Dance therapy 3 Dance Therapies 4 Dance therapy 5 69711002 6 Dance therapy 7 Dance therapy (regime/therapy) 8 Dance therapy 9 C0010962
alternative label: Dance Therapies

Dandy-Walker syndrome
type: Class
subclass of: Nervous system and Mental function (Symptom)
comment: 1 MD00531 2 Dandy-Walker syndrome 3 None 4 Dandy-Walker syndrome 5 14447001 6 Dandy-Walker syndrome 7 Dandy-Walker syndrome (disorder) 8 Dandy-Walker syndrome 9 C0010964

Dangerous performance
type: Class
subclass of: Questionnaire
comment: 1 MD05573 2 Dangerous performance 3 None 4 Dangerous performance 5 398166005 6 Performed 7 Performed (qualifier value) 8 Performance 9 C0597198

Date of Birth
type: Class
subclass of: Day
comment: 1 MD02952 2 Date of Birth 3 Birth date, Birthday 4 Date of Birth 5 184099003 6 Date of birth 7 Date of birth (observable entity) 8 Date of birth 9 C0421451
alternative label: Birthday
alternative label: Birth date

Date of preparation
type: Class
subclass of: Day
comment: 1 MD05154 2 Date of preparation 3 None 4 Date of preparation 5 399651003 6 Date of report 7 Date of report (observable entity) 8 Date of report 9 C1302584

Days per week
type: Class
subclass of: Units
comment: 1 M04700 2 Days per week 3 day per week days/week 4 Days per week 5 229784001 6 days per week 7 days/week (qualifier value) 8 days per week 9 C0677547
alternative label: day per week
alternative label: days/week

Daytime work
type: Class
subclass of: Day
comment: 1 MD04931 2 Daytime work 3 None 4 Daytime work 5 261041009 6 Working 7 Working, function (observable entity) 8 Work 9 C0043227

Daytum
type: Class
subclass of: Units
comment: 1 M05733 2 Daytum 3 None 4 Daytum 5 413568008 6 Application - unit of product usage (qualifier value) 7 Application - unit of product usage (qualifier value) 8 Application dose 9 C1533134

Deceleration
type: Class
subclass of: Units
comment: 1 MD03134 2 Deceleration 3 None 4 Deceleration 5 285660002 6 Deceleration 7 Deceleration (physical force) 8 Deceleration 9 C0011100

Deceleration time
type: Class
subclass of: Time
comment: 1 MD03133 2 Deceleration time 3 None 4 Deceleration time 5 410669006 6 Time 7 Time (property) (qualifier value) 8 Time 9 C0040224

Deciliter
type: Class
subclass of: Units
comment: 1 M03794 2 Deciliter 3 dL deciliters 4 Deciliter 5 258771000 6 Deciliter 7 Deciliter (qualifier value) 8 Deciliter 9 C0439241
alternative label: deciliters
alternative label: dL
alternative label: decilitre

Decimole
type: Class
subclass of: Units
comment: 1 M05631 2 Decimole 3 None 4 Decimole 5 767525000 6 Unit 7 Unit (qualifier value) 8 Decimole 9 C2348083

Deck shuffleboard
type: Class
subclass of: Sport
comment: 1 M05874 2 Deck shuffleboard 3 None 4 Deck shuffleboard 5 415577004 6 Sport 7 Sport (qualifier value) 8 Sports 9 C0038039

Decreased hair growth
type: Class
subclass of: Sensory function, Pain and Skin function (Symptom)
comment: 1 M00536 2 Decreased hair growth 3 Decreased hair growth function 4 Decreased hair growth 5 134006 6 Decreased hair growth 7 Decreased hair growth (finding) 8 Decreased hair growth 9 C0232411
alternative label: Decreased hair growth function

Decreased nutritional requirement
type: Class
subclass of: Nutritional status
comment: 1 M00463 2 Decreased nutritional requirement 3 None 4 Decreased nutritional requirement 5 87276001 6 Nutritional status 7 Nutritional status (observable entity) 8 Decreased nutritional requirement 9 C0520920

Decreased pulse rate
type: Class
subclass of: Cardiovascular system function (Symptom)
comment: 1 M02840 2 Decreased pulse rate 3 None 4 Decreased pulse rate 5 422119006 6 Brachial pulse rate 7 Heart rate measured at brachial artery (observable entity) 8 Pulse slow (finding) 9 C2230138

Decreased skin temperature
type: Class
subclass of: Sensory function, Pain and Skin function (Body measurement)
comment: 1 M00174 2 Decreased skin temperature 3 SKIN TEMPERATURE DECREASE 4 Decreased skin temperature 5 71200009 6 Decreased skin temperature 7 Decreased skin temperature (finding) 8 Decreased skin temperature 9 C0232418
alternative label: SKIN TEMPERATURE DECREASE

Deep
type: Class
subclass of: Individual Related Factors
comment: 1 MD01826 2 Deep 3 None 4 Deep 5 795002 6 Deep 7 Deep (qualifier value) 8 Deep (qualifier value) 9 C0205125

Deficiency
type: Class
subclass of: Nutritional status
comment: 1 M01728 2 Deficiency 3 None 4 Deficiency 5 246199000 6 Deficiency 7 Deficiency (attribute) 8 Deficiency 9 C0011155

Deficiency state
type: Class
subclass of: Nutritional status
comment: 1 M01732 2 Deficiency state 3 None 4 Deficiency state 5 47563007 6 Nutritional deficiency state 7 Nutritional deficiency (finding) 8 Deficiency 9 C0011155

Deficit
type: Class
subclass of: Nutritional status
comment: 1 M01733 2 Deficit 3 None 4 Deficit 5 246199000 6 Deficiency 7 Deficiency (attribute) 8 Deficiency 9 C0011155

Degree Celsius
type: Class
subclass of: Units
comment: 1 M03788 2 Degree Celsius 3 degrees Celsius Celsius Degree 4 Degree Celsius 5 258710007 6 degrees C 7 Degrees Celsius (qualifier value) 8 degrees C 9 C0439237
alternative label: degrees Celsius
alternative label: Celsius Degree

Degree Centigrade
type: Class
subclass of: Units
comment: 1 M03787 2 Degree Centigrade 3 None 4 Degree Centigrade 5 258710007 6 degrees C 7 Degrees Celsius (qualifier value) 8 degrees C 9 C0439237

Degree Fahrenheit
type: Class
subclass of: Units
comment: 1 M04401 2 Degree Fahrenheit 3 fahrenheit degrees fahrenheit 4 Degree Fahrenheit 5 258712004 6 degrees F 7 Degrees Fahrenheit (qualifier value) 8 degrees F 9 C0456628
alternative label: fahrenheit
alternative label: fahrenheit degrees

Degree Unit of Plane Angle
type: Class
subclass of: Units
comment: 1 M05632 2 Degree Unit of Plane Angle 3 None 4 Degree Unit of Plane Angle 5 767525000 6 Unit 7 Unit (qualifier value) 8 Decimole 9 C2348083

Degree of pain in fracture area during activity
type: Class
subclass of: Tool
comment: 1 MD03996 2 Degree of pain in fracture area during activity 3 None 4 Degree of pain in fracture area during activity 5 733826000 6 Fracture pain 7 Pain due to fracture (finding) 8 Fracture pain 9 C3267038

Degree of pain in fracture area during rest
type: Class
subclass of: Tool
comment: 1 MD03995 2 Degree of pain in fracture area during rest 3 None 4 Degree of pain in fracture area during rest 5 733826000 6 Fracture pain 7 Pain due to fracture (finding) 8 Fracture pain 9 C3267038

Degree of pain in fracture area during walking training or during activities
type: Class
subclass of: Questionnaire
comment: Equipment/Device/Tool/Questionnaire Questionnaire None 1 MD04335 2 Degree of pain in fracture area during walking training or during activities 3 None 4 Degree of pain in fracture area during walking training or during activities 5 273389003 6 Daily activities questionnaire 7 Daily activities questionnaire (assessment scale) 8 Daily activities questionnaire 9 C0451094

Degree of pain in the fracture area
type: Class
subclass of: Tool
comment: 1 MD03994 2 Degree of pain in the fracture area 3 None 4 Degree of pain in the fracture area 5 733826000 6 Fracture pain 7 Pain due to fracture (finding) 8 Fracture pain 9 C3267038

Dehydrogenase
type: Class
subclass of: Hospital information, examination/diagnosis/treatment data
comment: 1 MD00404 2 Dehydrogenase 3 None 4 Dehydrogenase 5 129919009 6 Dehydrogenase 7 Substance with dehydrogenase mechanism of action (substance) 8 Oxidoreductase 9 C0030016
comment: 1 MD00404-1 2 Dehydrogenase 3 None 4 Dehydrogenase 5 129919009 6 Dehydrogenase 7 Substance with dehydrogenase mechanism of action (substance) 8 Dehydrogenase (disposition) 9 C4521774
comment: 1 MD00404-2 2 Dehydrogenase 3 None 4 Dehydrogenase 5 736206000 6 Dehydrogenase 7 Dehydrogenase (disposition) 8 Oxidoreductase 9 C0030016
comment: 1 MD00404-3 2 Dehydrogenase 3 None 4 Dehydrogenase 5 736206000 6 Dehydrogenase 7 Dehydrogenase (disposition) 8 Dehydrogenase (disposition) 9 C4521774

Delayed Sleep Phase Syndrome
type: Class
subclass of: Nervous system and Mental function (Symptom)
comment: 1 M02191 2 Delayed Sleep Phase Syndrome 3 delayed phase sleep syndrome 4 Delayed Sleep Phase Syndrome 5 80623000 6 Delayed sleep phase syndrome 7 Sleep-wake schedule disorder, delayed phase type (disorder) 8 Delayed sleep phase syndrome 9 C0393770

Delayed onset of sleep
type: Class
subclass of: Nervous system and Mental function (Symptom)
comment: 1 M00033 2 Delayed onset of sleep 3 None 4 Delayed onset of sleep 5 401161007 6 Delayed onset of sleep 7 Delayed onset of sleep (finding) 8 Delayed onset of sleep 9 C1303139

Delayed pulse
type: Class
subclass of: Cardiovascular system function (Symptom)
comment: 1 M00185 2 Delayed pulse 3 None 4 Delayed pulse 5 248636001 6 Delayed pulse 7 Delayed pulse (finding) 8 Delayed pulse 9 C0425575

Demographic change
type: Class
subclass of: Physical/Chemical Environment
comment: 1 MD06642 2 Demographic change 3 None 4 Demographic change 5 302147001 6 Demographic history 7 Demographic history detail (observable entity) 8 Demographic change 9 C0681668

Dental Others
type: Class
subclass of: Classification of Hospital
comment: 1 MD00199 2 Dental Others 3 None 4 Dental Others 5 738906000 6 Dental 7 Dental (intended site) 8 Dental 9 C0226984

Depression Test
type: Class
subclass of: Tool
comment: 1 MD03260 2 Depression Test 3 None 4 Depression Test 5 273402009 6 Depression anxiety scale 7 Depression anxiety scale (assessment scale) 8 Depression anxiety scale 9 C0451107
comment: 1 MD03686 2 Depression Test 3 None 4 Depression Test 5 273929006 6 WHO depression scale 7 World Health Organization depression scale (assessment scale) 8 Depression Scale (BASC-2) 9 C4049644

Dermatology
type: Class
subclass of: Classification of Hospital
comment: 1 MD00643 2 Dermatology 3 None 4 Dermatology 5 394582007 6 Dermatology 7 Dermatology (qualifier value) 8 Dermatology field 9 C0011627

Dermatopolymyositis
type: Class
subclass of: Sensory function, Pain and Skin function (Symptom)
comment: e 1 MD00351 2 Dermatopolymyositis 3 None 4 Dermatopolymyositis 5 396230008 6 Dermatomyositis 7 Dermatomyositis (disorder) 8 Dermatopolymyositis 9 C0011633

Description of special matters in addition to job characteristics and essential function identification items
type: Class
subclass of: Questionnaire
comment: 1 MD04981 2 Description of special matters in addition to job characteristics and essential function identification items 3 None 4 Description of special matters in addition to job characteristics and essential function identification items 5 246137000 6 equipment 7 Equipment (attribute) 8 equipment 9 C0014672

Desynchronised sleep
type: Class
subclass of: Individual Related Factors
comment: 1 M01380 2 Desynchronised sleep 3 Desynchronized sleep 4 Desynchronised sleep 5 89129007 6 Desynchronised sleep 7 Rapid eye movement sleep, function (observable entity) 8 Sleep, REM 9 C0037322

Detailed Actions for the Assessment Task
type: Class
subclass of: Questionnaire
comment: 1 MD05494 2 Detailed Actions for the Assessment Task 3 None 4 Detailed Actions for the Assessment Task 5 273248003 6 action 7 Action (attribute) 8 Behavior 9 C0004927

Detailed action for evaluation task
type: Class
subclass of: Questionnaire
comment: 1 MD05549 2 Detailed action for evaluation task 3 None 4 Detailed action for evaluation task 5 129264002 6 Action 7 Action (qualifier value) 8 Abate (action) 9 C3853704

Detailed motion evaluation criteria
type: Class
subclass of: Units
comment: 1 MD05565 2 Detailed motion evaluation criteria 3 None 4 Detailed motion evaluation criteria 5 717350000 6 Centor criteria 7 Centor criteria (assessment scale) 8 evaluation criteria 9 C0935549

Detailed performance is required according to several types of situation changes without additional instructions
type: Class
subclass of: Questionnaire
comment: 1 MD05131 2 Detailed performance is required according to several types of situation changes without additional instructions 3 None 4 Detailed performance is required according to several types of situation changes without additional instructions 5 273389003 6 Daily activities questionnaire 7 Daily activities questionnaire (assessment scale) 8 questionnaire 9 C0034394

Details
type: Class
subclass of: Units
comment: 1 MD01895 2 Details 3 None 4 Details 5 69658003 6 Specific 7 Specific (qualifier value) 8 Details 9 C1522508

Deviation
type: Class
subclass of: Musculoskeletal function (Body measurement)
comment: 1 MD04018 2 Deviation 3 None 4 Deviation 5 112638000 6 Deviation 7 Displacement (morphologic abnormality) 8 Deviation 9 C0012727

Device Serial Numbers
type: Class
subclass of: Units
comment: 1 MD01942 2 Device Serial Numbers 3 None 4 Device Serial Numbers 5 49062001 6 Device 7 Device (physical object) 8 Devices 9 C0699733

Dexterity
type: Class
subclass of: Musculoskeletal function (Body measurement)
comment: 1 MD04161 2 Dexterity 3 None 4 Dexterity 5 288361006 6 Dexterity 7 Ability to perform general manipulative activities (observable entity) 8 Ability to perform general manipulative activities 9 C0565699

Diabetes
type: Class
subclass of: Hospital information, examination/diagnosis/treatment data
comment: 1 MD00020 2 Diabetes 3 None 4 Diabetes 5 73211009 6 Diabetes mellitus 7 Diabetes mellitus (disorder) 8 Diabetes 9 C0011847
comment: 1 MD00020-1 2 Diabetes 3 None 4 Diabetes 5 73211009 6 Diabetes mellitus 7 Diabetes mellitus (disorder) 8 Diabetes Mellitus 9 C0011849

Diabetes insipidus
type: Class
subclass of: Urogenital function (Symptom)
comment: 1 MD00356 2 Diabetes insipidus 3 None 4 Diabetes insipidus 5 15771004 6 Diabetes insipidus 7 Diabetes insipidus (disorder) 8 Diabetes insipidus 9 C0011848

Diagnostic Radiology
type: Class
subclass of: Classification of Hospital
comment: 1 MD00645 2 Diagnostic Radiology 3 None 4 Diagnostic Radiology 5 394914008 6 Radiology 7 Radiology - specialty (qualifier value) 8 Diagnostic Radiology Services 9 C0813129

Dialysate
type: Class
subclass of: Hospital Administration
comment: 1 MD00119 2 Dialysate 3 None 4 Dialysate 5 116178008 6 Dialysate 7 Dialysis fluid (product) 8 Dialysis Solutions 9 C0011947

Diaphoresis
type: Class
subclass of: Individual Related Factors
comment: 1 M01423 2 Diaphoresis 3 None 4 Diaphoresis 5 415691001 6 Diaphoresis 7 Sweating, function (observable entity) 8 Diaphoresis 9 C0700590
comment: 1 M01423-1 2 Diaphoresis 3 None 4 Diaphoresis 5 52613005 6 Diaphoresis 7 Excessive sweating (finding) 8 Diaphoresis 9 C0700590

Diarrhea symptom
type: Class
subclass of: Digestive function (Symptom)
comment: 1 M00854 2 Diarrhea symptom 3 Diarrhea symptoms Diarrheas Diarrhoea symptom Diarrhoea symptoms Runny stool symptoms diarrhea The runs The trots 4 Diarrhea symptom 5 267060006 6 Diarrhea symptom 7 Diarrhea symptom (finding) 8 Diarrhea 9 C0011991
alternative label: Diarrhea symptoms
alternative label: Diarrheas
alternative label: The runs
alternative label: symptoms diarrhea
alternative label: Runny stool
alternative label: Diarrhoea symptom
alternative label: Diarrhoea symptoms
alternative label: The trots

Diastole
type: Class
subclass of: Cardiovascular system function (Body measurement)
comment: 1 MD01184 2 Diastole 3 diastolic 4 Diastole 5 90892000 6 Diastole 7 Diastole, function (observable entity) 8 Diastole 9 C0012000
comment: 1 MD01184-1 2 Diastole 3 diastolic 4 Diastole 5 90892000 6 Diastole 7 Diastole, function (observable entity) 8 Diastolic phase 9 C4283748
comment: 1 MD01184-2 2 Diastole 3 diastolic 4 Diastole 5 723229005 6 Diastole 7 Diastolic phase (qualifier value) 8 Diastole 9 C0012000
comment: 1 MD01184-3 2 Diastole 3 diastolic 4 Diastole 5 723229005 6 Diastole 7 Diastolic phase (qualifier value) 8 Diastolic phase 9 C4283748
alternative label: diastolic

Diastolic blood pressure
type: Class
subclass of: Cardiovascular system function (Body measurement)
comment: 1 M00138 2 Diastolic blood pressure 3 Diastolic pressure, Diastolic arterial pressure, blood diastolic pressure, blood diastolic pressures, DAP - Diastolic arterial pressure, DBP - Diastolic blood pressure, diastolic bp, Diastolic Pressure, diastolic pressures 4 Diastolic blood pressure 5 271650006 6 Diastolic blood pressure 7 Diastolic blood pressure (observable entity) 8 Diastolic blood pressure 9 C0428883
alternative label: diastolic bp
alternative label: DAP - Diastolic arterial pressure
alternative label: Diastolic Pressure
alternative label: Diastolic arterial pressure
alternative label: blood diastolic pressure
alternative label: Diastolic pressure
alternative label: diastolic pressures
alternative label: DBP - Diastolic blood pressure
alternative label: blood diastolic pressures

Diastrophic dysplasia
type: Class
subclass of: Classification of Patient
comment: 1 MD00379 2 Diastrophic dysplasia 3 None 4 Diastrophic dysplasia 5 58561002 6 Diastrophic dysplasia 7 Diastrophic dysplasia (disorder) 8 Diastrophic dysplasia 9 C0220726

Dietary calorie intake
type: Class
subclass of: Nutrient intake
comment: 1 M00785 2 Dietary calorie intake 3 None 4 Dietary calorie intake 5 87787004 6 Calorie intake 7 Energy intake (observable entity) 8 Energy Intake 9 C0006777

Dietary deficiency
type: Class
subclass of: Nutritional status
comment: 1 M01734 2 Dietary deficiency 3 Insufficiency - dietary 4 Dietary deficiency 5 70241007 6 Dietary deficiency 7 Nutritional deficiency disorder (disorder) 8 Dietary deficiency 9 C4761312
alternative label: Insufficiency - dietary

Dietary habits
type: Class
subclass of: Individual Related Factors
comment: 1 M00404 2 Dietary habits 3 None 4 Dietary habits 5 162512009 6 Dietary history 7 Dietary history (finding) 8 Dietary habits 9 C0086152

Dietary status
type: Class
subclass of: Nutritional status
comment: 1 M02170 2 Dietary status 3 None 4 Dietary status 5 87276001 6 Dietary status 7 Nutritional status (observable entity) 8 Dietary status 9 C0392209

Differentiation of familiar persons
type: Class
subclass of: Individual Related Factors
comment: 1 MD06468 2 Differentiation of familiar persons 3 None 4 Differentiation of familiar persons 5 263735002 6 Differential 7 Differential (qualifier value) 8 Differentiation of familiar persons 9 C2372082

Difficult passing motion
type: Class
subclass of: Digestive function (Symptom)
comment: 1 M00837 2 Difficult passing motion 3 None 4 Difficult passing motion 5 14760008 6 Difficult passing motion 7 Constipation (finding) 8 Constipation 9 C0009806

Difficulty breathing
type: Class
subclass of: Respiratory function (Symptom)
comment: 1 M00895 2 Difficulty breathing 3 breathing difficulty, DIB - Difficulty in breathing, difficult breathing, Respiration difficult, Respiratory difficulties, respiratory difficulty 4 Difficulty breathing 5 230145002 6 Difficulty breathing 7 Difficulty breathing (finding) 8 Dyspnea 9 C0013404
alternative label: respiratory difficulty
alternative label: difficult breathing
alternative label: DIB - Difficulty in breathing
alternative label: breathing difficulty
alternative label: Respiratory difficulties
alternative label: Respiration difficult

Difficulty defecating
type: Class
subclass of: Digestive function (Symptom)
comment: 1 M00839 2 Difficulty defecating 3 Difficulty defaecating 4 Difficulty defecating 5 14760008 6 Difficulty defecating 7 Constipation (finding) 8 Constipation 9 C0009806
alternative label: Difficulty defaecating

Difficulty opening bowels
type: Class
subclass of: Digestive function (Symptom)
comment: 1 M00840 2 Difficulty opening bowels 3 None 4 Difficulty opening bowels 5 14760008 6 Difficulty opening bowels 7 Constipation (finding) 8 Constipation 9 C0009806

Difficulty passing stool
type: Class
subclass of: Digestive function (Symptom)
comment: 1 M00841 2 Difficulty passing stool 3 None 4 Difficulty passing stool 5 14760008 6 Difficulty passing stool 7 Constipation (finding) 8 Constipation 9 C0009806

Digestive functions
type: Class
subclass of: Digestive function (Body measurement)
comment: 1 MD05924 2 Digestive functions 3 None 4 Digestive functions 5 386617003 6 digestive system finding 7 Digestive system finding (finding) 8 Digestive functions 9 C2371123

Digifit
type: Class
subclass of: Units
comment: 1 M05734 2 Digifit 3 None 4 Digifit 5 413568008 6 Application - unit of product usage (qualifier value) 7 Application - unit of product usage (qualifier value) 8 Application dose 9 C1533134

Digital Muscle Measurment
type: Class
subclass of: Device
comment: 1 MD04789 2 Digital Muscle Measurment 3 None 4 Digital Muscle Measurment 5 122869004 6 Measurement 7 Measurement procedure (procedure) 8 Measurement 9 C0242485
comment: 1 MD04789-1 2 Digital Muscle Measurment 3 None 4 Digital Muscle Measurment 5 272391002 6 Measurement 7 Measurement technique (qualifier value) 8 Measurement 9 C0242485

Dilated pupil
type: Class
subclass of: Sensory function, Pain and Skin function (Symptom)
comment: 1 M01233 2 Dilated pupil 3 dilated pupils 4 Dilated pupil 5 37125009 6 Dilated pupil 7 Dilated pupil (finding) 8 Mydriasis 9 C0026961
alternative label: dilated pupils

Dilating nostrils exercises
type: Class
subclass of: Active exercise
comment: 1 M00284 2 Dilating nostrils exercises 3 None 4 Dilating nostrils exercises 5 229134003 6 Dilating nostrils exercises 7 Dilating nostrils exercises (regime/therapy) 8 Dilating nostrils exercises 9 C0454344

Diphtheria
type: Class
subclass of: Hospital information, examination/diagnosis/treatment data
comment: 1 MD00975 2 Diphtheria 3 None 4 Diphtheria 5 397430003 6 Diphtheria 7 Diphtheria caused by Corynebacterium diphtheriae (disorder) 8 Diphtheria due to Corynebacterium diphtheriae 9 C1301422

Direct service required for many unspecified customers
type: Class
subclass of: Questionnaire
comment: 1 MD05128 2 Direct service required for many unspecified customers 3 None 4 Direct service required for many unspecified customers 5 273389003 6 Daily activities questionnaire 7 Daily activities questionnaire (assessment scale) 8 questionnaire 9 C0034394

Disabled person
type: Class
subclass of: Classification of Patient
comment: 1 MD00593 2 disabled person 3 None 4 Disabled person 5 21134002 6 Disability 7 Disability (finding) 8 Disabled Persons 9 C0018576

Disaster history
type: Class
subclass of: Hospital information, examination/diagnosis/treatment data
comment: 1 MD04879 2 Disaster history 3 None 4 Disaster history 5 386477002 6 Triage: disaster 7 Triage: disaster (procedure) 8 Disasters 9 C0012618

Disc
type: Class
subclass of: Units
comment: 1 M05283 2 Disc 3 Disc - unit of product usage 4 Disc 5 427678004 6 Disc 7 Disc - unit of product usage (qualifier value) 8 Disc 9 C1705370
alternative label: Disc - unit of product usage

Disc diameter
type: Class
subclass of: Units
comment: 1 M03311 2 Disc diameter 3 DD - disc diameter 4 Disc diameter 5 399859004 6 Disc diameter 7 Disc diameter (qualifier value) 8 Disc diameter 9 C1275949
alternative label: DD - disc diameter

Discharge
type: Class
subclass of: Hospital Administration
comment: 1 MD00224 2 Discharge 3 None 4 Discharge 5 75823008 6 Discharge 7 Discharge (morphologic abnormality) 8 Patient Discharge 9 C0030685
comment: 1 MD00224-1 2 Discharge 3 None 4 Discharge 5 75823008 6 Discharge 7 Discharge (morphologic abnormality) 8 Discharge, Body Substance, Sample 9 C0600083
comment: 1 MD00224-2 2 Discharge 3 None 4 Discharge 5 258439008 6 Discharge 7 Discharge specimen (specimen) 8 Patient Discharge 9 C0012621
comment: 1 MD00224-3 2 Discharge 3 None 4 Discharge 5 258439008 6 Discharge 7 Discharge specimen (specimen) 8 Discharge, Body Substance, Sample 9 C0600083
comment: 1 MD00224-4 2 Discharge 3 None 4 Discharge 5 307488001 6 Discharge 7 Discharge - substance (substance) 8 Patient Discharge 9 C0012621
comment: 1 MD00224-5 2 Discharge 3 None 4 Discharge 5 307488001 6 Discharge 7 Discharge - substance (substance) 8 Discharge, Body Substance, Sample 9 C0600083

Discover
type: Class
subclass of: Health Related Factors
comment: 1 MD01757 2 Discover 3 None 4 Discover 5 263857004 6 Revealed 7 Revealed (qualifier value) 8 Discover 9 C1880355

Discussion
type: Class
subclass of: Health Related Factors
comment: 1 MD06260 2 Discussion 3 None 4 Discussion 5 223482009 6 Discussion 7 Discussion (procedure) 8 Discussion 9 C0557061
comment: 1 MD06260-1 2 Discussion 3 None 4 Discussion 5 223482009 6 Discussion 7 Discussion (procedure) 8 Discussion 9 C2584313

Discussion with many people
type: Class
subclass of: Health Related Factors
comment: 1 MD06262 2 Discussion with many people 3 None 4 Discussion with many people 5 223482009 6 Discussion 7 Discussion (procedure) 8 Discussion with many people 9 C2371365

Discussion with one person
type: Class
subclass of: Health Related Factors
comment: 1 MD06261 2 Discussion with one person 3 None 4 Discussion with one person 5 223482009 6 Discussion 7 Discussion (procedure) 8 Discussion with one person 9 C2371364

Disk
type: Class
subclass of: Units
comment: 1 M03461 2 Disk 3 None 4 Disk 5 427678004 6 Disk 7 Disc - unit of product usage (qualifier value) 8 Disk Dosing Unit 9 C1705370

Disk - unit of product usage
type: Class
subclass of: Units
comment: 1 M05281 2 Disk - unit of product usage 3 None 4 Disk - unit of product usage 5 427678004 6 Disk - unit of product usage 7 Disc - unit of product usage (qualifier value) 8 Disk - unit of product usage 9 C1705370

Disk Dosing Unit
type: Class
subclass of: Units
comment: 1 M05280 2 Disk Dosing Unit 3 None 4 Disk Dosing Unit 5 427678004 6 Disc 7 Disc - unit of product usage (qualifier value) 8 Disc dosing unit 9 C1705370

Disorder of hair growth
type: Class
subclass of: Sensory function, Pain and Skin function (Symptom)
comment: 1 M00537 2 Disorder of hair growth 3 None 4 Disorder of hair growth 5 267808001 6 Disorder of hair growth 7 Disorder of hair growth (disorder) 8 Disorder of hair growth 9 C0554471

Disorder of sleep-wake cycle
type: Class
subclass of: Nervous system and Mental function (Symptom)
comment: 1 M02742 2 Disorder of sleep-wake cycle 3 Sleep Wake Cycle Disorders, Sleep-Wake Cycle Disorder 4 Disorder of sleep-wake cycle 5 271794005 6 Disorder of sleep-wake cycle 7 Disorder of sleep-wake cycle (disorder) 8 Sleep Disorders, Circadian Rhythm 9 C0877792
alternative label: Sleep-Wake Cycle Disorder
alternative label: Sleep Wake Cycle Disorders

Disorder of sleep-wake schedule
type: Class
subclass of: Nervous system and Mental function (Symptom)
comment: 1 M02743 2 Disorder of sleep-wake schedule 3 Disorders of the sleep-wake schedule, sleep wake schedule disorder, Sleep Wake Schedule Disorders 4 Disorder of sleep-wake schedule 5 271794005 6 Disorder of sleep-wake cycle 7 Disorder of sleep-wake cycle (disorder) 8 Sleep Disorders, Circadian Rhythm 9 C0877792
alternative label: sleep wake schedule disorder
alternative label: Sleep Wake Schedule Disorders
alternative label: Disorders of the sleep-wake schedule

Disorder of visual
type: Class
subclass of: Body functions of disability
comment: 1 MD00079 2 Disorder of visual 3 None 4 Disorder of visual 5 128127008 6 Visual system disorder 7 Visual system disorder (disorder) 8 Vision Disorders 9 C0042790

Disorders of copper metabolism
type: Class
subclass of: Functions of Blood System, Metabolic system and Endocrine system (Symptom)
comment: 1 MD00323 2 Disorders of copper metabolism 3 None 4 Disorders of copper metabolism 5 79886009 6 Disorder of copper metabolism 7 Disorder of copper metabolism (disorder) 8 Disorder of copper metabolism 9 C0012714

Disposing of garbage
type: Class
subclass of: Health Related Factors
comment: 1 MD06434 2 Disposing of garbage 3 None 4 Disposing of garbage 5 286095005 6 Disposes of household garbage 7 Does dispose of household garbage (finding) 8 Disposing of garbage 9 C2371503

Distal third of esophagus
type: Class
subclass of: Digestive function (Body region)
comment: 1 M01805 2 Distal third of esophagus 3 Distal third of oesophagus 4 Distal third of esophagus 5 67173009 6 Distal third of esophagus 7 Structure of lower third of esophagus (body structure) 8 Distal third of esophagus 9 C0227191
alternative label: Distal third of oesophagus

Dividing attention
type: Class
subclass of: Nervous system and Mental function (Body measurement)
comment: 1 MD05649 2 Dividing attention 3 None 4 Dividing attention 5 311519004 6 Divided attention 7 Divided attention, function (observable entity) 8 Dividing attention 9 C0589101

Division of medicine
type: Class
subclass of: Hospital information, examination/diagnosis/treatment data
comment: 1 MD00230 2 Division of medicine 3 None 4 Division of medicine 5 118630004 6 Division 7 Division (procedure) 8 Division (surgical procedure) 9 C1293097

Dizziness Adverse Event
type: Class
subclass of: Nervous system and Mental function (Body measurement)
comment: 1 M02836 2 Dizziness Adverse Event 3 None 4 Dizziness Adverse Event 5 404640003 6 Dizziness 7 Dizziness (finding) 8 Dizziness, CTCAE 9 C4553830

Does bruise easily
type: Class
subclass of: Sensory function, Pain and Skin function (Symptom)
comment: 1 M02263 2 Does bruise easily 3 Easy bruising, bruise easily, Bruises easily bruising easy, easily bruises, Easy bruisability, Easy bruisability of skin 4 Does bruise easily 5 425075004 6 Does bruise easily 7 Does bruise easily (situation) 8 Increased tendency to bruise 9 C0423798
alternative label: Bruises easily
alternative label: Easy bruising
alternative label: easily bruises
alternative label: Easy bruisability of skin
alternative label: bruise easily
alternative label: bruising easy
alternative label: Easy bruisability

Does not drink alcohol
type: Class
subclass of: Sub-Cultural Level
comment: 1 M02467 2 Does not drink alcohol 3 None 4 Does not drink alcohol 5 105542008 6 Does not drink alcohol 7 Current non-drinker of alcohol (finding) 8 Current non-drinker of alcohol 9 C0457801

Does not require reading skills
type: Class
subclass of: Questionnaire
comment: 1 MD05134 2 Does not require reading skills 3 None 4 Does not require reading skills 5 273389003 6 Daily activities questionnaire 7 Daily activities questionnaire (assessment scale) 8 questionnaire 9 C0034394

Does not urinate often enough
type: Class
subclass of: Urogenital function (Symptom)
comment: 1 M02326 2 Does not urinate often enough 3 None 4 Does not urinate often enough 5 249291007 6 Does not urinate often enough 7 Infrequent urination (finding) 8 Infrequent urination 9 C0426377

Does ride a bicycle
type: Class
subclass of: Health Related Factors
comment: 1 M01242 2 Does ride a bicycle 3 None 4 Does ride a bicycle 5 300648001 6 Does ride a bicycle 7 Does ride a bicycle (finding) 8 Does ride a bicycle 9 C0577368

Doing the dishes
type: Class
subclass of: Health Related Factors
comment: 1 MD05384 2 Doing the dishes 3 None 4 Doing the dishes 5 286088001 6 Does wash dishes 7 Does washing-up (finding) 8 Washing Dishes 9 C4050473

Domesticated animals
type: Class
subclass of: Biological environment
comment: 1 MD06691 2 Domesticated animals 3 None 4 Domesticated animals 5 387961004 6 Animal 7 Kingdom Animalia (organism) 8 Domesticated animals 9 C0003063

Domicile
type: Class
subclass of: Units
comment: 1 MD02953 2 Domicile 3 None 4 Domicile 5 113173007 6 Domiciliary 7 Domiciliary (environment) 8 Domicile 9 C0242486

Dorsal
type: Class
subclass of: Units
comment: 1 M05861 2 Dorsal 3 None 4 Dorsal 5 255554000 6 Dorsal 7 Dorsal (qualifier value) 8 Dorsal 9 C0205095

Dorsalis pedis pulse
type: Class
subclass of: Cardiovascular system function (Body measurement)
comment: 1 M00192 2 Dorsalis pedis pulse 3 None 4 Dorsalis pedis pulse 5 421811005 6 Dorsalis pedis pulse 7 Dorsalis pedis pulse, function (observable entity) 8 Dorsalis pedis pulse 9 C1706488

Dorsalis pulse absent
type: Class
subclass of: Cardiovascular system function (Symptom)
comment: 1 M00193 2 Dorsalis pulse absent 3 Dorsalis pedis pulse absent, ABSENT DORSALIS, PEDIS PULSE" 4 Dorsalis pulse absent 5 301170006 6 Dorsalis pulse absent 7 Dorsalis pulse absent (finding) 8 Dorsalis pulse absent 9 C0577858
alternative label: ABSENT DORSALIS PEDIS PULSE
alternative label: Dorsalis pedis pulse absent

Dorsalis pulse present
type: Class
subclass of: Cardiovascular system function (Body measurement)
comment: 1 M00194 2 Dorsalis pulse present 3 Dorsalis pedis pulse present 4 Dorsalis pulse present 5 301160009 6 Dorsalis pulse present 7 Dorsalis pulse present (finding) 8 Dorsalis pulse present 9 C0577849
alternative label: Dorsalis pedis pulse present

Dorsiflexion
type: Class
subclass of: Musculoskeletal function (Body measurement)
comment: 1 MD04356 2 dorsiflexion 3 None 4 Dorsiflexion 5 71496008 6 Dorsiflexion of foot 7 Dorsiflexion of foot, function (observable entity) 8 Dorsiflexion of foot 9 C0231770

Dorsum of abdomen
type: Class
subclass of: Musculoskeletal function (Body region)
comment: 1 M01907 2 Dorsum of abdomen 3 None 4 Dorsum of abdomen 5 818983003 6 Abdomen 7 Structure of abdominopelvic cavity and/or content of abdominopelvic cavity and/or anterior abdominal wall (body structure) 8 Lumbar Region 9 C0024090

Down Syndrome
type: Class
subclass of: Hospital information, examination/diagnosis/treatment data
comment: 1 MD00393 2 Down Syndrome 3 None 4 Down Syndrome 5 41040004 6 Down syndrome 7 Complete trisomy 21 syndrome (disorder) 8 Down syndrome 9 C0013080

Dram
type: Class
subclass of: Units
comment: 1 M03500 2 Dram 3 None 4 Dram 5 767525000 6 Unit 7 Unit (qualifier value) 8 Dram Mass Unit 9 C1880406

Dram Mass Unit
type: Class
subclass of: Units
comment: 1 M05372 2 Dram Mass Unit 3 None 4 Dram Mass Unit 5 767525000 6 unit 7 Unit (qualifier value) 8 Dram Mass Unit 9 C1880406

Draw a circle on the wall
type: Class
subclass of: Health Related Factors
comment: 1 MD02783 2 Draw a circle on the wall 3 None 4 Draw a circle on the wall 5 226029000 6 exercises 7 Exercises (regime/therapy) 8 Exercise 9 C0015259

Dreaming sleep
type: Class
subclass of: Individual Related Factors
comment: 1 M01383 2 Dreaming sleep 3 dream sleep, dreams sleep, sleep dream, sleep dreaming 4 Dreaming sleep 5 89129007 6 Dreaming sleep 7 Rapid eye movement sleep, function (observable entity) 8 Sleep, REM 9 C0037322
alternative label: sleep dreaming
alternative label: dreams sleep
alternative label: dream sleep
alternative label: sleep dream

Drink types
type: Class
subclass of: Sub-Cultural Level
comment: 1 M00004 2 Drink types 3 drinks type 4 Drink types 5 229980000 6 Drink types 7 Drink types (substance) 8 Drink types 9 C0459136
alternative label: drinks type

Drinker of hard liquor
type: Class
subclass of: Sub-Cultural Level
comment: 1 M00009 2 Drinker of hard liquor 3 None 4 Drinker of hard liquor 5 160588008 6 Drinker of hard liquor 7 Drinker of hard liquor (finding) 8 Drinker of hard liquor 9 C0425329

Drinking Lifestyle Assessment Tool
type: Class
subclass of: Tool
comment: 1 MD03945 2 Drinking Lifestyle Assessment Tool 3 None 4 Drinking Lifestyle Assessment Tool 5 443781008 6 Assessment of lifestyle 7 Assessment of lifestyle (procedure) 8 Assessment of lifestyle 9 C0814436

Drinks alcohol
type: Class
subclass of: Sub-Cultural Level
comment: 1 M02625 2 Drinks alcohol 3 alcohol drink, alcohol drinking, alcohol drinks, drink alcohol 4 Drinks alcohol 5 219006 6 Drinks alcohol 7 Current drinker of alcohol (finding) 8 Current drinker 9 C0556297
alternative label: alcohol drinks
alternative label: alcohol drink
alternative label: alcohol drinking
alternative label: drink alcohol

Drinks beer and hard liquor
type: Class
subclass of: Sub-Cultural Level
comment: 1 M00006 2 Drinks beer and hard liquor 3 None 4 Drinks beer and hard liquor 5 160590009 6 Drinks beer and hard liquor 7 Drinks beer and hard liquor (finding) 8 Drinks beer and hard liquor 9 C0425331

Drinks beer and spirits
type: Class
subclass of: Classification of Patient
comment: 1 M02319 2 Drinks beer and spirits 3 None 4 Drinks beer and spirits 5 160590009 6 Drinks beer and spirits 7 Drinks beer and hard liquor (finding) 8 Drinks beer and spirits 9 C0425331

Drinks heavily
type: Class
subclass of: Sub-Cultural Level
comment: 1 M02161 2 Drinks heavily 3 None 4 Drinks heavily 5 86933000 6 Drinks heavily 7 Heavy drinker (finding) 8 Drinks heavily 9 C0337678

Drinks on special occasions
type: Class
subclass of: Sub-Cultural Level
comment: 1 M02627 2 Drinks on special occasions 3 None 4 Drinks on special occasions 5 228276006 6 Drinks on special occasions 7 Occasional drinker (finding) 8 Occasional drinker 9 C0556298

Drinks wine
type: Class
subclass of: Sub-Cultural Level
comment: 1 M00007 2 Drinks wine 3 drinking wine 4 Drinks wine 5 160591008 6 Drinks wine 7 Drinks wine (finding) 8 Drinks wine 9 C0425332
alternative label: drinking wine

Driving and community movement
type: Class
subclass of: Health Related Factors
comment: 1 MD05510 2 Driving and community movement 3 None 4 Driving and community movement 5 255324009 6 Movement 7 Movement (observable entity) 8 Movement 9 C0026649

Driving animal-powered vehicles
type: Class
subclass of: Health Related Factors
comment: 1 MD06364 2 Driving animal-powered vehicles 3 None 4 Driving animal-powered vehicles 5 261324000 6 Vehicle 7 Vehicle (physical object) 8 Driving animal-powered vehicles 9 C2371445

Driving human-powered transportation
type: Class
subclass of: Health Related Factors
comment: 1 MD06362 2 Driving human-powered transportation 3 None 4 Driving human-powered transportation 5 1137434003 6 Has access to transportation 7 Has access to transportation (finding) 8 Driving human-powered transportation 9 C2371443

Driving motorized vehicles
type: Class
subclass of: Health Related Factors
comment: 1 MD06363 2 Driving motorized vehicles 3 None 4 Driving motorized vehicles 5 261324000 6 Vehicle 7 Vehicle (physical object) 8 Driving motorized vehicles 9 C2371444

Drop
type: Class
subclass of: Units
comment: 1 M03538 2 Drop 3 Drop - unit of product usage drop as a measurement Drop Dosing Unit Drop measurement Drop Unit drops gtt Gtts Medical Drop 4 Drop 5 404218003 6 Drop 7 Drop - unit of product usage (qualifier value) 8 Drop Dosing Unit 9 C1321095
comment: 1 M03538-1 2 Drop 3 Drop - unit of product usage drop as a measurement Drop Dosing Unit Drop measurement Drop Unit drops gtt Gtts Medical Drop 4 Drop 5 404218003 6 Drop 7 Drop - unit of product usage (qualifier value) 8 Drop (unit of presentation) 9 C4318619
alternative label: Gtts
alternative label: Drop Unit
alternative label: drop as a measurement
alternative label: Medical Drop
alternative label: Drop measurement
alternative label: Drop - unit of product usage
alternative label: drops
alternative label: gtt
alternative label: Drop Dosing Unit

Dropperful
type: Class
subclass of: Units
comment: 1 M03485 2 Dropperful 3 None 4 Dropperful 5 421954001 6 Dropperful 7 Dropperful - unit of product usage (qualifier value) 8 Dropperful - unit of product usage 9 C1719829

Dropperful - unit of product usage
type: Class
subclass of: Units
comment: 1 M05346 2 Dropperful - unit of product usage 3 None 4 Dropperful - unit of product usage 5 421954001 6 Dropperful - unit of product usage 7 Dropperful - unit of product usage (qualifier value) 8 Dropperful - unit of product usage 9 C1719829

Drug Korean name
type: Class
subclass of: Hospital information, examination/diagnosis/treatment data
comment: 1 MD00887 2 Drug Korean name 3 None 4 Drug Korean name 5 410942007 6 drug 7 Drug or medicament (substance) 8 Drug-drug 9 C4036061

Drug dose
type: Class
subclass of: Hospital information, examination/diagnosis/treatment data
comment: 1 MD00888 2 Drug dose 3 None 4 Drug dose 5 398232005 6 Drug dose 7 Drug dose (finding) 8 Drug dose (finding) 9 C0678766

Drug induced sleep disorders
type: Class
subclass of: Nervous system and Mental function (Symptom)
comment: 1 M02816 2 Drug induced sleep disorders 3 cricket Drug induced sleep disor Drug-induced sleep disorder 4 Drug induced sleep disorders 5 418475009 6 Drug-induced sleep disorder 7 Drug-induced sleep disorder (disorder) 8 Drug-induced sleep disorder 9 C1456292
alternative label: cricket
alternative label: Drug-induced sleep disorder

Drug patch
type: Class
subclass of: Device
comment: 1 M04719 2 Drug patch 3 patch drug 4 Drug patch 5 386028003 6 Patch 7 Surgical patch (physical object) 8 Patch 9 C4319658
alternative label: patch drug

Drug plaster
type: Class
subclass of: Device
comment: 1 M04718 2 Drug plaster 3 None 4 Drug plaster 5 830076001 6 adhesive plaster 7 Adhesive plaster (physical object) 8 Adhesive plaster 9 C5394737

Drug suppository
type: Class
subclass of: Units
comment: 1 M03619 2 Drug suppository 3 suppository drug drugs suppository 4 Drug suppository 5 733019001 6 Suppository 7 Suppository (unit of presentation) 8 Suppository (unit of presentation) 9 C4319669
alternative label: suppository drug
alternative label: drugs suppository

Drum
type: Class
subclass of: Units
comment: 1 M03467 2 Drum 3 None 4 Drum 5 767524001 6 Unit of measure 7 Unit of measure (qualifier value) 8 Drum Dosing Unit 9 C1705958

Drum Dosing Unit
type: Class
subclass of: Units
comment: 1 M05294 2 Drum Dosing Unit 3 None 4 Drum Dosing Unit 5 767525000 6 unit 7 Unit (qualifier value) 8 Unit 9 C0439180

Drunk
type: Class
subclass of: Sub-Cultural Level
comment: 1 M02162 2 Drunk 3 drunks 4 Drunk 5 25702006 6 Drunk 7 Alcohol intoxication (disorder) 8 Drunk 9 C0001969
alternative label: drunks

Dry eyes
type: Class
subclass of: Sensory function, Pain and Skin function (Symptom)
comment: 1 M02098 2 Dry eyes 3 Dryness of eye, EYE DRYNESS, EYES DRY, DRY EYE 4 Dry eyes 5 162290004 6 Dry eyes 7 Dry eyes (finding) 8 Dry eyes 9 C0314719
alternative label: Dryness of eye
alternative label: EYE DRYNESS
alternative label: EYES DRY
alternative label: DRY EYE

Dry skin
type: Class
subclass of: Sensory function, Pain and Skin function (Symptom)
comment: 1 M01716 2 Dry skin 3 dryness of the skin, Skin dryness, SKIN DRY, SKIN DRYNESS 4 Dry skin 5 52475004 6 Dry skin 7 Xeroderma (disorder) 8 Dry skin 9 C0151908
alternative label: dryness of the skin
alternative label: Skin dryness
alternative label: SKIN DRY

Dry throat
type: Class
subclass of: Respiratory function (Symptom)
comment: 1 M01972 2 Dry throat 3 THROAT DRY THROAT DRYNESS dryness throat 4 Dry throat 5 102618009 6 Dry throat 7 Pharyngeal dryness (finding) 8 Dry throat 9 C0235234
alternative label: dryness throat
alternative label: THROAT DRYNESS
alternative label: THROAT DRY

Drying oneself
type: Class
subclass of: Health Related Factors
comment: 1 MD06374 2 Drying oneself 3 None 4 Drying oneself 5 284830004 6 Does dry self 7 Does dry self (finding) 8 Drying oneself 9 C2371456

Duathlon
type: Class
subclass of: Sport
comment: 1 M00399 2 Duathlon 3 None 4 Duathlon 5 415577004 6 Sport 7 Sport (qualifier value) 8 Sports 9 C0038039

Dull
type: Class
subclass of: Sensory function, Pain and Skin function (Symptom)
comment: 1 MD04080 2 Dull 3 None 4 Dull 5 263744001 6 Dull 7 Dull (qualifier value) 8 Dull 9 C0443208

Dumbbell Press
type: Class
subclass of: Muscle Strengthening Exercise
comment: 1 MD02727 2 Dumbbell Press 3 None 4 Dumbbell Press 5 256235009 6 exercise 7 Exercise (observable entity) 8 Exercise 9 C0015259

Duration
type: Class
subclass of: Time patterns
comment: 1 MD01113 2 duration 3 None 4 duration 5 103335007 6 Duration 7 Duration (attribute) 8 Duration (temporal concept) 9 C0449238
comment: 1 MD01113-1 2 duration 3 None 4 duration 5 762636008 6 Duration 7 Duration (property) (qualifier value) 8 Duration (temporal concept) 9 C0449238
comment: 1 MD01113-2 2 duration 3 None 4 duration 5 272116003 6 Durations 7 Durations (qualifier value) 8 Duration (temporal concept) 9 C0449238

During activity
type: Class
subclass of: Health Related Factors
comment: 1 MD04331 2 During activity 3 during activites, During activities, during activity 4 During activity 5 257733005 6 Activity 7 Activity (observable entity) 8 Activities 9 C0441655
alternative label: During activities

During morning
type: Class
subclass of: Duration
comment: 1 M06630 2 During morning 3 None 4 During morning 5 73775008 6 During morning 7 Morning (qualifier value) 8 Morning 9 C0332170

Dust exposure
type: Class
subclass of: Physical/Chemical Environment
comment: 1 M00248 2 Dust exposure 3 None 4 Dust exposure 5 102444002 6 Exposure to toxic dust 7 Exposure to toxic dust (event) 8 exposure to dust 9 C0239200

Dust generation operations
type: Class
subclass of: Questionnaire
comment: 1 MD04996 2 Dust generation operations 3 None 4 Dust generation operations 5 33008008 6 Dsut 7 Dust (substance) 8 Dust 9 C0013330

Dyadic therapy
type: Class
subclass of: Hospital information, examination/diagnosis/treatment data
comment: 1 M01788 2 Dyadic therapy 3 None 4 Dyadic therapy 5 18512000 6 Dyadic therapy 7 Individual psychotherapy (regime/therapy) 8 Dyadic therapy 9 C0204525

Dye test units
type: Class
subclass of: Units
comment: 1 M02870 2 Dye test units 3 None 4 Dye test units 5 258737009 6 Dye test units 7 Dye test units (qualifier value) 8 Dye test units 9 C0439159

Dyne
type: Class
subclass of: Units
comment: 1 M04698 2 Dyne 3 dyn Dyne - unit of force 4 Dyne 5 282815007 6 dyne 7 dyne (qualifier value) 8 dyne 9 C0600130
alternative label: dyn

Dyne - unit of force
type: Class
subclass of: Units
comment: 1 M04697 2 Dyne - unit of force 3 dyn 4 Dyne - unit of force 5 282815007 6 dyne 7 dyne (qualifier value) 8 dyne 9 C0600130

Dyscoordination
type: Class
subclass of: Nervous system and Mental function (Symptom)
comment: 1 M02574 2 Dyscoordination 3 None 4 Dyscoordination 5 302289002 6 Coordination problem 7 Coordination problem (finding) 8 Abnormal coordination 9 C0520966

Dysnystaxis
type: Class
subclass of: Individual Related Factors
comment: 1 M02088 2 Dysnystaxis 3 None 4 Dysnystaxis 5 29373008 6 Dysnystaxis 7 Light sleep (finding) 8 Dysnystaxis 9 C0278182

Dyspnea
type: Class
subclass of: Respiratory function (Symptom)
comment: 1 M00896 2 Dyspnea 3 Dyspnea - symptom, Dyspneas, DYSPNOEA, Dyspnoea - symptom 4 Dyspnea 5 267036007 6 Dyspnea 7 Dyspnea (finding) 8 Dyspnea 9 C0013404
alternative label: Dyspneas
alternative label: Dyspnea - symptom
alternative label: DYSPNOEA
alternative label: Dyspnoea - symptom

http://www.semanticweb.org/user/ontologies/2023/10/untitled-ontology-5#E
type: Class
subclass of: Units
comment: 1 MD04781 2 E 3 None 4 E 5 257964002 6 E 7 Upper case Roman letter E (qualifier value) 8 E 9 C0439108
comment: 1 MD04781-1 2 E 3 None 4 E 5 257964002 6 E 7 Upper case Roman letter E (qualifier value) 8 e 9 C0439131

E-mail address
type: Class
subclass of: Units
comment: 1 MD00988 2 E-mail address 3 None 4 E-mail address 5 424966008 6 Patient e-mail address 7 Patient email address (observable entity) 8 E-mail Address 9 C1705961

ELBOW-KNEE
type: Class
subclass of: Musculoskeletal function (Body region)
comment: 1 MD02024 2 ELBOW-KNEE 3 None 4 ELBOW-KNEE 5 52530000 6 Body region structure (body structure) 7 body region 8 Body Regions 9 C0005898

EQ-5D-3L
type: Class
subclass of: Tool
comment: 1 MD03263 2 EQ-5D-3L 3 None 4 EQ-5D-3L 5 1144751002 6 EQ-5D-3l (EuroQol five dimension three level) questionnaire 7 EuroQol five dimension three level questionnaire (assessment scale) 8 European Quality of Life Five Dimension Three Level Questionnaire 9 C1880594

EQ-5D-VAS
type: Class
subclass of: Tool
comment: 1 MD03264 2 EQ-5D-VAS 3 None 4 EQ-5D-VAS 5 273903006 6 VAS - Visual analog scale 7 Visual analog scale (assessment scale) 8 EQ-5D-5L - EQ VAS Score 9 C3640477

Each day
type: Class
subclass of: Day
comment: 1 M03631 2 Each day 3 None 4 Each day 5 69620002 6 Each day 7 Daily (qualifier value) 8 Daily 9 C0332173

Each week
type: Class
subclass of: Units
comment: 1 M03636 2 Each week 3 None 4 Each week 5 14497002 6 Each week 7 Weekly (qualifier value) 8 Weekly 9 C0332174

Eating behavior and appetite
type: Class
subclass of: Sub-Cultural Level
comment: 1 M00022 2 Eating behavior and appetite 3 None 4 Eating behavior and appetite 5 248113009 6 Eating behavior and appetite 7 Eating behavior and appetite (finding) 8 Eating behavior and appetite 9 C0474423
alternative label: Eating behaviour and appetite

Eating bread with jam
type: Class
subclass of: Health Related Factors
comment: 1 MD05355 2 Eating bread with jam 3 None 4 Eating bread with jam 5 288886005 6 Does eat 7 Does eat (finding) 8 Does eat 9 C0566307

Eating disorder
type: Class
subclass of: Digestive function (Symptom)
comment: 1 M00023 2 Eating disorder 3 Eating Disorders 4 Eating disorder 5 72366004 6 Eating disorder 7 Eating disorder (disorder) 8 Eating disorder 9 C0013473
alternative label: Eating Disorders

Eating disorder examination
type: Class
subclass of: Tool
comment: 1 M00024 2 Eating disorder examination 3 None 4 Eating disorder examination 5 443446005 6 Eating disorder examination 7 Eating disorder examination (assessment scale) 8 Eating disorder examination 9 C2732388

Eating disorder in remission
type: Class
subclass of: Activities of disability
comment: 1 M00025 2 Eating disorder in remission 3 None 4 Eating disorder in remission 5 427469003 6 Eating disorder in remission 7 Eating disorder in remission (disorder) 8 Eating disorder in remission 9 C1960037

Eating disorders management
type: Class
subclass of: Health Related Factors
comment: 1 M00026 2 Eating disorders management 3 None 4 Eating disorders management 5 386264009 6 Eating disorders management 7 Eating disorders management (procedure) 8 Eating disorders management 9 C0150193

Eating feeding and drinking observations
type: Class
subclass of: Sub-Cultural Level
comment: 1 M02632 2 Eating feeding and drinking observations 3 None 4 Eating feeding and drinking observations 5 116336009 6 Eating feeding and drinking observations 7 Eating / feeding / drinking finding (finding) 8 Eating / feeding / drinking finding 9 C0559899

Eating habit
type: Class
subclass of: Individual Related Factors
comment: 1 M00028 2 Eating habit 3 eating habits 4 Eating habit 5 116060000 6 Eating habit 7 Eating habit (life style) 8 Eating habit 9 C1266864
alternative label: eating habits

Economic policies
type: Class
subclass of: Public Policy Factors
comment: 1 MD06779 2 Economic policies 3 None 4 Economic policies 5 276339004 6 environment 7 Environment (environment) 8 Economic policies 9 C0282159

Economic self-sufficiency
type: Class
subclass of: Individual Related Factors
comment: 1 MD06535 2 Economic self-sufficiency 3 None 4 Economic self-sufficiency 5 844005 6 Behavior finding 7 Behavior finding (finding) 8 Economic self-sufficiency 9 C2371596

Economic services
type: Class
subclass of: Public Policy Factors
comment: 1 MD06777 2 Economic services 3 None 4 Economic services 5 224930009 6 services 7 Services (qualifier value) 8 Economic services 9 C2371803

Economic systems
type: Class
subclass of: Public Policy Factors
comment: 1 MD06778 2 Economic systems 3 None 4 Economic systems 5 246333005 6 system 7 System (attribute) 8 Economic systems 9 C2371804

Edema
type: Class
subclass of: Sensory function, Pain and Skin function (Symptom)
comment: 1 MD03040 2 Edema 3 None 4 Edema 5 79654002 6 Edema 7 Edema (morphologic abnormality) 8 Edema 9 C0013604
comment: 1 MD03040-1 2 Edema 3 None 4 Edema 5 267038008 6 Edema 7 Edema (finding) 8 Edema 9 C0013604

Education and training policies
type: Class
subclass of: Public Policy Factors
comment: 1 MD06803 2 Education and training policies 3 None 4 Education and training policies 5 276339004 6 environment 7 Environment (environment) 8 Education and training policies 9 C2371825

Education and training services
type: Class
subclass of: Public Policy Factors
comment: 1 MD06801 2 Education and training services 3 None 4 Education and training services 5 224930009 6 services 7 Services (qualifier value) 8 Education and training services 9 C2371823

Education and training systems
type: Class
subclass of: Public Policy Factors
comment: 1 MD06802 2 Education and training systems 3 None 4 Education and training systems 5 246333005 6 system 7 System (attribute) 8 Education and training systems 9 C2371824

Education life
type: Class
subclass of: Individual Related Factors
comment: 1 MD06516 2 Education life 3 None 4 Education life 5 313204009 6 Lifestyle education 7 Lifestyle education (procedure) 8 Lifestyle education 9 C0730543

Edwards syndrome
type: Class
subclass of: Hospital information, examination/diagnosis/treatment data
comment: 1 MD00394 2 Edwards syndrome 3 None 4 Edwards syndrome 5 51500006 6 Edwards syndrome 7 Complete trisomy 18 syndrome (disorder) 8 Edward's Disorder (Trisomy 18) Determination Reagents 9 C0972858

Effective date
type: Class
subclass of: Health Related Factors
comment: 1 MD05217 2 Effective date 3 None 4 Effective date 5 410671006 6 Date 7 Date (attribute) 8 Date in time 9 C0011008

Elbow exercises
type: Class
subclass of: Limb
comment: 1 M00304 2 Elbow exercises 3 elbow exercise, exercise elbow 4 Elbow exercises 5 229116002 6 Elbow exercises 7 Elbow exercises (regime/therapy) 8 Elbow exercises 9 C0454327
alternative label: exercise elbow
alternative label: elbow exercise

Elbow exercises in water
type: Class
subclass of: Active exercise
comment: 1 M00305 2 Elbow exercises in water 3 None 4 Elbow exercises in water 5 229182009 6 Elbow exercises in water 7 Elbow exercises in water (regime/therapy) 8 Elbow exercises in water 9 C0454391

Elbow joint
type: Class
subclass of: Musculoskeletal function (Body region)
comment: 1 MD07030 2 Elbow joint 3 None 4 Elbow joint 5 16953009 6 Elbow joint 7 Elbow joint structure (body structure) 8 Elbow joint 9 C0013770

Electrolyte balance
type: Class
subclass of: Functions of Blood System, Metabolic system and Endocrine system (Body measurement)
comment: 1 MD05962 2 Electrolyte balance 3 None 4 Electrolyte balance 5 16379007 6 Water-electrolyte balance 7 Water-electrolyte balance, function (observable entity) 8 Electrolyte balance 9 C0013831

Electromagnetic energy therapy
type: Class
subclass of: Nervous system and Mental function (Therapy)
comment: 1 M00616 2 Electromagnetic energy therapy 3 None 4 Electromagnetic energy therapy 5 313092005 6 Electromagnetic energy therapy 7 Electromagnetic energy therapy (regime/therapy) 8 Electromagnetic energy therapy 9 C0730440

Electromyography
type: Class
subclass of: Musculoskeletal function (Body measurement)
comment: 1 MD02971-1 2 Electromyography 3 Electromyogram 4 Electromyography 5 42803009 6 Electromyography 7 Electromyography (procedure) 8 Electromyography 9 C0013839
alternative label: Electromyogram

Elevated liver enzymes
type: Class
subclass of: Digestive function (Symptom)
comment: 1 M00483 2 Elevated liver enzymes 3 elevated enzymes liver liver elevated enzymes liver enzymes elevated elevated liver enzyme HEPATIC ENZYMES INCREASED enzymes liver raised raised liver enzymes 4 Elevated liver enzymes 5 707724006 6 Elevated liver enzymes level 7 Liver enzymes level above reference range (finding) 8 Elevated liver enzymes 9 C0235996
alternative label: elevated liver enzyme
alternative label: HEPATIC ENZYMES INCREASED
alternative label: liver enzymes elevated
alternative label: elevated enzymes liver
alternative label: enzymes liver raised
alternative label: raised liver enzymes
alternative label: liver elevated enzymes

Elevated mood
type: Class
subclass of: Nervous system and Mental function (Symptom)
comment: 1 M05825 2 Elevated mood 3 None 4 Elevated mood 5 81548002 6 Elevated mood 7 Elevated mood (finding) 8 Elevated mood 9 C0233479

Elimination of faeces
type: Class
subclass of: Digestive function (Body measurement)
comment: 1 MD05933 2 Elimination of faeces 3 None 4 Elimination of faeces 5 63911002 6 elimination 7 Excretory function (observable entity) 8 Elimination of faeces 9 C2371130

Elliptical trainer
type: Class
subclass of: Device
comment: 1 M00400 2 Elliptical trainer 3 None 4 Elliptical trainer 5 111045004 6 Exerciser 7 Exerciser, device 8 Sports Equipment 9 C0524990

Emergency
type: Class
subclass of: Hospital Administration
comment: 1 MD00171 2 Emergency 3 None 4 Emergency 5 25876001 6 Emergency 7 Emergency (qualifier value) 8 Patient Class - Emergency 9 C1561583
comment: 1 MD00171-1 2 Emergency 3 None 4 Emergency 5 25876001 6 Emergency 7 Emergency (qualifier value) 8 Accident & emergency (surgical speciality) 9 C1274029

Emergency Contact
type: Class
subclass of: Units
comment: 1 MD02955 2 Emergency Contact 3 None 4 Emergency Contact 5 1187334000 6 Emergency contact 7 Emergency contact (person) 8 Emergency contact 9 C1552023

Emergency Medical Technician
type: Class
subclass of: Hospital information, examination/diagnosis/treatment data
comment: 1 MD00600 2 Emergency Medical Technician 3 None 4 Emergency Medical Technician 5 397897005 6 Emergency medical technician 7 Paramedic (occupation) 8 Emergency medical technician 9 C0013963

Emergency room
type: Class
subclass of: Classification of Hospital
comment: 1 MD00602 2 Emergency room 3 None 4 Emergency room 5 50849002 6 Emergency room admission 7 Emergency room admission (procedure) 8 Emergency Room - Hospital 9 C4291935

Emotional functions
type: Class
subclass of: Nervous system and Mental function (Body measurement)
comment: 1 MD05665 2 Emotional functions 3 None 4 Emotional functions 5 1155970002 6 Emotion function 7 Emotion function (observable entity) 8 Emotional functions 9 C0013987

Emotional lability
type: Class
subclass of: Nervous system and Mental function (Symptom)
comment: 1 M01667 2 Emotional lability 3 Emotional instability, Emotionally labile, INSTABILITY EMOTIONAL, LABILITY EMOTIONAL 4 Emotional lability 5 18963009 6 Emotional lability 7 Mood swings (finding) 8 Emotional lability 9 C0085633
alternative label: Emotionally labile
alternative label: Emotional instability
alternative label: LABILITY EMOTIONAL
alternative label: INSTABILITY EMOTIONAL

Employment status
type: Class
subclass of: Units
comment: 1 MD02959 2 Employment status 3 None 4 Employment status 5 224362002 6 Employment status 7 Employment status (observable entity) 8 Employment status 9 C0242271

Enabled
type: Class
subclass of: Units
comment: 1 MD01961 2 Enabled 3 None 4 Enabled 5 225791005 6 Enabled 7 Empowered (finding) 8 Enabling 9 C1171285

End-Tidal CO2
type: Class
subclass of: Hospital information, examination/diagnosis/treatment data
comment: 1 MD03180 2 End-Tidal CO2 3 None 4 End-Tidal CO2 5 251408004 6 VCO2-Carbon dioxide output 7 Carbon dioxide output (observable entity) 8 Carbon dioxide output 9 C0429247
comment: 1 MD03746 2 End-Tidal CO2 3 None 4 End-Tidal CO2 5 250790007 6 End tidal carbon dioxide 7 End tidal carbon dioxide tension (observable entity) 8 End tidal carbon dioxide partial pressure 9 C0428664

End-Tidal O2
type: Class
subclass of: Hospital information, examination/diagnosis/treatment data
comment: 1 MD03179 2 End-Tidal O2 3 None 4 End-Tidal O2 5 251832002 6 VO2-oxygen uptake 7 Oxygen uptake (observable entity) 8 Oxygen uptake 9 C0429627
comment: 1 MD03745 2 End-Tidal O2 3 None 4 End-Tidal O2 5 250778005 6 ETO2 - End tidal oxygen concentration 7 End tidal oxygen concentration (observable entity) 8 End tidal oxygen concentration 9 C0428651

End Time
type: Class
subclass of: Time
comment: 1 MD02670 2 End Time 3 end time 4 End Time 5 442137000 6 procedure end time 7 Completion time of procedure (observable entity) 8 End Time 9 C1522314

Ending a conversation
type: Class
subclass of: Health Related Factors
comment: 1 MD06255 2 Ending a conversation 3 None 4 Ending a conversation 5 288679000 6 Terminates conversation 7 Does terminate conversation (finding) 8 Ending a conversation 9 C2371359

Endocervical adenoepithelial cell
type: Class
subclass of: Hospital information, examination/diagnosis/treatment data
comment: 1 MD00736 2 Endocervical adenoepithelial cell 3 None 4 Endocervical adenoepithelial cell 5 91767003 6 Endocervical glandular cell 7 Structure of endocervical glandular cell (cell structure) 8 Endocervical 9 C1550252

Endocrine
type: Class
subclass of: Cardiovascular system function (Body region)
comment: 1 MD00410 2 Endocrine 3 None 4 Endocrine 5 40818001 6 Entire endocrine gland 7 Entire endocrine gland (body structure) 8 Endocrine 9 C0521425

Endocrine gland disorder
type: Class
subclass of: Body functions of disability
comment: 1 MD00048 2 Endocrine gland disorder 3 None 4 Endocrine gland disorder 5 362969004 6 Disorder of endocrine gland 7 Disorder of endocrine system (disorder) 8 Endocrine gland disorder 9 C0014130

Endocrine hyperthermia
type: Class
subclass of: Immune system function (Symptom)
comment: 1 M00156 2 Endocrine hyperthermia 3 None 4 Endocrine hyperthermia 5 248454007 6 Endocrine hyperthermia 7 Endocrine hyperthermia (finding) 8 Endocrine hyperthermia 9 C0424788

Endocrinology
type: Class
subclass of: Classification of Hospital
comment: 1 MD00681 2 Endocrinology 3 None 4 Endocrinology 5 394583002 6 Endocrinology 7 Endocrinology (qualifier value) 8 Endocrinology 9 C0014137

Endomondo
type: Class
subclass of: Units
comment: 1 M05735 2 Endomondo 3 None 4 Endomondo 5 413568008 6 Application - unit of product usage (qualifier value) 7 Application - unit of product usage (qualifier value) 8 Application dose 9 C1533134

Endurance exercises
type: Class
subclass of: Muscle Strengthening Exercise
comment: 1 M02226 2 Endurance exercises 3 None 4 Endurance exercises 5 88965008 6 Endurance exercises 7 Muscular endurance development exercise (regime/therapy) 8 Endurance exercises 9 C0419120
alternative label: endurance exercise

Endurance of all muscles of the body
type: Class
subclass of: Musculoskeletal function (Body measurement)
comment: 1 MD06066 2 Endurance of all muscles of the body 3 None 4 Endurance of all muscles of the body 5 406203001 6 Endurance 7 Endurance (observable entity) 8 Endurance of all muscles of the body 9 C2371237

Endurance of isolated muscles
type: Class
subclass of: Musculoskeletal function (Body measurement)
comment: 1 MD06064 2 Endurance of isolated muscles 3 None 4 Endurance of isolated muscles 5 406203001 6 Endurance 7 Endurance (observable entity) 8 Endurance of isolated muscles 9 C2371235

Endurance of muscle groups
type: Class
subclass of: Musculoskeletal function (Body measurement)
comment: 1 MD06065 2 Endurance of muscle groups 3 None 4 Endurance of muscle groups 5 406203001 6 Endurance 7 Endurance (observable entity) 8 Endurance of muscle groups 9 C2371236

Energy Intake
type: Class
subclass of: Nutrient intake
comment: 1 M00786 2 Energy Intake 3 Energy intakes, Intake energy 4 Energy Intake 5 787787004 6 Energy intake 7 Energy intake (observable entity) 8 Energy intake 9 C0006777
alternative label: Intake energy
alternative label: Energy intakes

Energy and drive functions
type: Class
subclass of: Nervous system and Mental function (Body measurement)
comment: 1 MD05629 2 Energy and drive functions 3 None 4 Energy and drive functions 5 91208009 6 Energy and drive functions 7 Energy and drive functions 8 Energy and drive functions 9 C2370867

Energy level
type: Class
subclass of: Nervous system and Mental function (Body measurement)
comment: 1 MD05630 2 Energy level 3 None 4 Energy level 5 712890000 6 Normal energy level 7 Normal energy level (finding) 8 Energy level 9 C0516979

Energy per unit body weight
type: Class
subclass of: Units
comment: 1 M03199 2 Energy per unit body weight 3 None 4 Energy per unit body weight 5 282737007 6 Energy per unit body weight 7 Energy per unit body weight (qualifier value) 8 Energy per unit body weight 9 C0560594

Engaged in bowling
type: Class
subclass of: Health Related Factors
comment: 1 M02113 2 Engaged in bowling 3 None 4 Engaged in bowling 5 40376000 6 bowling 7 Bowling (qualifier value) 8 Bowling (activity) 9 C0336949

Engaged in boxing
type: Class
subclass of: Sport
comment: 1 M00780 2 Engaged in boxing 3 None 4 Engaged in boxing 5 29506000 6 Boxing 7 Boxing (qualifier value) 8 Boxing (sports activity) 9 C0006080

Engaged in golfing
type: Class
subclass of: Sport
comment: 1 M01056 2 Engaged in golfing 3 None 4 Engaged in golfing 5 15530008 6 Golfing 7 Golfing (qualifier value) 8 Golf 9 C0018041

Engaged in handball
type: Class
subclass of: Health Related Factors
comment: 1 M02110 2 Engaged in handball 3 None 4 Engaged in handball 5 25976000 6 handball 7 Handball (qualifier value) 8 Handball 9 C0336936

Engaged in horseback riding
type: Class
subclass of: Health Related Factors
comment: 1 M02115 2 Engaged in horseback riding 3 None 4 Engaged in horseback riding 5 47517001 6 horseback riding 7 Horseback riding (qualifier value) 8 Horseback riding 9 C0336962

Engaged in jogging
type: Class
subclass of: Aerobic Exercise
comment: 1 M01214 2 Engaged in jogging 3 None 4 Engaged in jogging 5 1968006 6 Jogging 7 Jogging (qualifier value) 8 Jogging 9 C0022400

Engaged in martial arts
type: Class
subclass of: Sport
comment: 1 M01640 2 Engaged in martial arts 3 None 4 Engaged in martial arts 5 6351001 6 Martial arts 7 Martial arts (qualifier value) 8 Martial arts 9 C0079801

Engaged in mountain climbing
type: Class
subclass of: Health Related Factors
comment: 1 M02117 2 Engaged in mountain climbing 3 None 4 Engaged in mountain climbing 5 111055000 6 mountain climbing 7 Mountain climbing (qualifier value) 8 Mountain climbing 9 C0336963

Engaged in peak climbing
type: Class
subclass of: Health Related Factors
comment: 1 M02118 2 Engaged in peak climbing 3 None 4 Engaged in peak climbing 5 111055000 6 Peak climbing 7 Mountain climbing (qualifier value) 8 Peak climbing 9 C0336963

Engaged in skiing
type: Class
subclass of: Sport
comment: 1 M01353 2 Engaged in skiing 3 None 4 Engaged in skiing 5 45033006 6 skiing 7 Skiing (qualifier value) 8 Skiing (recreational activity) 9 C0037264

Engaged in sledding
type: Class
subclass of: Health Related Factors
comment: 1 M02124 2 Engaged in sledding 3 None 4 Engaged in sledding 5 48818000 6 sledding 7 Sledding (qualifier value) 8 Sledding 9 C0336980

Engaged in snowboarding
type: Class
subclass of: Health Related Factors
comment: 1 M02777 2 Engaged in snowboarding 3 None 4 Engaged in snowboarding 5 102393008 6 Snowboarding 7 Snowboarding (qualifier value) 8 Snowboarding (activity) 9 C1138838

Engaged in soccer
type: Class
subclass of: Sport
comment: 1 M01405 2 Engaged in soccer 3 None 4 Engaged in soccer 5 88289009 6 Football 7 Soccer (qualifier value) 8 Football 9 C0336986

Engaged in sports activity
type: Class
subclass of: Sport
comment: 1 M01416 2 Engaged in sports activity 3 None 4 Engaged in sports activity 5 14468000 6 Sports 7 Sports activity (observable entity) 8 Sports 9 C0038039

Engaged in surfing
type: Class
subclass of: Health Related Factors
comment: 1 M02108 2 Engaged in surfing 3 None 4 Engaged in surfing 5 84096006 6 surfing 7 Surfing (qualifier value) 8 Surfing 9 C0336932

Enhanced
type: Class
subclass of: Units
comment: 1 MD02526 2 Enhanced 3 None 4 Enhanced 5 418393006 6 Enhancement 7 Refractive surgery enhancement (procedure) 8 Enhance (action) 9 C2349975

Enlarged glands
type: Class
subclass of: Functions of Blood System, Metabolic system and Endocrine system (Symptom)
comment: 1 M00484 2 Enlarged glands 3 enlarged gland, glands enlarged 4 Enlarged glands 5 59441001 6 Lymph gland 7 Structure of lymph node (body structure) 8 Gland 9 C1285092
alternative label: glands enlarged
alternative label: enlarged gland

Enlargement lymph nodes
type: Class
subclass of: Immune system function (Symptom)
comment: 1 M02503 2 Enlargement lymph nodes 3 enlarged lymph node, Enlarged lymph nodes, enlargement lymph node, Enlargement of lymph nodes, enlargements lymph node, lymph enlarged nodes, lymph nodes enlargement 4 Enlargement lymph nodes 5 30746006 6 Enlargement of lymph nodes 7 Lymphadenopathy (disorder) 8 Lymphadenopathy 9 C0497156
alternative label: enlargements lymph node
alternative label: enlargement lymph node
alternative label: Enlargement of lymph nodes
alternative label: lymph nodes enlargement
alternative label: enlarged lymph node
alternative label: lymph enlarged nodes
alternative label: Enlarged lymph nodes

Entire head
type: Class
subclass of: Musculoskeletal function (Body region)
comment: 1 M02795 2 Entire head 3 Entire head (body structure) 4 Entire head 5 302548004 6 Entire head 7 Entire head (body structure) 8 Entire head 9 C1281590
alternative label: Entire head (body structure)

Entire lumbar region
type: Class
subclass of: Musculoskeletal function (Body region)
comment: 1 M01896 2 Entire lumbar region 3 None 4 Entire lumbar region 5 1017209009 6 Entire abdominal lumbar region 7 Entire abdominal lumbar region (body structure) 8 Entire lumbar region 9 C3887606

Entire nose
type: Class
subclass of: Musculoskeletal function (Body region)
comment: 1 M02793 2 Entire nose 3 None 4 Entire nose 5 181195007 6 Entire nose 7 Entire nose (body structure) 8 Entire nose 9 C1278896

Entire skin
type: Class
subclass of: Musculoskeletal function (Body region)
comment: 1 M02794 2 Entire skin 3 None 4 Entire skin 5 181469002 6 Entire skin 7 Entire skin (body structure) 8 Entire skin 9 C1278993

Environment
type: Class
comment: 1 M00245 2 Environment 3 Envir, Environmental, Environments 4 Environment 5 276339004 6 Environment 7 Environment (environment) 8 Environment 9 C0014406
alternative label: Environments
alternative label: Envir
alternative label: Environmental

Environmental Sleep Disorder
type: Class
subclass of: Nervous system and Mental function (Symptom)
comment: 1 M02730 2 Environmental sleep disorder 3 Environmental Sleep Disorders 4 Environmental Sleep Disorder 5 429276004 6 Environmental sleep disorder 7 Environmental sleep disorder (disorder) 8 Environmental sleep disorder 9 C0752289
alternative label: Environmental Sleep Disorders

Enzyme
type: Class
subclass of: Hospital information, examination/diagnosis/treatment data
comment: 1 MD00400 2 Enzyme 3 None 4 Enzyme 5 90668006 6 Enzyme 7 Substance with enzyme mechanism of action (substance) 8 Enzymes 9 C0014442
comment: 1 MD00400-1 2 Enzyme 3 None 4 Enzyme 5 90668006 6 Enzyme 7 Substance with enzyme mechanism of action (substance) 8 Enzyme (disposition) 9 C4521602
comment: 1 MD00400-2 2 Enzyme 3 None 4 Enzyme 5 734543001 6 Enzyme 7 Enzyme (disposition) 8 Enzymes 9 C0014442
comment: 1 MD00400-3 2 Enzyme 3 None 4 Enzyme 5 734543001 6 Enzyme 7 Enzyme (disposition) 8 Enzyme (disposition) 9 C4521602

Enzyme Replacement Therapy
type: Class
subclass of: Nervous system and Mental function (Therapy)
comment: 1 MD00248 2 Enzyme Replacement Therapy 3 None 4 Enzyme Replacement Therapy 5 90668006 6 Enzyme 7 Substance with enzyme mechanism of action (substance) 8 Enzymes 9 C0014442

Epidermolysis
type: Class
subclass of: Sensory function, Pain and Skin function (Symptom)
comment: 1 MD00443 2 Epidermolysis 3 None 4 Epidermolysis 5 85269007 6 Epidermolysis 7 Epidermolysis (morphologic abnormality) 8 Epidermolysis 9 C0333472

Epigastric fossa
type: Class
subclass of: Digestive function (Body region)
comment: 1 M01307 2 Epigastric fossa 3 Fossa epigastrica 4 Epigastric fossa 5 27947004 6 Epigastrium 7 Epigastric region structure (body structure) 8 Epigastrium 9 C0230185
alternative label: Fossa epigastrica

Epigastric region
type: Class
subclass of: Digestive function (Body region)
comment: 1 M01286 2 Epigastric region structure 3 Epigastrium, Epigastric part of abdomen 4 Epigastric region 5 27947004 6 Epigastric region 7 Epigastric region structure (body structure) 8 Epigastric region 9 C0230185

Epigastric region structure
type: Class
subclass of: Digestive function (Body region)
comment: 1 M01308 2 Epigastric region structure 3 Epigastrium, Epigastric region 4 Epigastric region structure 5 27947004 6 Epigastric region structure 7 Epigastric region structure (body structure) 8 Epigastric region structure 9 C0230185
alternative label: Epigastrium
alternative label: Epigastric part of abdomen

Epilepsy
type: Class
subclass of: Body functions of disability
comment: 1 MD00093 2 Epilepsy 3 None 4 Epilepsy 5 84757009 6 Epilepsy 7 Epilepsy (disorder) 8 Epilepsy 9 C0014544

Epistaxis
type: Class
subclass of: Functions of Blood System, Metabolic system and Endocrine system (Symptom)
comment: 1 M00935 2 Epistaxis 3 Bleeding from nose, Finding of bleeding of nose, Hemorrhage from nose, HEMORRHAGE NASAL, nasal bleed, Nasal Bleeding, nasal Bleedings, nasal haemorrhage, Nasal hemorrhage, Nose Bleed, Nose bleed/epistaxis, nose bleeding, Nose Bleeds, Observation of bleeding of nose 4 Epistaxis 5 249366005 6 Epistaxis 7 Bleeding from nose (finding) 8 Epistaxis 9 C0014591
alternative label: Hemorrhage from nose
alternative label: nose bleeding
alternative label: nasal bleed
alternative label: Nasal Bleeding
alternative label: Bleeding from nose
alternative label: Nose Bleeds
alternative label: nasal haemorrhage
alternative label: Observation of bleeding of nose
alternative label: Finding of bleeding of nose
alternative label: Nasal Bleedings
alternative label: Nasal hemorrhage
alternative label: Nose bleed/epistaxis
alternative label: Nose Bleed
alternative label: HEMORRHAGE NASAL

Epoch
type: Class
subclass of: Units
comment: 1 MD02525 2 Epoch 3 None 4 Epoch 5 767525000 6 unit 7 Unit (qualifier value) 8 unit 9 C0439148

Equestrianism
type: Class
subclass of: Sport
comment: 1 M05870 2 Equestrianism 3 None 4 Equestrianism 5 47517001 6 Horseback riding 7 Horseback riding (qualifier value) 8 Horseback riding 9 C0336962

Equipment
type: Class
subclass of: Equipment/Device/Tool/Questionnaire
comment: 1 MD02524 2 equipment 3 None 4 equipment 5 246137000 6 Equipment 7 Equipment (attribute) 8 Equipment 9 C0014672

Equivalent
type: Class
subclass of: Units
comment: 1 M02882 2 Equivalent 3 equivalents Eq 4 Equivalent 5 258726008 6 equivalent 7 equivalent - unit (qualifier value) 8 Equal 9 C0205163
alternative label: equivalents
alternative label: Eq

Equivalent Weight
type: Class
subclass of: Units
comment: 1 M03686 2 Equivalent Weight 3 Eq wt 4 Equivalent Weight 5 767525000 6 Unit 7 Unit (qualifier value) 8 Unit 9 C0439148
alternative label: Eq wt

Equivalents per unit area
type: Class
subclass of: Units
comment: 1 M03351 2 Equivalents per unit area 3 None 4 Equivalents per unit area 5 414118001 6 Equivalents per unit area 7 Equivalents per unit area (qualifier value) 8 Equivalents per unit area 9 C1531873

Equivalents per unit mass
type: Class
subclass of: Units
comment: 1 M03523 2 Equivalents per unit mass 3 None 4 Equivalents per unit mass 5 430344008 6 Equivalents per unit mass 7 Equivalents per unit mass (qualifier value) 8 Equivalents per unit mass 9 C2315654

Equivalents per unit mass per unit time
type: Class
subclass of: Units
comment: 1 M03352 2 Equivalents per unit mass per unit time 3 None 4 Equivalents per unit mass per unit time 5 414119009 6 Equivalents per unit mass per unit time 7 Equivalents per unit mass per unit time (qualifier value) 8 Equivalents per unit mass per unit time 9 C1531874

Eruption
type: Class
subclass of: Sensory function, Pain and Skin function (Symptom)
comment: 1 M00956 2 Eruption 3 None 4 Eruption 5 1806006 6 Eruption 7 Eruption (morphologic abnormality) 8 Eruption 9 C0015230
comment: 1 M00956-1 2 Eruption 3 None 4 Eruption 5 271807003 6 Eruption 7 Eruption of skin (disorder) 8 Eruption 9 C0015230
comment: 1 M00956-2 2 Eruption 3 None 4 Eruption 5 271807003 6 Eruption 7 Eruption of skin (disorder) 8 Eruption 9 C0302295
comment: 1 M00956-3 2 Eruption 3 None 4 Eruption 5 1806006 6 Eruption 7 Eruption (morphologic abnormality) 8 Eruption 9 C0302295

Eruption of skin
type: Class
subclass of: Sensory function, Pain and Skin function (Symptom)
comment: 1 M00957 2 Eruption of skin 3 Skin eruption 4 Eruption of skin 5 271807003 6 Eruption of skin 7 Eruption of skin (disorder) 8 Eruption of skin present 9 C5395697
alternative label: Skin eruption

Erythema
type: Class
subclass of: Sensory function, Pain and Skin function (Symptom)
comment: 1 M01540 2 Erythema 3 erythema findings, Erythemas 4 Erythema 5 247441003 6 Erythema 7 Erythema (finding) 8 Erythema 9 C0041834
comment: 1 M01540-1 2 Erythema 3 erythema findings, Erythemas 4 Erythema 5 70819003 6 Erythema 7 Erythema (morphologic abnormality) 8 Erythema 9 C0041834
alternative label: erythema findings
alternative label: Erythemas

Erythema of skin
type: Class
subclass of: Sensory function, Pain and Skin function (Symptom)
comment: 1 M00551 2 Erythema of skin 3 SKIN ERYTHEMA 4 Erythema of skin 5 444827008 6 Erythema of skin 7 Erythema of skin (disorder) 8 Erythema of skin 9 C0041834
alternative label: SKIN ERYTHEMA

Erythematous condition
type: Class
subclass of: Sensory function, Pain and Skin function (Symptom)
comment: 1 M01543 2 Erythematous condition 3 Erythematous conditions 4 Erythematous condition 5 247441003 6 Erythema 7 Erythema (finding) 8 Erythema 9 C0041834
alternative label: Erythematous conditions

Erythematous disorder
type: Class
subclass of: Sensory function, Pain and Skin function (Symptom)
comment: 1 M01545 2 Erythematous disorder 3 None 4 Erythematous disorder 5 70819003 6 Erythema 7 Erythema (morphologic abnormality) 8 Erythema 9 C0041834

Essential functions
type: Class
subclass of: Questionnaire
comment: 1 MD04978 2 Essential functions 3 None 4 Essential functions 5 277064003 6 Function 7 Function (attribute) 8 Function 9 C0542341

Essential functions for job performance etc.
type: Class
subclass of: Questionnaire
comment: 1 MD04976 2 Essential functions for job performance etc. 3 None 4 Essential functions for job performance etc. 5 277064003 6 Function 7 Function (attribute) 8 Function 9 C0542341

Eustachian canal
type: Class
subclass of: Sensory function, Pain and Skin function (Body region)
comment: 1 MD06875 2 Eustachian canal 3 None 4 Eustachian canal 5 91207004 6 eustachian canal structure 7 Structure of pharyngotympanic tube (body structure) 8 Eustachian canal 9 C2371870

Evacuation
type: Class
subclass of: Hospital Administration
comment: 1 MD00601 2 Evacuation 3 None 4 Evacuation 5 122461007 6 Evacuation 7 Evacuation procedure (procedure) 8 Evacuation procedure 9 C1282573

Eval-Tech
type: Class
subclass of: Tool
comment: 1 MD04791 2 Eval-Tech 3 None 4 Eval-Tech 5 272394005 6 Technique 7 Technique (qualifier value) 8 Techniques 9 C0449851

Evaluate the performance of the action and score points
type: Class
subclass of: Questionnaire
comment: 1 MD04208 2 Evaluate the performance of the action and score points 3 None 4 Evaluate the performance of the action and score points 5 246137000 6 equipment 7 Equipment (attribute) 8 equipment 9 C0014672

Evaluation date
type: Class
subclass of: Day
comment: 1 MD04982 2 Evaluation date 3 None 4 Evaluation date 5 410671006 6 Date 7 Date (attribute) 8 Business Day 9 C1707064

Evaluation of Basic Motion
type: Class
subclass of: Questionnaire
comment: 1 MD04640 2 Evaluation of Basic Motion 3 None 4 Evaluation of Basic Motion 5 129265001 6 Evaluation 7 Evaluation - action (qualifier value) 8 Evaluation 9 C0220825

Evaluation of Basic Motion Image for Upper Limb amputation
type: Class
subclass of: Questionnaire
comment: 1 MD04448 2 Evaluation of Basic Motion Image for Upper Limb amputation 3 None 4 Evaluation of Basic Motion Image for Upper Limb amputation 5 441742003 6 Evaluation finding 7 Evaluation finding (finding) 8 Evaluation finding 9 C2711906

Evaluation of Instrumental Daily Life Behavior in Seoul
type: Class
subclass of: Questionnaire
comment: 1 MD05192 2 Evaluation of Instrumental Daily Life Behavior in Seoul 3 None 4 Evaluation of Instrumental Daily Life Behavior in Seoul 5 165309004 6 Behavior assessment 7 Behavior assessment (procedure) 8 Behavior assessment 9 C1160858

Evaluation of performance status
type: Class
subclass of: Questionnaire
comment: 1 MD04755 2 Evaluation of performance status 3 None 4 Evaluation of performance status 5 129265001 6 Evaluation 7 Evaluation - action (qualifier value) 8 Evaluation 9 C1261322

Evaluation of prosthesis function
type: Class
subclass of: Tool
comment: 1 MD04717 2 Evaluation of prosthesis function 3 None 4 Evaluation of prosthesis function 5 129265001 6 Evaluation 7 Evaluation - action (qualifier value) 8 Evaluation 9 C0220825

Evaluation on the customized work
type: Class
subclass of: Questionnaire
comment: 1 MD04512 2 Evaluation on the customized work 3 None 4 Evaluation on the customized work 5 129265001 6 Evaluation 7 Evaluation - action (qualifier value) 8 Evaluation 9 C0220825

Evaluation task task performance analysis
type: Class
subclass of: Questionnaire
comment: 1 MD05554 2 Evaluation task task performance analysis 3 None 4 Evaluation task task performance analysis 5 386053000 6 Evaluation 7 Evaluation procedure (procedure) 8 Evaluation 9 C0220825

Evans syndrome
type: Class
subclass of: Functions of Blood System, Metabolic system and Endocrine system (Symptom)
comment: 1 MD00453 2 Evans' syndrome 3 None 4 Evans syndrome 5 75331009 6 Evans syndrome 7 Evans syndrome (disorder) 8 vans syndrome 9 C0272126

Eventflow
type: Class
subclass of: Units
comment: 1 M05736 2 Eventflow 3 None 4 Eventflow 5 413568008 6 Application - unit of product usage (qualifier value) 7 Application - unit of product usage (qualifier value) 8 Application dose 9 C1533134

Every month
type: Class
subclass of: Units
comment: 1 M03639 2 Every month 3 monthly QM 4 Every month 5 89185003 6 Every month 7 Monthly (qualifier value) 8 Monthly (qualifier value) 9 C0332177
alternative label: Monthly
alternative label: monthly
alternative label: QM

Ex-drinker
type: Class
subclass of: Sub-Cultural Level
comment: 1 M00017 2 Ex-drinker 3 None 4 Ex-drinker 5 82581004 6 Ex-drinker 7 Ex-drinker (finding) 8 Ex-drinker 9 C0337679

Ex-smoker
type: Class
subclass of: Sub-Cultural Level
comment: 1 M00098 2 Ex-smoker 3 Ex-cigarette smoker 4 Ex-smoker 5 8517006 6 Ex-smoker 7 Ex-smoker (finding) 8 Former smoker 9 C0337671

Examination date
type: Class
subclass of: Day
comment: 1 MD01177 2 Examination date 3 None 4 Examination date 5 840643003 6 Date of last examination 7 Date of last examination (observable entity) 8 examination 9 C4321457

Examination institution number
type: Class
subclass of: Hospital Administration
comment: 1 MD00690 2 Examination institution number 3 None 4 Examination institution number 5 30219900 6 Examination 7 Examination - action (qualifier value) 8 Examination for institution (procedure) 9 C0420124

Examination request number
type: Class
subclass of: Hospital Administration
comment: 1 MD00687 2 Examination request number 3 None 4 Examination request number 5 30219900 6 Examination 7 Examination - action (qualifier value) 8 Examination 9 C4321457

Exanthem
type: Class
subclass of: Sensory function, Pain and Skin function (Symptom)
comment: 1 M00958 2 Exanthem 3 Exanthema, exanthemas, Exanthemata, exanthems 4 Exanthem 5 271807003 6 Exanthem 7 Eruption of skin (disorder) 8 Exanthem 9 C0015230
comment: 1 M00958-1 2 Exanthem 3 Exanthema, exanthemas, Exanthemata, exanthems 4 Exanthem 5 1806006 6 Exanthem 7 Eruption (morphologic abnormality) 8 Exanthem 9 C0015230
comment: 1 M00958-2 2 Exanthem 3 Exanthema, exanthemas, Exanthemata, exanthems 4 Exanthem 5 1806006 6 Exanthem 7 Eruption (morphologic abnormality) 8 Exanthem 9 C0302295
comment: 1 M00958-3 2 Exanthem 3 Exanthema, exanthemas, Exanthemata, exanthems 4 Exanthem 5 271807003 6 Exanthem 7 Eruption of skin (disorder) 8 Exanthem 9 C0302295
alternative label: exanthemas
alternative label: exanthems
alternative label: Exanthema
alternative label: Exanthemata

Exceptional patients
type: Class
subclass of: Classification of Patient
comment: 1 MD00231 2 Exceptional patients 3 None 4 Exceptional patients 5 116154003 6 Patient 7 Patient (person) 8 Patients 9 C0030705

Excessive coffee drinker
type: Class
subclass of: Sub-Cultural Level
comment: 1 M00008 2 Excessive coffee drinker 3 None 4 Excessive coffee drinker 5 275386008 6 Excessive coffee drinker 7 Excessive coffee drinker (finding) 8 Excessive coffee drinker 9 C0554771

Excessive exercise
type: Class
subclass of: Musculoskeletal function (Symptom)
comment: 1 M00375 2 Excessive exercise 3 exercise excessive Excessive physical exercise 4 Excessive exercise 5 102533007 6 Excessive exercise 7 Excessive exercise (finding) 8 Excessive exercise (finding) 9 C0522008
alternative label: Excessive physical exercise
alternative label: exercise excessive

Excessive hair growth
type: Class
subclass of: Sensory function, Pain and Skin function (Symptom)
comment: 1 M00538 2 Excessive hair growth 3 Excessive growth of hair 4 Excessive hair growth 5 271607001 6 Excessive hair growth 7 Excessive hair growth (finding) 8 Excessive hair growth 9 C0020555
alternative label: Excessive growth of hair

Excessive hairiness
type: Class
subclass of: Sensory function, Pain and Skin function (Symptom)
comment: 1 M01162 2 Excessive hairiness 3 None 4 Excessive hairiness 5 29966009 6 Excessive hairiness 7 Hypertrichosis (disorder) 8 Hypertrichosis 9 C0020555

Excessive sleeping
type: Class
subclass of: Nervous system and Mental function (Symptom)
comment: 1 M00485 2 Excessive sleeping 3 Excessive sleep, Excessive sleepiness, Sleeping Excessive 4 Excessive sleeping 5 77692006 6 Hypersomnia (excessive sleeping) 7 Hypersomnia (disorder) 8 Sleep 9 C0037313
alternative label: Excessive sleep
alternative label: Sleeping Excessive
alternative label: Excessive sleepiness

Exercise
type: Class
comment: 1 MD02714 2 exercise 3 None 4 exercise 5 256235009 6 Exercise 7 Exercise (observable entity) 8 Exercise 9 C0015259

Exercise Lifestyle Assessment Tool
type: Class
subclass of: Tool
comment: 1 MD03947 2 Exercise Lifestyle Assessment Tool 3 None 4 Exercise Lifestyle Assessment Tool 5 443781008 6 Assessment of lifestyle 7 Assessment of lifestyle (procedure) 8 Assessment of lifestyle 9 C0814436

Exercise Type
type: Class
subclass of: Exercise
comment: 1 MD02056 2 None 3 None 4 exercise type 5 256235009 6 Exercise 7 Exercise (observable entity) 8 Exercise type 9 C2708664

Exercise state
type: Class
subclass of: Health Related Factors
comment: 1 M00255 2 Exercise state 3 None 4 Exercise state 5 128976003 6 Exercise state 7 Exercise state (finding) 8 Exercise state 9 C1290923

Exercise tolerance functions
type: Class
subclass of: Musculoskeletal function (Body measurement)
comment: 1 MD05897 2 Exercise tolerance functions 3 None 4 Exercise tolerance functions 5 248243004 6 Exercise tolerance 7 Exercise tolerance (observable entity) 8 Exercise tolerance functions 9 C0162521

Exercise type by exercise class
type: Class
subclass of: Limb
comment: 1 M00327 2 Exercise type by exercise class 3 None 4 Exercise type by exercise class 5 256235009 6 Exercise 7 Exercise (observable entity) 8 Exercise type 9 C2708664

Exercises regularly
type: Class
subclass of: Duration
comment: 1 M00376 2 Exercises regularly 3 None 4 Exercises regularly 5 228448000 6 Exercises regularly 7 Exercises regularly (finding) 8 Exercises regularly 9 C0556454

Exercycle
type: Class
subclass of: Sport
comment: 1 M05866 2 Exercycle 3 None 4 Exercycle 5 300648001 6 Rides a bicycle 7 Does ride a bicycle (finding) 8 Bicycling (recreational activity) 9 C0005377

Exertion balance
type: Class
subclass of: Musculoskeletal function (Body measurement)
comment: 1 MD01765 2 Exertion balance 3 None 4 Exertion balance 5 427226009 6 Balance assessment 7 Assessment of sense of balance (procedure) 8 Finding related to exertion 9 C1290920

Exhaustion - physiological
type: Class
subclass of: Hospital information, examination/diagnosis/treatment data
comment: 1 M00486 2 Exhaustion - physiological 3 None 4 Exhaustion - physiological 5 242015007 6 Exhaustion - physiological 7 Exhaustion - physiological (finding) 8 Exhaustion - physiological 9 C0413299

Expectoration of blood streaked sputum
type: Class
subclass of: Respiratory function (Symptom)
comment: 1 M01107 2 Expectoration of blood streaked sputum 3 None 4 Expectoration of blood streaked sputum 5 6686005 6 Blood streaked sputum 7 Blood streaked sputum (finding) 8 Expectoration of abnormal sputum 9 C0232516

Expectoration of bloody sputum
type: Class
subclass of: Respiratory function (Symptom)
comment: 1 M01108 2 Expectoration of bloody sputum 3 None 4 Expectoration of bloody sputum 5 6686005 6 Blood streaked sputum 7 Blood streaked sputum (finding) 8 Expectoration of abnormal sputum 9 C0232516

Expectoration of hemorrhagic sputum
type: Class
subclass of: Respiratory function (Symptom)
comment: 1 M01109 2 Expectoration of hemorrhagic sputum 3 None 4 Expectoration of hemorrhagic sputum 5 6686005 6 Blood streaked sputum 7 Blood streaked sputum (finding) 8 Expectoration of abnormal sputum 9 C0232516

Experience of self
type: Class
subclass of: Nervous system and Mental function (Body measurement)
comment: 1 MD05722 2 Experience of self 3 None 4 Experience of self 5 225510008 6 Self-image 7 Self-image (observable entity) 8 Experience of self 9 C2370914

Experience of self and time functions
type: Class
subclass of: Nervous system and Mental function (Body measurement)
comment: 1 MD05721 2 Experience of self and time functions 3 None 4 Experience of self and time functions 5 81742003 6 Perception 7 Perception function (observable entity) 8 Experience of self and time functions 9 C2370913

Expired
type: Class
subclass of: Hospital Administration
comment: 1 MD00223 2 Expired 3 None 4 Expired 5 419620001 6 Death 7 Death (event) 8 Died/Expired 9 C4264514

Exposure to carbon monoxide
type: Class
subclass of: Individual Related Factors
comment: 1 M01993 2 Exposure to carbon monoxide 3 None 4 Exposure to carbon monoxide 5 95875007 6 Exposure to carbon monoxide 7 Exposure to carbon monoxide (event) 8 Exposure to carbon monoxide 9 C0238889

Expression of body language
type: Class
subclass of: Nervous system and Mental function (Body measurement)
comment: 1 MD05709 2 Expression of body language 3 None 4 Expression of body language 5 61909002 6 Language 7 Language, function (observable entity) 8 Reception of language, unspecified 9 C2370899

Expression of language
type: Class
subclass of: Nervous system and Mental function (Body measurement)
comment: 1 MD05705 2 Expression of language 3 None 4 Expression of language 5 61909002 6 Language 7 Language, function (observable entity) 8 Expression of language 9 C2370900

Expression of sign language
type: Class
subclass of: Nervous system and Mental function (Body measurement)
comment: 1 MD05708 2 Expression of sign language 3 None 4 Expression of sign language 5 61909002 6 Language 7 Language, function (observable entity) 8 Expression of sign language 9 C2370903

Expression of spoken language
type: Class
subclass of: Nervous system and Mental function (Body measurement)
comment: 1 MD05706 2 Expression of spoken language 3 None 4 Expression of spoken language 5 61909002 6 Language 7 Language, function (observable entity) 8 Expression of spoken language 9 C2370901

Expression of written language
type: Class
subclass of: Nervous system and Mental function (Body measurement)
comment: 1 MD05707 2 Expression of written language 3 None 4 Expression of written language 5 61909002 6 Language 7 Language, function (observable entity) 8 Expression of written language 9 C2370902

Exstrophy
type: Class
subclass of: Urogenital function (Symptom)
comment: 1 MD00510 2 Exstrophy 3 None 4 Exstrophy 5 110407002 6 Exstrophy 7 Exstrophy (morphologic abnormality) 8 Exstrophy 9 C0015338

Extended family
type: Class
subclass of: Characteristics of the community
comment: 1 MD06684 2 Extended family 3 None 4 Extended family 5 394568007 6 Extended family member 7 Extended family member (person) 8 Extended family 9 C0015341

Extended family relationships
type: Class
subclass of: Individual Related Factors
comment: 1 MD06499 2 Extended family relationships 3 None 4 Extended family relationships 5 272151006 6 Relationships 7 Relationships (qualifier value) 8 Extended family relationships 9 C2371566

Extensively drug-resistant tuberculosis
type: Class
subclass of: Hospital information, examination/diagnosis/treatment data
comment: 1 MD00477 2 Extensively drug-resistant tuberculosis 3 None 4 Extensively drug-resistant tuberculosis 5 710106005 6 Extensively drug resistant tuberculosis 7 Extensively drug resistant tuberculosis (disorder) 8 Extensively Drug-Resistant Tuberculosis 9 C1827301

Extent of menstrual bleeding
type: Class
subclass of: Urogenital function (Symptom)
comment: 1 MD06002 2 Extent of menstrual bleeding 3 None 4 Extent of menstrual bleeding 5 248970003 6 quentity of menstrual bleeding 7 Finding of quantity of menstrual blood loss (finding) 8 Extent of menstrual bleeding 9 C2371178

External
type: Class
subclass of: Units
comment: 1 MD02618 2 External 3 None 4 External 5 261074009 6 External 7 External (qualifier value) 8 External 9 C0205101

External ocular muscles
type: Class
subclass of: Sensory function, Pain and Skin function (Body region)
comment: 1 MD06869 2 External ocular muscles 3 None 4 External ocular muscles 5 67833000 6 extraocular muscle 7 Structure of extraocular muscle (body structure) 8 External ocular muscles 9 C2371867

External rotation
type: Class
subclass of: Musculoskeletal function (Body measurement)
comment: 1 MD04353 2 External rotation 3 Functional external rotation 4 External rotation 5 52019005 6 External rotation 7 External rotation, function (observable entity) 8 External rotation 9 C0231462
alternative label: Functional external rotation

Extra-incision surgery items
type: Class
subclass of: Hospital Administration
comment: 1 MD00197 2 Extra-incision surgery items 3 None 4 Extra-incision surgery items 5 387713003 6 Surgical procedure 7 Surgical procedure (procedure) 8 Clinical Item 9 C4554251

Extraperitoneal compartment
type: Class
subclass of: Musculoskeletal function (Body region)
comment: 1 M01338 2 Extraperitoneal compartment 3 None 4 Extraperitoneal compartment 5 83137009 6 Extraperitoneal space 7 Structure of extraperitoneal space (body structure) 8 Structure of extraperitoneal space 9 C0230197

Extravasation of urine
type: Class
subclass of: Urogenital function (Symptom)
comment: 1 M01719 2 Extravasation of urine 3 None 4 Extravasation of urine 5 274732007 6 Extravasation of urine 7 Extravasation of urine (disorder) 8 Extravasation of urine 9 C0152245
comment: 1 M01719-1 2 Extravasation of urine 3 None 4 Extravasation of urine 5 67502006 6 Extravasation of urine 7 Extravasation of urine (morphologic abnormality) 8 Extravasation of urine 9 C0152245

Extraversion
type: Class
subclass of: Nervous system and Mental function (Body measurement)
comment: 1 MD05619 2 Extraversion 3 None 4 Extraversion 5 261077002 6 Extravesical 7 Extravesical approach (qualifier value) 8 Extraversion 9 C0015382

Extremity
type: Class
subclass of: Musculoskeletal function (Body region)
comment: 1 M00973 2 Extremity 3 Extremities 4 Extremity 5 66019005 6 Extremity 7 Limb structure (body structure) 8 Extremity 9 C0015385
alternative label: Extremities

Eyebrow raising exercises
type: Class
subclass of: Active exercise
comment: 1 M00264 2 Eyebrow raising exercises 3 None 4 Eyebrow raising exercises 5 229135002 6 Eyebrow raising exercises 7 Eyebrow raising exercises (regime/therapy) 8 Eyebrow raising exercises 9 C0454345

http://www.semanticweb.org/user/ontologies/2023/10/untitled-ontology-5#F
type: Class
subclass of: Units
comment: 1 M03060 2 F 3 None 4 F 5 257965001 6 F 7 Upper case Roman letter F (qualifier value) 8 Upper case Roman letter P 9 C0439115
comment: 1 M03060-1 2 F 3 None 4 F 5 257965001 6 F 7 Upper case Roman letter F (qualifier value) 8 Lower case eff 9 C0439132
comment: 1 M03060-2 2 F 3 None 4 F 5 257987005 6 f 7 Lower case Roman letter f (qualifier value) 8 Upper case eff 9 C0439109
comment: 1 M03060-3 2 F 3 None 4 F 5 257987005 6 f 7 Lower case Roman letter f (qualifier value) 8 Lower case eff 9 C0439132

FACIAL DROOP
type: Class
subclass of: Musculoskeletal function (Symptom)
comment: 1 M02328 2 FACIAL DROOP 3 facial drooping 4 FACIAL DROOP 5 95666008 6 Facial weakness 7 Weakness of face muscles (finding) 8 Facial Paresis 9 C0427055
alternative label: facial drooping

FAINT
type: Class
subclass of: Nervous system and Mental function (Symptom)
comment: 1 M01457 2 FAINT 3 Fainting, A faint, Faint symptom, Fainted, FAINTNESS, faints 4 FAINT 5 271594007 6 Faint 7 Syncope (finding) 8 Faint 9 C0039070
alternative label: faints
alternative label: Faint symptom
alternative label: A faint
alternative label: Fainted
alternative label: FAINTNESS
alternative label: Fainting

FRAX
type: Class
subclass of: Tool
comment: 1 MD03256 2 FRAX 3 None 4 FRAX 5 278111002 6 scale 7 Scale - rank (attribute) 8 fracture risk assessment tool (FRAX) questionnaire 9 C5189043
comment: 1 MD03682 2 FRAX 3 None 4 FRAX 5 736952000 6 Osteoporotic fracture probability assessment tool 7 Osteoporotic fracture probability assessment tool (assessment scale) 8 FRAX (fracture risk assessment tool) osteoporotic fracture probability assessment tool 9 C4544735

Face goes red
type: Class
subclass of: Sensory function, Pain and Skin function (Symptom)
comment: 1 M01034 2 Face goes red 3 face flush, face flushed, face flushing, facial flush, FACIAL FLUSHING, flush face, flushed face, flushed skin, flushing face, flushing facial, flushing of face, skin flush, SKIN FLUSHED, flushed skin 4 Face goes red 5 271811009 6 Face goes red 7 Face goes red (finding) 8 Flushing 9 C0016382
alternative label: flushing face
alternative label: FACIAL FLUSHING
alternative label: SKIN FLUSHED
alternative label: face flushing
alternative label: skin flush
alternative label: flush face
alternative label: flushed skin
alternative label: flushing facial
alternative label: facial flush
alternative label: flushed face
alternative label: face flushed
alternative label: face flush

Facebook
type: Class
subclass of: Units
comment: 1 M05737 2 Facebook 3 None 4 Facebook 5 413568008 6 Application - unit of product usage (qualifier value) 7 Application - unit of product usage (qualifier value) 8 Application dose 9 C1533134

Facial Paresis
type: Class
subclass of: Nervous system and Mental function (Symptom)
comment: 1 M02332 2 Facial Paresis 3 None 4 Facial Paresis 5 18930001 6 Disorder of face 7 Disorder of face (disorder) 8 Facial Paresis 9 C0427055

Facial exercises
type: Class
subclass of: Head and neck structure
comment: 1 M00266 2 Facial exercises 3 exercise facial, facial exercise 4 Facial exercises 5 229123001 6 Facial exercises 7 Facial exercises (regime/therapy) 8 Facial exercises 9 C0454333
alternative label: facial exercise
alternative label: exercise facial

Facial hair
type: Class
subclass of: Sensory function, Pain and Skin function (Body region)
comment: 1 MD07124 2 Facial hair 3 None 4 Facial hair 5 386045008 6 Hair 7 Hair structure (body structure) 8 Facial hair 9 C0221980

Facial nerve disorders
type: Class
subclass of: Structures of disability
comment: 1 MD00089 2 Facial nerve disorders 3 None 4 Facial nerve disorders 5 422426003 6 Facial nerve disorder 7 Facial nerve disorder (disorder) 8 Facial Nerve Diseases 9 C0015464

Facial toning
type: Class
subclass of: Sensory function, Pain and Skin function (Therapy)
comment: 1 M05892 2 Facial toning 3 None 4 Facial toning 5 229123001 6 Facial exercises 7 Facial exercises (regime/therapy) 8 Muscle Tonus 9 C0026841

Facial weakness
type: Class
subclass of: Hospital information, examination/diagnosis/treatment data
comment: 1 M00487 2 Facial weakness 3 None 4 Facial weakness 5 95666008 6 Facial weakness 7 Weakness of face muscles (finding) 8 Facial weakness 9 C0427055

Faecal consistency
type: Class
subclass of: Digestive function (Body measurement)
comment: 1 MD05934 2 Faecal consistency 3 None 4 Faecal consistency 5 249618009 6 Consistency of stool 7 Consistency of stool (observable entity) 8 Faecal consistency 9 C2371131

Failure of hair growth
type: Class
subclass of: Sensory function, Pain and Skin function (Symptom)
comment: 1 M00539 2 Failure of hair growth 3 None 4 Failure of hair growth 5 399289002 6 Failure of hair growth 7 Failure of hair growth (finding) 8 Failure of hair growth 9 C0232412

Fall
type: Class
subclass of: Hospital information, examination/diagnosis/treatment data
comment: 1 MD00950 2 Fall 3 None 4 Fall 5 1912002 6 Fall 7 Fall (event) 8 Falls 9 C0085639

Fall Risk Assessment
type: Class
subclass of: Tool
comment: 1 MD04712 2 Fall Risk Assessment 3 None 4 Fall Risk Assessment 5 414191008 6 Fall risk assessment 7 Fall risk assessment (procedure) 8 Fall risk assessment 9 C1532976

Falling phase of fever
type: Class
subclass of: Units
comment: 1 M00165 2 Falling phase of fever 3 None 4 Falling phase of fever 5 248434006 6 Falling phase of fever 7 Falling phase of fever (finding) 8 Falling phase of fever 9 C0424764

Fallopian tubes
type: Class
subclass of: Urogenital function (Body region)
comment: 1 MD06991 2 Fallopian tubes 3 None 4 Fallopian tubes 5 32987009 6 Both fallopian tubes 7 Both fallopian tubes (body structure) 8 Fallopian tubes 9 C0015560

Family Therapy
type: Class
subclass of: Nervous system and Mental function (Therapy)
comment: 1 M00981 2 Family Therapy 3 Family Therapies FT- Family therapy families therapy 4 Family Therapy 5 51484002 6 Family therapy 7 Family therapy (regime/therapy) 8 Family psychotherapy 9 C0015618
alternative label: Family Therapies
alternative label: families therapy
alternative label: FT- Family therapy

Family psychotherapy
type: Class
subclass of: Nervous system and Mental function (Therapy)
comment: 1 M00609 2 Family psychotherapy 3 Family psychotherapy procedure 4 Family psychotherapy 5 108313002 6 Family psychotherapy 7 Family psychotherapy procedure (regime/therapy) 8 Family psychotherapy 9 C0015618
alternative label: Family psychotherapy procedure

Family relationships
type: Class
subclass of: Individual Related Factors
comment: 1 MD06495 2 Family relationships 3 None 4 Family relationships 5 272151006 6 Relationships 7 Relationships (qualifier value) 8 Family relationships 9 C0015608

Farad
type: Class
subclass of: Units
comment: 1 M04686 2 Farad 3 None 4 Farad 5 304610001 6 farad 7 farad (qualifier value) 8 farad 9 C0582515

Faradism therapy
type: Class
subclass of: Nervous system and Mental function (Therapy)
comment: 1 M00617 2 Faradism therapy 3 None 4 Faradism therapy 5 229561005 6 Faradism therapy 7 Faradism therapy (regime/therapy) 8 Faradism therapy 9 C0556900

Fast-Wave Sleep
type: Class
subclass of: Individual Related Factors
comment: 1 M01386 2 Fast wave sleep 3 None 4 Fast-Wave Sleep 5 89129007 6 Fast wave sleep 7 Rapid eye movement sleep, function (observable entity) 8 Sleep, REM 9 C0037322

Fast wave sleep
type: Class
subclass of: Individual Related Factors
comment: 1 M01385 2 Fast wave sleep 3 Fast-Wave Sleep 4 Fast wave sleep 5 89129007 6 Fast wave sleep 7 Rapid eye movement sleep, function (observable entity) 8 Sleep, REM 9 C0037322

Fastest
type: Class
subclass of: Units
comment: 1 MD01905 2 Fastest 3 None 4 Fastest 5 277748003 6 Fast 7 Fast (qualifier value) 8 Rapid 9 C0456962

Fasting
type: Class
subclass of: Nutritional status
comment: 1 MD01189 2 Fasting 3 None 4 Fasting 5 16985007 6 Fasting 7 Fasting (finding) 8 Fasting 9 C0015663
comment: 1 MD01189-2 2 Fasting 3 None 4 Fasting 5 792805006 6 Fasting 7 Fasting (regime/therapy) 8 Fasting 9 C0015663
comment: 1 MD01189-3 2 Fasting 3 None 4 Fasting 5 792805006 6 Fasting 7 Fasting (regime/therapy) 8 Fasting (regime/therapy) 9 C5203658
comment: 2 Fasting 3 None 4 Fasting 5 16985007 6 Fasting 7 Fasting (finding) 8 Fasting (regime/therapy) 9 C5203658

Fat-burning
type: Class
subclass of: Digestive function (Body measurement)
comment: 1 MD01899 2 Fat-burning 3 fat combusion section, fat combusion 4 Fat-burning 5 385532007 6 Fat burn 7 Fat burn (morphologic abnormality) 8 Fat burn 9 C1272774
alternative label: fat combusion section
alternative label: fat combusion

FatSecret
type: Class
subclass of: Units
comment: 1 M05738 2 FatSecret 3 None 4 FatSecret 5 413568008 6 Application - unit of product usage (qualifier value) 7 Application - unit of product usage (qualifier value) 8 Application dose 9 C1533134

Fat metabolism
type: Class
subclass of: Functions of Blood System, Metabolic system and Endocrine system (Body measurement)
comment: 1 MD05952 2 Fat metabolism 3 None 4 Fat metabolism 5 47722004 6 metabolism 7 General metabolic function (observable entity) 8 Fat metabolism 9 C0598783

Fatigability
type: Class
subclass of: Hospital information, examination/diagnosis/treatment data
comment: 1 M00490 2 fatigue 3 Fatiguability fatigued fatigues fatiguing fatigueability 4 Fatigability 5 79915001 6 Fatigability 7 Fatigability (finding) 8 Fatigability 9 C0231230

Fatiguability
type: Class
subclass of: Musculoskeletal function (Symptom)
comment: 1 MD05900 2 fatigue 3 Fatigability fatigued fatigues fatiguing fatigueability 4 Fatiguability 5 84229001 6 fatigue 7 Fatigue (finding) 8 Fatiguability 9 C0231230

Fax
type: Class
subclass of: Questionnaire
comment: 1 MD04916 2 Fax 3 None 4 Fax 5 246137000 6 equipment 7 Equipment (attribute) 8 equipment 9 C0014672

Fear associated with illness and body function
type: Class
subclass of: Nervous system and Mental function (Symptom)
comment: 1 M05834 2 Fear associated with illness and body function 3 None 4 Fear associated with illness and body function 5 247855001 6 Fear associated with illness and body function 7 Fear associated with illness and body function (finding) 8 Fear associated with illness and body function 9 C0424185

Fear of contracting disease
type: Class
subclass of: Nervous system and Mental function (Symptom)
comment: 1 M05835 2 Fear of contracting disease 3 None 4 Fear of contracting disease 5 247866008 6 Fear of contracting disease 7 Fear of contracting disease (finding) 8 Fear of contracting disease 9 C0424190

Febrile
type: Class
subclass of: Hospital information, examination/diagnosis/treatment data
comment: 1 M01006 2 Febrile 3 febris 4 Febrile 5 386661006 6 Febrile 7 Fever (finding) 8 Fever 9 C0015967
alternative label: febris

Feed
type: Class
subclass of: Individual Related Factors
comment: 1 M02853 2 Feed 3 None 4 Feed 5 75118006 6 Feeding 7 Feeding patient (regime/therapy) 8 Feeding Activity 9 C2987508

Feeding
type: Class
subclass of: Sub-Cultural Level
comment: 1 M00029 2 Feeding 3 None 4 Feeding 5 129007004 6 Feeding 7 Feeding (observable entity) 8 Feeding 9 C0204695
comment: 1 M00029-1 2 Feeding 3 None 4 Feeding 5 129007004 6 Feeding 7 Feeding (observable entity) 8 Feeding Activity 9 C2987508
comment: 1 M00029-2 2 Feeding 3 None 4 Feeding 5 75118006 6 Feeding 7 Feeding patient (regime/therapy) 8 Feeding 9 C0204695
comment: 1 M00029-3 2 Feeding 3 None 4 Feeding 5 75118006 6 Feeding 7 Feeding patient (regime/therapy) 8 Feeding Activity 9 C2987508

Feeding Activity
type: Class
subclass of: Individual Related Factors
comment: 1 M02854 2 Feeding Activity 3 None 4 Feeding Activity 5 75118006 6 Feeding 7 Feeding patient (regime/therapy) 8 Feeding Activity 9 C2987508

Feeling anxious
type: Class
subclass of: Nervous system and Mental function (Symptom)
comment: 1 M05820 2 Feeling anxious 3 None 4 Feeling anxious 5 48694002 6 Feeling anxious 7 Anxiety (finding) 8 Feeling anxious 9 C0003467

Feeling bloated
type: Class
subclass of: Digestive function (Body measurement)
comment: 1 MD05943 2 Feeling bloated 3 None 4 Feeling bloated 5 422587007 6 nausea 7 Nausea (finding) 8 Feeling bloated 9 C0857257

Feeling of heaviness
type: Class
subclass of: Nervous system and Mental function (Symptom)
comment: 1 M02661 2 Feeling of heaviness 3 None 4 Feeling of heaviness 5 61874006 6 Heavy feeling 7 Heavy feeling (finding) 8 Heavy feeling 9 C0581912

Femoral pulse absent
type: Class
subclass of: Cardiovascular system function (Symptom)
comment: 1 M00204 2 Femoral pulse absent 3 FEMORAL PULSE ABSENCE 4 Femoral pulse absent 5 301167007 6 Femoral pulse absent 7 Femoral pulse absent (finding) 8 Femoral pulse absent 9 C0239556
alternative label: FEMORAL PULSE ABSENCE

Femoral pulse present
type: Class
subclass of: Cardiovascular system function (Body measurement)
comment: 1 M00205 2 Femoral pulse present 3 None 4 Femoral pulse present 5 301157002 6 Femoral pulse present 7 Femoral pulse present (finding) 8 Femoral pulse present 9 C0577846

Femtogram
type: Class
subclass of: Units
comment: 1 M03754 2 Femtogram 3 fg 4 Femtogram 5 258688001 6 femtogram 7 femtogram (qualifier value) 8 femtogram 9 C0439214
alternative label: fg

Femtogram per Microgram
type: Class
subclass of: Units
comment: 1 M05152 2 Femtogram per Microgram 3 fg/mcg 4 Femtogram per Microgram 5 767525000 6 unit 7 Unit (qualifier value) 8 Unit 9 C0439174
alternative label: fg/mcg

Femtogram per Microliter
type: Class
subclass of: Units
comment: 1 M04007 2 Femtogram per Microliter 3 fg/uL 4 Femtogram per Microliter 5 767525000 6 Unit 7 Unit (qualifier value) 8 Unit 9 C0439148
alternative label: fg/uL

Femtogram per Nanogram
type: Class
subclass of: Units
comment: 1 M03876 2 Femtogram per Nanogram 3 fg/ng 4 Femtogram per Nanogram 5 767525000 6 Unit 7 Unit (qualifier value) 8 Unit 9 C0439148
alternative label: fg/ng

Femtokatal
type: Class
subclass of: Units
comment: 1 M03814 2 Femtokatal 3 fkat 4 Femtokatal 5 258782008 6 Femtokatal 7 Femtokatal (qualifier value) 8 Femtokatal 9 C0439249
alternative label: fkat

Femtokatal per Nanoliter
type: Class
subclass of: Units
comment: 1 M05386 2 Femtokatal per Nanoliter 3 fkat/nL 4 Femtokatal per Nanoliter 5 767525000 6 unit 7 Unit (qualifier value) 8 Unit 9 C0439199
alternative label: fkat/nL

Femtoliter
type: Class
subclass of: Units
comment: 1 M04490 2 Femtoliter 3 femtolitre femtoliters fL 4 Femtoliter 5 258775009 6 Femtoliter 7 Femtoliter (qualifier value) 8 Femtoliter 9 C0475213
alternative label: fL
alternative label: femtolitre
alternative label: femtoliters

Femtomole
type: Class
subclass of: Units
comment: 1 M03714 2 Femtomole 3 femtomolar fmol fM 4 Femtomole 5 258722005 6 femtomole 7 femtomole (qualifier value) 8 femtomole 9 C0439195
alternative label: femtomolar
alternative label: fmol
alternative label: fM

Femtomole per Attogram
type: Class
subclass of: Units
comment: 1 M05593 2 Femtomole per Attogram 3 fmol/ag 4 Femtomole per Attogram 5 258722005 6 femtomole 7 femtomole (qualifier value) 8 fmol 9 C0439195
alternative label: fmol/ag

Femtomole per Attoliter
type: Class
subclass of: Units
comment: 1 M05609 2 Femtomole per Attoliter 3 fmol/aL 4 Femtomole per Attoliter 5 258722005 6 femtomole 7 femtomole (qualifier value) 8 fmol 9 C0439195
alternative label: fmol/aL

Femtomole per Femtogram
type: Class
subclass of: Units
comment: 1 M05557 2 Femtomole per Femtogram 3 fmol/fg 4 Femtomole per Femtogram 5 258722005 6 femtomole 7 femtomole (qualifier value) 8 fmol 9 C0439195
alternative label: fmol/fg

Femtomole per Gram
type: Class
subclass of: Units
comment: 1 M05642 2 Femtomole per Gram 3 Femtomole/Gram fmol/g 4 Femtomole per Gram 5 258722005 6 femtomole 7 femtomole (qualifier value) 8 Femtomole per Gram 9 C2348668
alternative label: Femtomole/Gram
alternative label: fmol/g

Femtomole per Liter
type: Class
subclass of: Units
comment: 1 M03943 2 Femtomole per Liter 3 femtomole/litre femtomole/liter fmol/L 4 Femtomole per Liter 5 258820009 6 Femtomole/liter 7 Femtomole/liter (qualifier value) 8 Femtomole/liter 9 C0439285
alternative label: fmol/L
alternative label: femtomole/litre
alternative label: femtomole/liter

Femtomole per Microliter
type: Class
subclass of: Units
comment: 1 M03915 2 Femtomole per Microliter 3 fmol/mcL 4 Femtomole per Microliter 5 767525000 6 Unit 7 Unit (qualifier value) 8 Unit 9 C0439148
alternative label: fmol/mcL

Femtomole per Nanogram
type: Class
subclass of: Units
comment: 1 M03969 2 Femtomole per Nanogram 3 fmol/ng 4 Femtomole per Nanogram 5 767525000 6 Unit 7 Unit (qualifier value) 8 Unit 9 C0439148
alternative label: fmol/ng

Femtomole per Nanoliter
type: Class
subclass of: Units
comment: 1 M04028 2 Femtomole per Nanoliter 3 fmol/nL 4 Femtomole per Nanoliter 5 767525000 6 Unit 7 Unit (qualifier value) 8 Unit 9 C0439148
alternative label: fmol/nL

Femtomole per Picogram
type: Class
subclass of: Units
comment: 1 M05576 2 Femtomole per Picogram 3 fmol/pg 4 Femtomole per Picogram 5 258722005 6 fmol 7 femtomole (qualifier value) 8 fmol 9 C0439195
alternative label: fmol/pg

Femtomole per milliliter
type: Class
subclass of: Units
comment: 1 M03931 2 Femtomole per milliliter 3 Femtomole per millilitre fmol/mL 4 Femtomole per milliliter 5 258819003 6 Femtomole per milliliter 7 Picomole/liter (qualifier value) 8 Femtomole per milliliter 9 C0439284
alternative label: fmol/mL
alternative label: Femtomole per millilitre

Fetal alcohol syndrome
type: Class
subclass of: Hospital information, examination/diagnosis/treatment data
comment: 1 MD00388 2 Fetal alcohol syndrome 3 None 4 Fetal alcohol syndrome 5 205788004 6 Fetal alcohol syndrome 7 Fetal alcohol syndrome (disorder) 8 Fetal alcohol syndrome 9 C0015923

Fetal heart rate
type: Class
subclass of: Cardiovascular system function (Body measurement)
comment: 1 M00176 2 Fetal heart rate 3 Fetal Heart Rates, FHR - Fetal heart rate, foetal heart rate, heart rate fetal 4 Fetal heart rate 5 249043002 6 Fetal heart rate 7 Fetal heart rate (observable entity) 8 Fetal heart rate 9 C0018811
alternative label: heart rate fetal
alternative label: Fetal Heart Rates
alternative label: foetal heart rate
alternative label: FHR - Fetal heart rate

Fever - fast rise
type: Class
subclass of: Sensory function, Pain and Skin function (Symptom)
comment: 1 M02297 2 Fever - fast rise 3 Fever - rapid rise 4 Fever - fast rise 5 271749004 6 Fever - fast rise 7 Acute rise of fever (finding) 8 Acute rise of fever 9 C0424761
alternative label: Fever - rapid rise

Fever 106 degrees F or over
type: Class
subclass of: Sensory function, Pain and Skin function (Symptom)
comment: 1 M02176 2 Fever 106 degrees F or over 3 None 4 Fever 106 degrees F or over 5 1197782006 6 hyperthermia 7 Hyperthermia (disorder) 8 Hyperthermia 9 C5232927

Fever 41 degrees C or over
type: Class
subclass of: Sensory function, Pain and Skin function (Symptom)
comment: 1 M02177 2 Fever 41 degrees C or over 3 None 4 Fever 41 degrees C or over 5 1197782006 6 hyperthermia 7 Hyperthermia (disorder) 8 Hyperthermia 9 C5232927

Fibrodysplasia
type: Class
subclass of: Musculoskeletal function (Symptom)
comment: 1 MD00506 2 Fibrodysplasia 3 None 4 Fibrodysplasia 5 789439000 6 Firous dysplasia 7 Fibrous dysplasia (morphologic abnormality) 8 Fibrous dysplasia 9 C0259779

Field hockey
type: Class
subclass of: Sport
comment: 1 M00409 2 Field hockey 3 None 4 Field hockey 5 414251002 6 Field hockey 7 Field hockey (qualifier value) 8 Field hockey 9 C0016074

Filtration of urine
type: Class
subclass of: Urogenital function (Body measurement)
comment: 1 MD05980 2 Filtration of urine 3 None 4 Filtration of urine 5 360166003 6 Filtration - action 7 Filtration - action (qualifier value) 8 Filtration of urine 9 C2371161

Financial assets
type: Class
subclass of: Characteristics of the individual
comment: 1 MD06629 2 Financial assets 3 None 4 Financial assets 5 118598001 6 Property 7 Property (qualifier value) 8 Financial assets 9 C2584337

Finding of blood glucose level
type: Class
subclass of: Functions of Blood System, Metabolic system and Endocrine system (Body measurement)
comment: 1 M02349 2 Finding of blood glucose level 3 None 4 Finding of blood glucose level 5 365812005 6 Finding of blood glucose level 7 Finding of blood glucose level (finding) 8 Finding of blood glucose level 9 C0428554

Finding of central venous pressure
type: Class
subclass of: Cardiovascular system function (Body measurement)
comment: 1 M00133 2 Finding of central venous pressure 3 None 4 Finding of central venous pressure 5 366162006 6 Finding of central venous pressure 7 Finding of central venous pressure (finding) 8 Central venous pressure finding 9 C1321771

Finding of decreased blood pressure
type: Class
subclass of: Cardiovascular system function (Body measurement)
comment: 1 M01897 2 Finding of decreased blood pressure 3 blood decreasing pressure, BLOOD PRESSURE DECREASED, decreased blood pressure 4 Finding of decreased blood pressure 5 12763006 6 Finding of decreased blood pressure 7 Finding of decreased blood pressure (finding) 8 Finding of decreased blood pressure 9 C0232107
alternative label: BLOOD PRESSURE DECREASED
alternative label: blood decreasing pressure
alternative label: decreased blood pressure

Finding of diarrhea
type: Class
subclass of: Digestive function (Symptom)
comment: 1 M00859 2 Finding of diarrhea 3 Finding of diarrhoea 4 Finding of diarrhea 5 62315008 6 Diarrhea 7 Diarrhea (finding) 8 Diarrhea 9 C0011991
alternative label: Finding of diarrhoea

Finding of distribution pattern of hair growth
type: Class
subclass of: Sensory function, Pain and Skin function (Body measurement)
comment: 1 M00239 2 Finding of distribution pattern of hair growth 3 None 4 Finding of distribution pattern of hair growth 5 366660004 6 Finding of distribution pattern of hair growth 7 Finding of distribution pattern of hair growth (finding) 8 Distribution pattern of hair growth - finding 9 C1288178

Finding of frequency of urination
type: Class
subclass of: Frequency
comment: 1 M01555 2 Finding of frequency of urination 3 frequency of urination, Frequent urination, frequency urinary, frequency urination, frequent urination, Observation of frequency of urination, URINARY FREQUENCY, Urination Frequency 4 Finding of frequency of urination 5 300471006 6 Finding of frequency of urination 7 Finding of frequency of urination (finding) 8 Finding of frequency of urination 9 C0042023
alternative label: frequency urinary
alternative label: frequency urination
alternative label: Urination Frequency
alternative label: frequent urination
alternative label: Observation of frequency of urination
alternative label: URINARY FREQUENCY

Finding of heart murmur
type: Class
subclass of: Cardiovascular system function (Symptom)
comment: 1 M01085 2 Finding of heart murmur 3 None 4 Finding of heart murmur 5 88610006 6 Finding of heart murmur 7 Heart murmur (finding) 8 Heart murmur 9 C0018808

Finding of heart rate
type: Class
subclass of: Cardiovascular system function (Body measurement)
comment: 1 M00177 2 Finding of heart rate 3 None 4 Finding of heart rate 5 301113001 6 Finding of heart rate 7 Finding of heart rate (finding) 8 Finding of heart rate 9 C0577802

Finding of hiccoughs
type: Class
subclass of: Respiratory function (Symptom)
comment: 1 M01117 2 Finding of hiccoughs 3 None 4 Finding of hiccoughs 5 65958008 6 Finding of hiccoughs 7 Hiccoughs (finding) 8 Hiccough 9 C0019521

Finding of peripheral pulse
type: Class
subclass of: Cardiovascular system function (Body measurement)
comment: 1 M00206 2 Finding of peripheral pulse 3 None 4 Finding of peripheral pulse 5 301145006 6 Finding of peripheral pulse 7 Finding of peripheral pulse (finding) 8 Finding of peripheral pulse 9 C0577835

Finding of rate of respiration
type: Class
subclass of: Respiratory function (Body measurement)
comment: 1 M00221 2 Finding of rate of respiration 3 None 4 Finding of rate of respiration 5 301283003 6 Finding of rate of respiration 7 Finding of rate of respiration (finding) 8 Finding of rate of respiration 9 C0577970

Finding of secondary sexual hair growth
type: Class
subclass of: Health Related Factors
comment: 1 M00240 2 Finding of secondary sexual hair growth 3 None 4 Finding of secondary sexual hair growth 5 366659009 6 Finding of secondary sexual hair growth 7 Finding of secondary sexual hair growth (finding) 8 Finding of secondary sexual hair growth 9 C1288177

Finding of systemic arterial pressure
type: Class
subclass of: Cardiovascular system function (Body measurement)
comment: 1.M00130 2. Finding of systemic arterial pressure 3. None 4. Finding of systemic arterial pressure 5. 301140001 6. Finding of systemic arterial pressure 7. Finding of systemic arterial pressure (finding) 8. Finding of systemic arterial pressure 9. C0577830

Finding of venous pressure
type: Class
subclass of: Cardiovascular system function (Body measurement)
comment: 1 M00131 2 Finding of venous pressure 3 None 4 Finding of venous pressure 5 366161004 6 Finding of venous pressure 7 Finding of venous pressure (finding) 8 Finding of venous pressure 9 C1287690

Finding relating to behavior
type: Class
subclass of: Health Related Factors
comment: 1 M00712 2 Finding relating to behavior 3 Finding relating to behaviour 4 Finding relating to behavior 5 844005 6 Finding relating to behavior 7 Behavior finding (finding) 8 Behavior 9 C0004927
alternative label: Finding relating to behaviour

Fine foot use
type: Class
subclass of: Health Related Factors
comment: 1 MD06331 2 Fine foot use 3 None 4 Fine foot use 5 56459004 6 Foot 7 Foot structure (body structure) 8 Fine foot use 9 C2372046

Fine hand use
type: Class
subclass of: Health Related Factors
comment: 1 MD06315 2 Fine hand use 3 None 4 Fine hand use 5 288361006 6 Ability to use hands 7 Ability to perform general manipulative activities (observable entity) 8 Fine hand use 9 C2371409

Finger Opposition
type: Class
subclass of: Musculoskeletal function (Body measurement)
comment: 1 MD04125 2 Finger Opposition 3 None 4 Finger Opposition 5 249959000 6 Opposition of thumb 7 Opposition of thumb, function (observable entity) 8 Opposition of thumb 9 C0427082

Finger exercises
type: Class
subclass of: Limb
comment: 1 M00306 2 Finger exercises 3 None 4 Finger exercises 5 229122006 6 Finger exercises 7 Finger exercises (regime/therapy) 8 Finger exercises 9 C0454332

Finger nails
type: Class
subclass of: Sensory function, Pain and Skin function (Body region)
comment: 1 MD07118 2 Finger nails 3 Functions of nails, Structure of nails, Fingertip 4 Finger nails 5 770812000 6 Entire nail unit of finger 7 Entire nail unit of finger (body structure) 8 Finger nails 9 C0222001
alternative label: Fingertip
alternative label: Functions of nails
alternative label: Structure of nails

Finger to palm
type: Class
subclass of: Health Related Factors
comment: 1 MD04115 2 Finger to palm 3 Palm to finger 4 Finger to palm 5 249837003 6 Fingertip to palm distance 7 Fingertip to palm distance (observable entity) 8 Palm of hand 9 C0817662
alternative label: Palm to finger

Fingertip Unit
type: Class
subclass of: Units
comment: 1 M05643 2 Fingertip Unit 3 Fingertip Dosing Unit FTU 4 Fingertip Unit 5 767525000 6 Unit 7 Unit (qualifier value) 8 Fingertip Dosing Unit 9 C2348675
alternative label: FTU
alternative label: Fingertip Dosing Unit

First Name
type: Class
subclass of: Units
comment: 1 MD01916 2 First Name 3 None 4 First Name 5 184095009 6 Patient first name 7 Patient forename (observable entity) 8 First Name 9 C1443235

First visit
type: Class
subclass of: Hospital Administration
comment: 1 MD00169 2 First visit 3 None 4 First visit 5 103324002 6 visit for 7 Patient visit for (contextual qualifier) (qualifier value) 8 First Visit to This Clinic 9 C4287881

Fitbit
type: Class
subclass of: Units
comment: 1 M05739 2 Fitbit 3 None 4 Fitbit 5 413568008 6 Application - unit of product usage (qualifier value) 7 Application - unit of product usage (qualifier value) 8 Application dose 9 C1533134

Flank structure
type: Class
subclass of: Hospital information, examination/diagnosis/treatment data
comment: 1 M01407 2 Flank structure 3 Flank flanking flanks 4 Flank structure 5 58602004 6 Flank structure 7 Flank structure (body structure) 8 Flank structure 9 C0230171
alternative label: flanking
alternative label: Flank
alternative label: flanks

Flip
type: Class
subclass of: Health Related Factors
comment: 1 MD04677 2 Flip 3 None 4 Flip 5 844005 6 Behavior finding 7 Behavior finding (finding) 8 Behavior 9 C0004927

Flip the card
type: Class
subclass of: Health Related Factors
comment: 1 MD04187 2 Flip the card 3 None 4 Flip the card 5 844005 6 Behavior finding 7 Behavior finding (finding) 8 Behavior 9 C0004927

Flora and fauna
type: Class
subclass of: Biological environment
comment: 1 MD06646 2 Flora and fauna 3 None 4 Flora and fauna 5 23506009 6 Normal flora 7 Normal flora (finding) 8 Flora and fauna 9 C2371692

Fluency and rhythm of speech functions
type: Class
subclass of: Voice and Speaking (Body measurement)
comment: 1 MD05819 2 Fluency and rhythm of speech functions 3 None 4 Fluency and rhythm of speech functions 5 106132005 6 speech finding 7 Speech finding (finding) 8 Fluency and rhythm of speech functions 9 C2370981

Fluency of speech
type: Class
subclass of: Voice and Speaking (Body measurement)
comment: 1 MD05820 2 Fluency of speech 3 None 4 Fluency of speech 5 363921007 6 Fluency of speech 7 Fluency of speech (observable entity) 8 Fluency of speech 9 C0233714

Fluid ounces per meal
type: Class
subclass of: Units
comment: 1 M04629 2 Fluid ounces per meal 3 fl oz/meal 4 Fluid ounces per meal 5 228943001 6 Fluid ounces per meal 7 Fluid ounce/meal (qualifier value) 8 Fluid ounces per meal 9 C0560704
alternative label: fl oz/meal

Fluid stool
type: Class
subclass of: Digestive function (Symptom)
comment: 1 M00861 2 Fluid stool 3 None 4 Fluid stool 5 398212009 6 Fluid stool 7 Liquid stool (finding) 8 Fluid stool 9 C2129214

Flushing
type: Class
subclass of: Sensory function, Pain and Skin function (Symptom)
comment: 1 M00552 2 Flushing 3 Flush, flushed, FLUSHES, flushing reaction, Flushings 4 Flushing 5 20255002 6 Flushing 7 Blushing, function (observable entity) 8 Flushing 9 C0016382
comment: 1 M00552-1 2 Flushing 3 Flush, flushed, FLUSHES, flushing reaction, Flushings 4 Flushing 5 238810007 6 Flushing 7 Flushing (disorder) 8 Flushing 9 C0016382
alternative label: Flush
alternative label: Flushings
alternative label: flushed
alternative label: flushing reaction
alternative label: FLUSHES

Focusing attention
type: Class
subclass of: Health Related Factors
comment: 1 MD06169 2 Focusing attention 3 None 4 Focusing attention 5 311517002 6 Focused attention 7 Focused attention, function (observable entity) 8 Focusing attention 9 C0589098

Focusing attention on the environment
type: Class
subclass of: Health Related Factors
comment: 1 MD06171 2 Focusing attention on the environment 3 None 4 Focusing attention on the environment 5 311517002 6 Focused attention 7 Focused attention, function (observable entity) 8 Focusing attention 9 C0589098

Focusing attention on the person
type: Class
subclass of: Health Related Factors
comment: 1 MD06170 2 Focusing attention on the person 3 None 4 Focusing attention on the person 5 311517002 6 Focused attention 7 Focused attention, function (observable entity) 8 Focusing attention 9 C0589098

Folding
type: Class
subclass of: Units
comment: 1 MD01926 2 Folding 3 None 4 Folding 5 10942006 6 Folding 7 Plication (procedure) 8 Folding 9 C0185026

Follow one or two steps of instruction in an unchanged situation
type: Class
subclass of: Questionnaire
comment: 1 MD05130 2 Follow one or two steps of instruction in an unchanged situation 3 None 4 Follow one or two steps of instruction in an unchanged situation 5 273389003 6 Daily activities questionnaire 7 Daily activities questionnaire (assessment scale) 8 questionnaire 9 C0034394

Follow up
type: Class
subclass of: Hospital Administration
comment: 1 MD00170 2 Follow up 3 None 4 Follow up 5 185389009 6 Follow-up visit 7 Follow-up visit (procedure) 8 Follow-up visit 9 C0589121

Food
type: Class
subclass of: Nutritional management
comment: 1 MD00731 2 Food 3 None 4 Food 5 255620007 6 Food 7 Food (substance) 8 Food 9 C0016452

Food Calorie
type: Class
subclass of: Units
comment: 1 M05109 2 Food Calorie 3 None 4 Food Calorie 5 258790012 6 calorie 7 calorie (qualifier value) 8 calorie 9 C1879989

Food Intake
type: Class
subclass of: Nutrient intake
comment: 1 M00924 2 Food Intake 3 food intakes, intakes food 4 Food Intake 5 226379006 6 Food intake 7 Food intake (observable entity) 8 Food intake 9 C0013470
alternative label: food intakes
alternative label: intakes food

Food preparation
type: Class
subclass of: Health Related Factors
comment: 1 MD05240 2 Food preparation 3 preparing simple food 4 Food preparation 5 286491009 6 Prepares meal 7 Does prepare meal (finding) 8 Food preparation 9 C0920297
alternative label: preparing simple food

Food preparation and cleaning up
type: Class
subclass of: Health Related Factors
comment: 1 MD05528 2 Food preparation and cleaning up 3 None 4 Food preparation and cleaning up 5 844005 6 Behavior finding 7 Behavior finding (finding) 8 Behavior 9 C0004927

Foot Unit of Length
type: Class
subclass of: Units
comment: 1 M03642 2 Foot Unit of Length 3 None 4 Foot Unit of Length 5 259051005 6 ft 7 Foot (qualifier value) 8 Feet, unit of measurement 9 C0347981

Foot arch exercises
type: Class
subclass of: Active exercise
comment: 1 M00292 2 Foot arch exercises 3 None 4 Foot arch exercises 5 229163000 6 Foot arch exercises 7 Foot arch exercises (regime/therapy) 8 Foot arch exercises 9 C0454372

Foot exercises
type: Class
subclass of: Limb
comment: 1 M00291 2 Foot exercises 3 exercises foot, foot exercise 4 Foot exercises 5 229161003 6 Foot exercises 7 Foot exercises (regime/therapy) 8 Foot exercises 9 C0454370
alternative label: exercises foot
alternative label: foot exercise

Foot pulse
type: Class
subclass of: Cardiovascular system function (Body measurement)
comment: 1 M00211 2 Foot pulse 3 pulse foot, foot pulses 4 Foot pulse 5 422121001 6 Foot pulse, function 7 Foot pulse, function (observable entity) 8 Pedal pulse 9 C0232157
comment: 1 M01927 2 Pedal pulse 3 pulse pedal, pedal pulses, pulse foot, foot pulses 4 Foot pulse 5 422121001 6 foot pulse, function 7 Foot pulse, function (observable entity) 8 Normal foot pulse 9 C0232158

Foot pulse absent
type: Class
subclass of: Cardiovascular system function (Symptom)
comment: 1 M00212 2 Foot pulse absent 3 None 4 Foot pulse absent 5 422163002 6 Foot pulse absent 7 Foot pulse absent (finding) 8 Foot pulse absent 9 C1704204

Football
type: Class
subclass of: Sport
comment: 1 M01404 2 Football 3 None 4 Football 5 26239002 6 Football 7 Soccer ball, device (physical object) 8 Football 9 C0037393
comment: 1 M01404-1 2 Football 3 None 4 Football 5 26239002 6 Football 7 Soccer ball, device (physical object) 8 Football 9 C0336986
comment: 1 M01404-2 2 Football 3 None 4 Football 5 88289009 6 Football 7 Soccer (qualifier value) 8 Football 9 C0037393
comment: 1 M01404-3 2 Football 3 None 4 Football 5 88289009 6 Football 7 Soccer (qualifier value) 8 Football 9 C0336986

Forced Expiratory Volume in One Second
type: Class
subclass of: Hospital information, examination/diagnosis/treatment data
comment: 1 MD03734 2 Forced Expiratory Volume in One Second 3 effort expiratory volume per second FEV1 4 Forced Expiratory Volume in One Second 5 59328004 6 Forced expired volume in 1 second 7 Forced expired volume in 1 second (observable entity) 8 Forced expiratory volume in 1 second finding 9 C0429706

Forced expiratory volume in one second
type: Class
subclass of: Hospital information, examination/diagnosis/treatment data
comment: 1 MD03168 2 Forced expiratory volume in one second 3 effort expiratory volume per second 4 Forced expiratory volume in one second 5 59328004 6 Forced expired volume in 1 second 7 Forced expired volume in 1 second (observable entity) 8 Forced expired volume in 1 second reversibility 9 C2919621
alternative label: effort expiratory volume per second

Forced vital capacity
type: Class
subclass of: Hospital information, examination/diagnosis/treatment data
comment: 1 MD03167 2 Forced vital capacity 3 effortful lung capacity 4 Forced vital capacity 5 50834005 6 Forced vital capacity 7 Forced vital capacity (observable entity) 8 Forced vital capacity 9 C3714541
alternative label: effortful lung capacity

Forelimb
type: Class
subclass of: Musculoskeletal function (Body region)
comment: 1 M02412 2 Forelimb 3 Fore limb 4 Forelimb 5 53120007 6 Upper extremity 7 Upper limb structure (body structure) 8 Forelimb 9 C0016555
alternative label: Fore limb

Forklift
type: Class
subclass of: Equipment
comment: 1 MD05043 2 Forklift 3 None 4 Forklift 5 12247004 6 Truck 7 Truck, device (physical object) 8 Truck (physical object) 9 C0557776

Form of muscle
type: Class
subclass of: Musculoskeletal function (Body region)
comment: 1 M01999 2 Form of muscle 3 form muscle 4 Form of muscle 5 71616004 6 muscle 7 Skeletal and/or smooth muscle structure (body structure) 8 Muscle (organ) 9 C4083049
alternative label: form muscle

Form of thought
type: Class
subclass of: Nervous system and Mental function (Body measurement)
comment: 1 MD05682 2 Form of thought 3 None 4 Form of thought 5 247642000 6 Form of thought 7 Thought process (observable entity) 8 Form of thought 9 C0025361

Formal associations
type: Class
subclass of: Individual Related Factors
comment: 1 MD06545 2 Formal associations 3 None 4 Formal associations 5 263534001 6 Association 7 Association (attribute) 8 Formal associations 9 C2371607

Formal relationships
type: Class
subclass of: Individual Related Factors
comment: 1 MD06481 2 Formal relationships 3 None 4 Formal relationships 5 272151006 6 Relationships 7 Relationships (qualifier value) 8 Formal relationships 9 C2371552

Former alcohol drinker
type: Class
subclass of: Classification of Patient
comment: 1 M02166 2 Former alcohol drinker 3 None 4 Former alcohol drinker 5 82581004 6 ex-drinker 7 Ex-drinker (finding) 8 former drinker 9 C1657271

Former smoker
type: Class
subclass of: Classification of Patient
comment: 1 M02144 2 Former smoker 3 former smokers 4 Former smoker 5 8517006 6 Former smoker 7 Ex-smoker (finding) 8 Former smoker 9 C0337671
alternative label: former smokers

Forming relationships
type: Class
subclass of: Individual Related Factors
comment: 1 MD06472 2 Forming relationships 3 None 4 Forming relationships 5 272151006 6 Relationships 7 Relationships (qualifier value) 8 Forming relationships 9 C2371542

Forward flexion
type: Class
subclass of: Musculoskeletal function (Body measurement)
comment: 1 MD04823 2 Forward flexion 3 None 4 Forward flexion 5 9964006 6 Flexion 7 Flexion, function (observable entity) 8 shoulder motion on forward flexion 9 C2230458

Foursquare
type: Class
subclass of: Units
comment: 1 M05740 2 Foursquare 3 None 4 Foursquare 5 413568008 6 Application - unit of product usage (qualifier value) 7 Application - unit of product usage (qualifier value) 8 Application dose 9 C1533134

Fraction of total Hb
type: Class
subclass of: Units
comment: 1 M03059 2 Fraction of total Hb 3 Fraction of total hemoglobin Fraction of total haemoglobin 4 Fraction of total Hb 5 258740009 6 Fraction of total Hb 7 Fraction of total Hb (qualifier value) 8 Fraction of total Hb 9 C0456623
alternative label: Fraction of total hemoglobin
alternative label: Fraction of total haemoglobin

Fracture area
type: Class
subclass of: Musculoskeletal function (Body region)
comment: 1 MD04322 2 Fracture area 3 None 4 Fracture area 5 125605004 6 Fracture 7 Fracture of bone (disorder) 8 Fracture 9 C0016658

Fragile X chromosome
type: Class
subclass of: Hospital information, examination/diagnosis/treatment data
comment: 1 MD00537 2 Fragile X chromosome 3 None 4 Fragile X chromosome 5 205720009 6 Fragile X chromosome 7 Fragile X chromosome (disorder) 8 Fragile X chromosome 9 C0432482

Free-running sleep-wake cycle disorder
type: Class
subclass of: Nervous system and Mental function (Symptom)
comment: 1 M02196 2 Free-running sleep-wake cycle disorder 3 None 4 Free-running sleep-wake cycle disorder 5 230496009 6 Free-running sleep-wake cycle disorder 7 Non-24 hour sleep-wake cycle (disorder) 8 Free-running sleep-wake cycle disorder 9 C0393772

Frequency
type: Class
subclass of: Time patterns
comment: 1 MD02290 2 frequency 3 None 4 frequency 5 260864003 6 Frequency 7 Frequency (attribute) 8 Frequency 9 C0376249

Frequency of micturition
type: Class
subclass of: Frequency
comment: 1 M01558 2 Frequency of micturition 3 FOM - Frequency of micturition 4 Frequency of micturition 5 300471006 6 Frequency of micturition 7 Finding of frequency of urination (finding) 8 Frequency of micturition 9 C0042023
alternative label: FOM - Frequency of micturition

Frequency of smoking
type: Class
subclass of: Frequency
comment: 1 M00084 2 Frequency of smoking 3 None 4 Frequency of smoking 5 260864003 6 Frequency 7 Frequency (attribute) 8 Current Smoking Frequency 9 C5447914

Friday
type: Class
subclass of: Day
comment: 1 MD01989 2 Friday 3 None 4 Friday 5 307150005 6 Friday 7 Friday (qualifier value) 8 Friday 9 C0585029

Fried eggs
type: Class
subclass of: Nutritional management
comment: 1 MD05368 2 Fried eggs 3 None 4 Fried eggs 5 226883003 6 Fried egg 7 Fried egg (substance) 8 Fried egg 9 C0452825

Fried eggs and scrambled eggs
type: Class
subclass of: Health Related Factors
comment: 1 MD05367 2 Fried eggs and scrambled eggs 3 None 4 Fried eggs and scrambled eggs 5 424226004 6 Cooks food 7 Using device (attribute) 8 Does cook food 9 C0564354

Friends
type: Class
subclass of: Characteristics of the community
comment: 1 MD06685 2 Friends 3 friends 4 Friends 5 113163005 6 Friend 7 Friend (person) 8 Friends 9 C0079382

Fright
type: Class
subclass of: Nervous system and Mental function (Symptom)
comment: 1 M05832 2 Fright 3 None 4 Fright 5 1402001 6 Fright 7 Fear (finding) 8 Fright 9 C0015726

Frightened
type: Class
subclass of: Nervous system and Mental function (Symptom)
comment: 1 M05831 2 Frightened 3 None 4 Frightened 5 1402001 6 Frightened 7 Fear (finding) 8 Frightened 9 C0015726

Frisbee
type: Class
subclass of: Device
comment: 1 M00403 2 Frisbee 3 None 4 Frisbee 5 111045004 6 Exerciser 7 Exerciser, device 8 Frisbee 9 C2712419

Frowning exercises
type: Class
subclass of: Active exercise
comment: 1 M00279 2 Frowning exercises 3 None 4 Frowning exercises 5 229130007 6 Frowning exercises 7 Frowning exercises (regime/therapy) 8 Frowning exercises 9 C0454340

Full-time employment
type: Class
subclass of: Individual Related Factors
comment: 1 MD06528 2 Full-time employment 3 None 4 Full-time employment 5 160903007 6 Full-time employment 7 Full-time employment (finding) 8 Full-time employment 9 C0682295
comment: 1 MD06528-1 2 Full-time employment 3 None 4 Full-time employment 5 160903007 6 Full-time employment 7 Full-time employment (finding) 8 Full-time employment 9 C2584323

Full Body Circuit
type: Class
subclass of: Anatomic part
comment: 1 MD02026 2 Full Body Circuit 3 None 4 Full Body Circuit 5 229074006 6 Exercise circuits 7 Exercise circuits (regime/therapy) 8 Exercise circuits 9 C0454286

Function measurement
type: Class
subclass of: Tool
comment: 1 MD04793 2 Function measurement 3 None 4 Function measurement 5 122869004 6 Measurement 7 Measurement procedure (procedure) 8 Measurement 9 C0242485
comment: 1 MD04793-1 2 Function measurement 3 None 4 Function measurement 5 272391002 6 Measurement 7 Measurement technique (qualifier value) 8 Measurement 9 C0242485

Functional indoor movement
type: Class
subclass of: Health Related Factors
comment: 1 MD05190 2 Functional indoor movement 3 None 4 Functional indoor movement 5 302000008 6 Moves 7 Does move (finding) 8 Does move 9 C0578671

Functions involving the sleep cycle
type: Class
subclass of: Individual Related Factors
comment: 1 MD05642 2 Functions involving the sleep cycle 3 None 4 Functions involving the sleep cycle 5 258158006 6 Sleep, function 7 Sleep, function (observable entity) 8 Functions involving the sleep cycle 9 C2370871

Functions of accessory respiratory muscles
type: Class
subclass of: Respiratory function (Body measurement)
comment: 1 MD05881 2 Functions of accessory respiratory muscles 3 None 4 Functions of accessory respiratory muscles 5 271620003 6 Accessory respiratory muscles used 7 Accessory respiratory muscles used (finding) 8 Functions of accessory respiratory muscles 9 C2371100

Functions of arteries
type: Class
subclass of: Cardiovascular system function (Body measurement)
comment: 1 MD05841 2 Functions of arteries 3 None 4 Functions of arteries 5 21829004 6 blood vessel finding 7 Blood vessel finding (finding) 8 Functions of arteries 9 C2371012

Functions of breathing through the mouth
type: Class
subclass of: Respiratory function (Body measurement)
comment: 1 MD05886 2 Functions of breathing through the mouth 3 None 4 Functions of breathing through the mouth 5 77329001 6 mouth breathing 7 Mouth breathing (finding) 8 Mouth Breathing 9 C0026635

Functions of external muscles of the eye
type: Class
subclass of: Sensory function, Pain and Skin function (Body measurement)
comment: 1 MD05751 2 Functions of external muscles of the eye 3 None 4 Functions of external muscles of the eye 5 78718001 6 muscle function 7 Muscle function (observable entity) 8 Functions of external muscles of the eye 9 C2370935

Functions of internal muscles of the eye
type: Class
subclass of: Sensory function, Pain and Skin function (Body measurement)
comment: 1 MD05749 2 Functions of internal muscles of the eye 3 None 4 Functions of internal muscles of the eye 5 78718001 6 muscle function 7 Muscle function (observable entity) 8 Functions of internal muscles of the eye 9 C2370934

Functions of lachrymal glands
type: Class
subclass of: Sensory function, Pain and Skin function (Body measurement)
comment: 1 MD05752 2 Functions of lachrymal glands 3 None 4 Functions of lachrymal glands 5 420904002 6 Lacrimal gland finding 7 Lacrimal gland finding (finding) 8 Functions of lachrymal glands 9 C2363241

Functions of lymph nodes
type: Class
subclass of: Immune system function (Body measurement)
comment: 1 MD05868 2 Functions of lymph nodes 3 None 4 Functions of lymph nodes 5 301855007 6 Finding of lymph node 7 Finding of lymph node (finding) 8 Functions of lymph nodes 9 C2371092

Functions of lymphatic vessels
type: Class
subclass of: Immune system function (Body measurement)
comment: 1 MD05867 2 Functions of lymphatic vessels 3 None 4 Functions of lymphatic vessels 5 302060005 6 Finding of lymph node and lymphatics 7 Finding of lymph node and lymphatics (finding) 8 Functions of lymphatic vessels 9 C2371091

Functions of orgasmic phase
type: Class
subclass of: Urogenital function (Body measurement)
comment: 1 MD05995 2 Functions of orgasmic phase 3 None 4 Functions of orgasmic phase 5 300550004 6 finding of orgasm 7 Finding of orgasm (finding) 8 Functions of orgasmic phase 9 C2371173

Functions of sexual arousal phase
type: Class
subclass of: Urogenital function (Body measurement)
comment: 1 MD05993 2 Functions of sexual arousal phase 3 None 4 Functions of sexual arousal phase 5 33105009 6 sexual arousal 7 Sexual excitation, function (observable entity) 8 Functions of sexual arousal phase 9 C2371171

Functions of sexual preparatory phase
type: Class
subclass of: Urogenital function (Body measurement)
comment: 1 MD05994 2 Functions of sexual preparatory phase 3 None 4 Functions of sexual preparatory phase 5 118199002 6 sexual finding 7 Finding relating to sexuality and sexual activity (finding) 8 Functions of sexual preparatory phase 9 C2371172

Functions of sexual resolution phase
type: Class
subclass of: Urogenital function (Body measurement)
comment: 1 MD05996 2 Functions of sexual resolution phase 3 None 4 Functions of sexual resolution phase 5 118199002 6 sexual finding 7 Finding relating to sexuality and sexual activity (finding) 8 Functions of sexual resolution phase 9 C2371174

Functions of sneezing
type: Class
subclass of: Respiratory function (Body measurement)
comment: 1 MD05888 2 Functions of sneezing 3 None 4 Functions of sneezing 5 76067001 6 sneezing 7 Sneezing (finding) 8 Sneezing 9 C0037383

Functions of structures adjoining the eye
type: Class
subclass of: Sensory function, Pain and Skin function (Body measurement)
comment: 1 MD05748 2 Functions of structures adjoining the eye 3 None 4 Functions of structures adjoining the eye 5 261041009 6 working, function 7 Working, function (observable entity) 8 Functions of structures adjoining the eye 9 C2370933

Functions of the eyelid
type: Class
subclass of: Sensory function, Pain and Skin function (Body measurement)
comment: 1 MD05750 2 Functions of the eyelid 3 None 4 Functions of the eyelid 5 8521004 6 eyelid function 7 Eyelid function (observable entity) 8 Functions of the eyelid 9 C0234663

Functions of the thoracic respiratory muscles
type: Class
subclass of: Respiratory function (Body measurement)
comment: 1 MD05879 2 Functions of the thoracic respiratory muscles 3 None 4 Functions of the thoracic respiratory muscles 5 4665007 6 Thoracic respiration 7 Thoracic breathing (finding) 8 Functions of the thoracic respiratory muscles 9 C2371099

Functions of yawning
type: Class
subclass of: Respiratory function (Body measurement)
comment: 1 MD05889 2 Functions of yawning 3 None 4 Functions of yawning 5 37993006 6 yawning 7 Yawning, function (observable entity) 8 Yawning 9 C0043387

Functions related to childbirth
type: Class
subclass of: Urogenital function (Body measurement)
comment: 1 MD06010 2 Functions related to childbirth 3 None 4 Functions related to childbirth 5 386216000 6 childbirth 7 Human parturition, function (observable entity) 8 Functions related to childbirth 9 C2371184

Functions related to fertility
type: Class
subclass of: Urogenital function (Body measurement)
comment: 1 MD06008 2 Functions related to fertility 3 None 4 Functions related to fertility 5 397594008 6 Fertility, function 7 Fertility, function (observable entity) 8 Functions related to fertility 9 C2371182

Functions related to mucus
type: Class
subclass of: Digestive function (Body measurement)
comment: 1 MD05890 2 Functions related to mucus 3 None 4 Functions related to mucus 5 49909006 6 Mucus 7 Mucus (substance) 8 Mucous body substance 9 C0026727

Functions related to pregnancy
type: Class
subclass of: Urogenital function (Body measurement)
comment: 1 MD06009 2 Functions related to pregnancy 3 None 4 Functions related to pregnancy 5 289908002 6 Pregnancy, function 7 Pregnancy, function (observable entity) 8 Functions related to pregnancy 9 C2371183

Furnishing a place to live
type: Class
subclass of: Health Related Factors
comment: 1 MD06414 2 Furnishing a place to live 3 None 4 Furnishing a place to live 5 264362003 6 Home 7 Home (environment) 8 Furnishing a place to live 9 C2371485

Gain
type: Class
subclass of: Health Related Factors
comment: 1 MD02513 2 Gain 3 None 4 Gain 5 282501000 6 Runs up hill 7 Does run up hill (finding) 8 gain 9 C1517378

Gait pattern functions
type: Class
subclass of: Musculoskeletal function (Body measurement)
comment: 1 MD06096 2 gait pattern functions 3 None 4 Gait pattern functions 5 63448001 6 Gait 7 Gait, function (observable entity) 8 Gait pattern functions 9 C2371258

Games for therapy
type: Class
subclass of: Musculoskeletal function (Therapy)
comment: 1 M00578 2 Games for therapy 3 game therapy 4 Games for therapy 5 229215009 6 Games for therapy 7 Games for therapy (regime/therapy) 8 Games for therapy 9 C0454421
alternative label: game therapy

Gamma per Kilogram per Minute
type: Class
subclass of: Units
comment: 1 M04784 2 Gamma per Kilogram per Minute 3 gamma/kg/min 4 Gamma per Kilogram per Minute 5 767525000 6 unit 7 Unit (qualifier value) 8 Unit 9 C0439157
alternative label: gamma/kg/min

Gas
type: Class
subclass of: Digestive function (Symptom)
comment: 1 M00492 2 Gas 3 None 4 Gas 5 736680000 6 Gas 7 Gas (state of matter) 8 Gas 9 C0017110
comment: 1 M00492-1 2 Gas 3 None 4 Gas 5 736680000 6 Gas 7 Gas (state of matter) 8 Gas 9 C1704673
comment: 1 M00492-2 2 Gas 3 None 4 Gas 5 74947009 6 Gas 7 Gaseous substance (substance) 8 Gas 9 C0017110
comment: 1 M00492-3 2 Gas 3 None 4 Gas 5 74947009 6 Gas 7 Gaseous substance (substance) 8 Gas 9 C1704673
comment: 1 M00492-4 2 Gas 3 None 4 Gas 5 763824009 6 Gas 7 Gas (basic dose form) 8 Gas 9 C0017110
comment: 1 M00492-5 2 Gas 3 None 4 Gas 5 763824009 6 Gas 7 Gas (basic dose form) 8 Gas 9 C1704673

Gastroenterology
type: Class
subclass of: Classification of Hospital
comment: 1 MD00678 2 Gastroenterology 3 None 4 Gastroenterology 5 394584008 6 Gastroenterology 7 Gastroenterology (qualifier value) 8 gastroenterology (field) 9 C0017163

Gathering daily necessities
type: Class
subclass of: Health Related Factors
comment: 1 MD06419 2 Gathering daily necessities 3 None 4 Gathering daily necessities 5 311791003 6 Information gathering 7 Information gathering (procedure) 8 Gathering daily necessities 9 C2371489

Gaucher disease patients
type: Class
subclass of: Classification of Patient
comment: 1 MD00247 2 Gaucher disease patients 3 None 4 Gaucher disease patients 5 190794006 6 Gaucher disease 7 Glucosylceramide beta-glucosidase deficiency (disorder) 8 Gaucher Disease 9 C0017205

Gauss
type: Class
subclass of: Units
comment: 1 M05096 2 Gauss 3 None 4 Gauss 5 767525000 6 unit 7 Unit (qualifier value) 8 Unit 9 C0439169

Gender
type: Class
subclass of: Units
comment: 1 MD00877 2 Gender 3 None 4 Gender 5 263495000 6 Gender 7 Gender (observable entity) 8 Gender 9 C0079399

General hospital
type: Class
subclass of: Classification of Hospital
comment: 1 MD00129 2 General hospital 3 None 4 General hospital 5 34271000087101 6 General hospital 7 General hospital (environment) 8 Hospitals, General 9 C0020008

General insurance
type: Class
subclass of: Hospital Administration
comment: 1 MD00582 2 General insurance 3 None 4 General insurance 5 224775004 6 National Health Service benefits (qualifier value) 7 National Health Service benefits (qualifier value) 8 National Health Service benefits 9 C0557718

General metabolic functions
type: Class
subclass of: Functions of Blood System, Metabolic system and Endocrine system (Body measurement)
comment: 1 MD05948 2 General metabolic functions 3 None 4 General metabolic functions 5 47722004 6 General metabolic function 7 General metabolic function (observable entity) 8 General metabolic functions 9 C0025519

General movements
type: Class
subclass of: Musculoskeletal function (Body measurement)
comment: 1 MD06085 2 General movements 3 None 4 General movements 5 255324009 6 Movement 7 Movement (observable entity) 8 General movements 9 C2371949

General physical endurance
type: Class
subclass of: Musculoskeletal function (Body measurement)
comment: 1 MD05898 2 General physical endurance 3 None 4 General physical endurance 5 406203001 6 Endurance 7 Endurance (observable entity) 8 General physical endurance 9 C2371106

General products and technology for communication
type: Class
subclass of: Device
comment: 1 MD06584 2 General products and technology for communication 3 None 4 General products and technology for communication 5 272394005 6 Technique 7 Technique (qualifier value) 8 General products and technology for communication 9 C2371636

General products and technology for education
type: Class
subclass of: Device
comment: 1 MD06589 2 General products and technology for education 3 None 4 General products and technology for education 5 272394005 6 Technique 7 Technique (qualifier value) 8 General products and technology for education 9 C2371641

General products and technology for employment
type: Class
subclass of: Device
comment: 1 MD06594 2 General products and technology for employment 3 None 4 General products and technology for employment 5 272394005 6 Technique 7 Technique (qualifier value) 8 General products and technology for employment 9 C2371646

General products and technology for personal indoor and outdoor mobility and transportation
type: Class
subclass of: Device
comment: 1 MD06579 2 General products and technology for personal indoor and outdoor mobility and transportation 3 None 4 General products and technology for personal indoor and outdoor mobility and transportation 5 272394005 6 Technique 7 Technique (qualifier value) 8 General products and technology for personal indoor and outdoor mobility and transportation 9 C2371631
alternative label: Products and technology for personal indoor and outdoor mobility and transportation

General products and technology for personal use in daily living
type: Class
subclass of: Device
comment: 1 MD06574 2 General products and technology for personal use in daily living 3 None 4 General products and technology for personal use in daily living 5 272394005 6 Technique 7 Technique (qualifier value) 8 General products and technology for personal use in daily living 9 C2371626

General products and technology for the practice of religion or spirituality
type: Class
subclass of: Device
comment: 1 MD06604 2 General products and technology for the practice of religion or spirituality 3 None 4 General products and technology for the practice of religion or spirituality 5 272394005 6 Technique 7 Technique (qualifier value) 8 General products and technology for the practice of religion or spirituality 9 C2371656

General social support policies
type: Class
subclass of: Public Policy Factors
comment: 1 MD06791 2 General social support policies 3 None 4 General social support policies 5 276339004 6 environment 7 Environment (environment) 8 General social support policies 9 C2371816

General social support services
type: Class
subclass of: Public Policy Factors
comment: 1 MD06789 2 General social support services 3 None 4 General social support services 5 224930009 6 services 7 Services (qualifier value) 8 General social support services 9 C2371814

General social support systems
type: Class
subclass of: Public Policy Factors
comment: 1 MD06790 2 General social support systems 3 None 4 General social support systems 5 246333005 6 system 7 System (attribute) 8 General social support systems 9 C2371815

Generalized pain
type: Class
subclass of: Sensory function, Pain and Skin function (Symptom)
comment: 1 MD05794 2 Generalized pain 3 None 4 Generalized pain 5 82991003 6 Generalized pain 7 Generalized aches and pains (finding) 8 Generalized pain 9 C0281856

Genito-Urinary Region
type: Class
subclass of: Urogenital function (Body region)
comment: 1 M00662 2 Genito-Urinary Region 3 None 4 Genito-Urinary Region 5 21514008 6 Genitourinary tract 7 Structure of genitourinary system (body structure) 8 Genito-Urinary Region 9 C1517518

Get back to original work
type: Class
subclass of: Questionnaire
comment: 1 MD04960 2 Get back to original work 3 None 4 Get back to original work 5 261041009 6 Working 7 Working, function (observable entity) 8 Work 9 C0043227

Get back to other job
type: Class
subclass of: Questionnaire
comment: 1 MD04965 2 Get back to other job 3 None 4 Get back to other job 5 844005 6 Behavior finding 7 Behavior finding (finding) 8 Behavior 9 C0004927

Get up and walk
type: Class
subclass of: Health Related Factors
comment: 1 MD04384 2 Get up and walk 3 None 4 Get up and walk 5 282146009 6 Walks 7 Does walk (finding) 8 Does walk 9 C0600108

Get up and walk from the chair
type: Class
subclass of: Questionnaire
comment: 1 MD04382 2 Get up and walk from the chair 3 None 4 Get up and walk from the chair 5 401196007 6 Get up and go test 7 Get up and go test (procedure) 8 Get up and go test 9 C1303170

Get up and walk test
type: Class
subclass of: Tool
comment: 1 MD04390 2 Get up and walk test 3 None 4 Get up and walk test 5 401196007 6 Get up and go test 7 Get up and go test (procedure) 8 Get up and go test 9 C1303170

Gigabecquerel
type: Class
subclass of: Units
comment: 1 M05204 2 Gigabecquerel 3 GBq 4 Gigabecquerel 5 418931004 6 Gigabecquerel 7 Gigabecquerel (qualifier value) 8 Gigabecquerel 9 C1688582
alternative label: GBq

Gigabecquerel per Gram
type: Class
subclass of: Units
comment: 1 M05657 2 Gigabecquerel per Gram 3 GBq/g Gigabecquerel/Gram 4 Gigabecquerel per Gram 5 418931004 6 Gigabecquerel 7 Gigabecquerel (qualifier value) 8 Gigabecquerel per Gram 9 C2348852
alternative label: GBq/g
alternative label: Gigabecquerel/Gram

Gigabecquerel per Kilogram
type: Class
subclass of: Units
comment: 1 M05471 2 Gigabecquerel per Kilogram 3 gigabecquerel/kilogram GBq/Kg 4 Gigabecquerel per Kilogram 5 767525000 6 unit 7 Unit (qualifier value) 8 Unit 9 C0439190
alternative label: GBq/Kg
alternative label: gigabecquerel/kilogram

Gigabecquerel per Microgram
type: Class
subclass of: Units
comment: 1 M05661 2 Gigabecquerel per Microgram 3 Gigabecquerel/Microgram GBq/mcg GBq/ug 4 Gigabecquerel per Microgram 5 418931004 6 Gigabecquerel 7 Gigabecquerel (qualifier value) 8 Gigabecquerel per Microgram 9 C2348853
alternative label: GBq/mcg
alternative label: GBq/ug
alternative label: Gigabecquerel/Microgram

Gigabecquerel per Milligram
type: Class
subclass of: Units
comment: 1 M05667 2 Gigabecquerel per Milligram 3 GBq/mg Gigabecquerel/Milligram 4 Gigabecquerel per Milligram 5 418931004 6 Gigabecquerel 7 Gigabecquerel (qualifier value) 8 Gigabecquerel per Microgram 9 C2348853
alternative label: GBq/mg
alternative label: Gigabecquerel/Milligram

Gigabecquerel per milliliter
type: Class
subclass of: Units
comment: 1 M05225 2 Gigabecquerel per milliliter 3 gigabecquerel/millilitre Gigabecquerel per millilitre GBq/mL 4 Gigabecquerel per milliliter 5 418261000 6 Gigabecquerel per milliliter 7 Gigabecquerel/milliliter (qualifier value) 8 Gigabecquerel per milliliter 9 C1690481
alternative label: gigabecquerel/millilitre
alternative label: Gigabecquerel per millilitre
alternative label: GBq/mL

Glandular epithelial cell
type: Class
subclass of: Hospital information, examination/diagnosis/treatment data
comment: 1 MD00846 2 Glandular epithelial cell 3 None 4 Glandular epithelial cell 5 90558005 6 Glandular cell atypia 7 Glandular cell atypia (morphologic abnormality) 8 Glandular cell atypia 9 C0333880

Glans penis
type: Class
subclass of: Urogenital function (Body region)
comment: 1 MD07002 2 Glans penis 3 None 4 Glans penis 5 60319009 6 Glans penis 7 Glans penis structure (body structure) 8 Glans penis 9 C0227948

Glassful - unit of product usage
type: Class
subclass of: Units
comment: 1 M05348 2 Glassful - unit of product usage 3 Glassful 4 Glassful - unit of product usage 5 421496007 6 Glassful - unit of product usage 7 Glassful - unit of product usage (qualifier value) 8 Glassful - unit of product usage 9 C1720248
alternative label: Glassful

Global psychosocial functions
type: Class
subclass of: Nervous system and Mental function (Body measurement)
comment: 1 MD05617 2 Global psychosocial functions 3 None 4 Global psychosocial functions 5 285231000 6 Mental function 7 Mental function (observable entity) 8 Global psychosocial functions 9 C2371006

Glomerular Filtration rate
type: Class
subclass of: Functions of Blood System, Metabolic system and Endocrine system (Body measurement)
comment: 1 MD00934 2 Glomerular Filtration rate 3 None 4 Glomerular Filtration rate 5 80274001 6 Glomerular filtration rate 7 Glomerular filtration rate (observable entity) 8 Glomerular Filtration Rate 9 C0017654

Glucose
type: Class
subclass of: Hospital information, examination/diagnosis/treatment data
comment: 1 MD00402 2 Glucose 3 None 4 Glucose 5 67079006 6 Glucose 7 Glucose (substance) 8 Glucose 9 C0017725

Glucose result - blood
type: Class
subclass of: Functions of Blood System, Metabolic system and Endocrine system (Body measurement)
comment: 1 M02350 2 Glucose result - blood 3 glucose blood 4 Glucose result - blood 5 365812005 6 Blood glucose result 7 Finding of blood glucose level (finding) 8 Finding of blood glucose level 9 C0428554
alternative label: glucose blood

Gmail
type: Class
subclass of: Units
comment: 1 M05741 2 Gmail 3 None 4 Gmail 5 413568008 6 Application - unit of product usage (qualifier value) 7 Application - unit of product usage (qualifier value) 8 Application dose 9 C1533134

Go to a convenience store and buy things you need
type: Class
subclass of: Health Related Factors
comment: 1 MD05405 2 Go to a convenience store and buy things you need 3 None 4 Go to a convenience store and buy things you need 5 844005 6 Behavior finding 7 Behavior finding (finding) 8 Behavior 9 C0004927

Going up and down the stairs
type: Class
subclass of: Health Related Factors
comment: 1 MD02813 2 Going up and down the stairs 3 Going up and down stairs 4 Going up and down the stairs 5 282193002 6 walks up stairs 7 Does walk up stairs (finding) 8 Does walk up stairs 9 C0560078
alternative label: Going up and down stairs

Goldenhar syndrome
type: Class
subclass of: Hospital information, examination/diagnosis/treatment data
comment: 1 MD00448 2 Goldenhar syndrome 3 None 4 Goldenhar syndrome 5 205418005 6 Goldenhar syndrome 7 Goldenhar syndrome (disorder) 8 Goldenhar syndrome 9 C0265240

Golf
type: Class
subclass of: Sport
comment: 1 M05869 2 Golf 3 Golfs golfing 4 Golf 5 15530008 6 Golfing 7 Golfing (qualifier value) 8 plays golf 9 C2019008
comment: 1 M05869-1 2 Golf 3 Golfs golfing 4 Golf 5 15530008 6 Golfing 7 Golfing (qualifier value) 8 golf 9 C0018041
alternative label: Golfs
alternative label: golfing

Good sleep pattern
type: Class
subclass of: Duration
comment: 1 M00061 2 Good sleep pattern 3 None 4 Good sleep pattern 5 314939008 6 Good sleep pattern 7 Good sleep pattern (finding) 8 Actual Positive Sleep 9 C2364286

Google calendar
type: Class
subclass of: Units
comment: 1 M05742 2 Google calendar 3 None 4 Google calendar 5 413568008 6 Application - unit of product usage (qualifier value) 7 Application - unit of product usage (qualifier value) 8 Application dose 9 C1533134

Grade 1
type: Class
subclass of: Hospital information, examination/diagnosis/treatment data
comment: 1 MD00063 2 Grade 1 3 None 4 Grade 1 5 258351006 6 Grade 1 7 Grade 1 (qualifier value) 8 Grade one rank 9 C0687695

Grade 10
type: Class
subclass of: Hospital information, examination/diagnosis/treatment data
comment: 1 MD00072 2 Grade 10 3 None 4 Grade 10 5 103421006 6 Grade 7 Grade (attribute) 8 Grade 9 C0441800

Grade 11
type: Class
subclass of: Hospital information, examination/diagnosis/treatment data
comment: 1 MD00073 2 Grade 11 3 None 4 Grade 11 5 103421006 6 Grade 7 Grade (attribute) 8 Grade 9 C0441800

Grade 12
type: Class
subclass of: Hospital information, examination/diagnosis/treatment data
comment: 1 MD00074 2 Grade 12 3 None 4 Grade 12 5 103421006 6 Grade 7 Grade (attribute) 8 Grade 9 C0441800

Grade 13
type: Class
subclass of: Hospital information, examination/diagnosis/treatment data
comment: 1 MD00075 2 Grade 13 3 None 4 Grade 13 5 103421006 6 Grade 7 Grade (attribute) 8 Grade 9 C0441800

Grade 2
type: Class
subclass of: Hospital information, examination/diagnosis/treatment data
comment: 1 MD00064 2 Grade 2 3 None 4 Grade 2 5 258352004 6 Grade 2 7 Grade 2 (qualifier value) 8 Grade two rank 9 C0441802

Grade 3
type: Class
subclass of: Hospital information, examination/diagnosis/treatment data
comment: 1 MD00065 2 Grade 3 3 None 4 Grade 3 5 258353009 6 Grade 3 7 Grade 3 (qualifier value) 8 Grade three rank 9 C0450094

Grade 4
type: Class
subclass of: Hospital information, examination/diagnosis/treatment data
comment: 1 MD00066 2 Grade 4 3 None 4 Grade 4 5 258354003 6 Grade 4 7 Grade 4 (qualifier value) 8 Grade four rank 9 C0547054

Grade 5
type: Class
subclass of: Hospital information, examination/diagnosis/treatment data
comment: 1 MD00067 2 Grade 5 3 None 4 Grade 5 5 258355002 6 Grade 5 7 Grade 5 (qualifier value) 8 Grade five rank 9 C0441804

Grade 6
type: Class
subclass of: Hospital information, examination/diagnosis/treatment data
comment: 1 MD00068 2 Grade 6 3 None 4 Grade 6 5 103421006 6 Grade 7 Grade (attribute) 8 Grade 9 C0441800

Grade 7
type: Class
subclass of: Hospital information, examination/diagnosis/treatment data
comment: 1 MD00069 2 Grade 7 3 None 4 Grade 7 5 103421006 6 Grade 7 Grade (attribute) 8 Grade 9 C0441800

Grade 8
type: Class
subclass of: Hospital information, examination/diagnosis/treatment data
comment: 1 MD00070 2 Grade 8 3 None 4 Grade 8 5 103421006 6 Grade 7 Grade (attribute) 8 Grade 9 C0441800

Grade 9
type: Class
subclass of: Hospital information, examination/diagnosis/treatment data
comment: 1 MD00071 2 Grade 9 3 None 4 Grade 9 5 103421006 6 Grade 7 Grade (attribute) 8 Grade 9 C0441800

Gradual rise of fever
type: Class
subclass of: Immune system function (Symptom)
comment: 1 M00169 2 Gradual rise of fever 3 None 4 Gradual rise of fever 5 271750004 6 Gradual rise of fever 7 Gradual rise of fever (finding) 8 Gradual rise of fever 9 C0424762

Grain
type: Class
subclass of: Units
comment: 1 M05098 2 Grain 3 GR grain unit of measure 4 Grain 5 264331002 6 Grain 7 Grain (substance) 8 Grain 9 C0086369
alternative label: grain unit of measure
alternative label: GR

Gram
type: Class
subclass of: Units
comment: 1 M03738 2 Gram 3 gram grams g GM 4 Gram 5 258682000 6 g 7 gram (qualifier value) 8 gram 9 C0439208

Gram Calorie
type: Class
subclass of: Units
comment: 1 M05367 2 Gram Calorie 3 None 4 Gram Calorie 5 258790008 6 calorie 7 calorie (qualifier value) 8 calorie 9 C1879985

Gram Percent
type: Class
subclass of: Units
comment: 1 M03824 2 Gram Percent 3 g% 4 Gram Percent 5 767525000 6 Unit 7 Unit (qualifier value) 8 Unit 9 C0439148
alternative label: g%

Gram meter per beat
type: Class
subclass of: Units
comment: 1 M04869 2 Gram meter per beat 3 gm-m/beat Gram-meter/beat Gram meter/beat Gram metre per beat 4 Gram meter per beat 5 414360007 6 Gram meter per beat 7 Gram-meter/beat (qualifier value) 8 Gram meter per beat 9 C1531990
alternative label: Gram-meter/beat
alternative label: Gram metre per beat
alternative label: Gram meter/beat
alternative label: gm-m/beat

Gram meter per beat per square meter
type: Class
subclass of: Units
comment: 1 M04876 2 Gram meter per beat per square meter 3 gm-m/beat/m2 Gram-meter/beat/square metre Gram-meter/beat/square meter Gram-meter/beat/meter2 Gram-meter/beat/meter squared Gram metre per beat per square metre Gram metre per beat per metre squared Gram meter per beat per meter squared 4 Gram meter per beat per square meter 5 414362004 6 Gram meter per beat per square meter 7 Gram-meter/beat/meter2 (qualifier value) 8 Gram meter per beat per square meter 9 C1531992
alternative label: Gram-meter/beat/square meter
alternative label: Gram metre per beat per square metre
alternative label: Gram-meter/beat/meter2
alternative label: Gram metre per beat per metre squared
alternative label: Gram-meter/beat/meter squared
alternative label: Gram-meter/beat/square metre
alternative label: Gram meter per beat per meter squared

Gram per 100 Grams
type: Class
subclass of: Units
comment: 1 M05341 2 Gram per 100 Grams 3 g/100 g 4 Gram per 100 Grams 5 767525000 6 unit 7 Unit (qualifier value) 8 Unit 9 C0439186
alternative label: g/100 g

Gram per 24 Hours
type: Class
subclass of: Units
comment: 1 M04198 2 Gram per 24 Hours 3 g/24h gram/24 hours g/24.h 4 Gram per 24 Hours 5 258830000 6 Gram/24 hours 7 Gram/24 hours (qualifier value) 8 Gram/24 hours 9 C0439417
alternative label: gram/24 hours
alternative label: g/24.h
alternative label: g/24h

Gram per Cubic Centimeter
type: Class
subclass of: Units
comment: 1 M04777 2 Gram per Cubic Centimeter 3 grams per cubic centimeter gram/cubic centimeter g/cm3 gram/cubic centimetre 4 Gram per Cubic Centimeter 5 283011006 6 gram/cubic centimeter 7 Grams per cubic centimeter (qualifier value) 8 gram/cubic centimeter 9 C1300565
alternative label: gram/cubic centimeter
alternative label: g/cm3
alternative label: gram/cubic centimetre
alternative label: grams per cubic centimeter

Gram per Cubic Decimeter
type: Class
subclass of: Units
comment: 1 M03990 2 Gram per Cubic Decimeter 3 g/dm3 4 Gram per Cubic Decimeter 5 767525000 6 Unit 7 Unit (qualifier value) 8 Unit 9 C0439148
alternative label: g/dm3

Gram per Cubic Meter
type: Class
subclass of: Units
comment: 1 M03845 2 Gram per Cubic Meter 3 gram/cubic metre gram/cubic meter g/m3 4 Gram per Cubic Meter 5 258895008 6 g/m3 7 g/kL (qualifier value) 8 g/m3 9 C0439268
alternative label: gram/cubic meter
alternative label: gram/cubic metre
alternative label: g/m3

Gram per Deciliter
type: Class
subclass of: Units
comment: 1 M03825 2 Gram per Deciliter 3 g/dL gram/decilitre gram/deciliter 4 Gram per Deciliter 5 258795003 6 g/dL 7 Gram/deciliter (qualifier value) 8 Gram/deciliter 9 C0439267
alternative label: gram/deciliter
alternative label: g/dL
alternative label: gram/decilitre

Gram per Gram
type: Class
subclass of: Units
comment: 1 M04825 2 Gram per Gram 3 g/g Gram/Gram 4 Gram per Gram 5 767525000 6 unit 7 Unit (qualifier value) 8 Unit 9 C0439157
alternative label: g/g
alternative label: Gram/Gram

Gram per Gram per Day
type: Class
subclass of: Units
comment: 1 M05675 2 Gram per Gram per Day 3 g/g/d 4 Gram per Gram per Day 5 258829005 6 Gram/day 7 Gram/day (qualifier value) 8 Gram per Gram per Day 9 C2348884
alternative label: g/g/d

Gram per Kilogram
type: Class
subclass of: Units
comment: 1 M04756 2 Gram per Kilogram 3 g/kg Gram/Kilogram 4 Gram per Kilogram 5 396167010 6 Gram/kilogram 7 Gram/kilogram (qualifier value) 8 Gram/kilogram 9 C1300564
alternative label: g/kg
alternative label: Gram/Kilogram

Gram per Kilogram per Day
type: Class
subclass of: Units
comment: 1 M04900 2 Gram per Kilogram per Day 3 g/kg/d Grams per kilogram per day Gram/kilogram/day g/kg/day 4 Gram per Kilogram per Day 5 414306004 6 Gram per kilogram per day 7 Gram/kilogram/day (qualifier value) 8 Gram per kilogram per day 9 C1532536
alternative label: Gram/kilogram/day
alternative label: g/kg/d
alternative label: Grams per kilogram per day
alternative label: g/kg/day

Gram per Liter
type: Class
subclass of: Units
comment: 1 M03989 2 Gram per Liter 3 gram/litre gram/liter g/L g l l g 4 Gram per Liter 5 258794004 6 g/L 7 Gram/liter (qualifier value) 8 g/L 9 C0439294
alternative label: gram/liter
alternative label: g l
alternative label: gram/litre
alternative label: g/L
alternative label: l g

Gram per Milliliter
type: Class
subclass of: Units
comment: 1 M04776 2 Gram per Milliliter 3 gram/mL g/mL 4 Gram per Milliliter 5 396169007 6 g/mL 7 Gram/milliliter (qualifier value) 8 g/mL 9 C1300565
alternative label: g/mL
alternative label: gram/mL

Gram per Mole
type: Class
subclass of: Units
comment: 1 M05681 2 Gram per Mole 3 g/mol Gram/Mole 4 Gram per Mole 5 258682000 6 gram 7 gram (qualifier value) 8 Gram per Mole (g/mol) 9 C2348885
alternative label: g/mol
alternative label: Gram/Mole

Gram per Square Centimeter
type: Class
subclass of: Units
comment: 1 M05683 2 Gram per Square Centimeter 3 g/cm2 Gram/Square Centimeter 4 Gram per Square Centimeter 5 258682000 6 gram 7 gram (qualifier value) 8 Gram per Square Centimeter 9 C2348886
alternative label: g/cm2
alternative label: Gram/Square Centimeter

Gram per Square Meter
type: Class
subclass of: Units
comment: 1 M04761 2 Gram per Square Meter 3 Gram/Square Meter Gram/meter2 Gram per square metre Gram per metre squared Gram per meter2 g/m2 gm/m2 gsm Gram per meter squared 4 Gram per Square Meter 5 396168007 6 Gram/square meter 7 Gram/square meter (qualifier value) 8 Gram/square meter 9 C1300567
alternative label: Gram per square metre
alternative label: gsm
alternative label: g/m2
alternative label: gm/m2
alternative label: Gram per metre squared
alternative label: Gram/meter2
alternative label: Gram/Square Meter
alternative label: Gram per meter2
alternative label: Gram per meter squared

Gram per Square Meter per Day
type: Class
subclass of: Units
comment: 1 M05684 2 Gram per Square Meter per Day 3 g/m2/d 4 Gram per Square Meter per Day 5 258682000 6 gram 7 gram (qualifier value) 8 Gram per Square Centimeter 9 C2348886
alternative label: g/m2/d

Gram per kilogram per hour
type: Class
subclass of: Units
comment: 1 M04835 2 Gram per kilogram per hour 3 g/kg/hr Grams/kilogram/hour Grams per kilogram per hour gm/kg/hr 4 Gram per kilogram per hour 5 405669001 6 Gram per kilogram per hour 7 Gram per kilogram per hour (qualifier value) 8 Gram per kilogram per hour 9 C1320757
alternative label: Grams/kilogram/hour
alternative label: g/kg/hr
alternative label: Grams per kilogram per hour
alternative label: gm/kg/hr

Grams per 5 hours
type: Class
subclass of: Units
comment: 1 M04879 2 Grams per 5 hours 3 g/5hr Grams/5 hours gm/5hr 4 Grams per 5 hours 5 414364003 6 Grams per 5 hours 7 Grams/5 hours (qualifier value) 8 Grams per 5 hours 9 C1531994
alternative label: gm/5hr
alternative label: Grams/5 hours
alternative label: g/5hr

Grams per kilogram per minute
type: Class
subclass of: Units
comment: 1 M04838 2 Grams per kilogram per minute 3 g/kg/min Grams/kilogram/minute gm/kg/min 4 Grams per kilogram per minute 5 405670000 6 Grams per kilogram per minute 7 Grams per kilogram per minute (qualifier value) 8 Grams per kilogram per minute 9 C1320758
alternative label: g/kg/min
alternative label: Grams/kilogram/minute
alternative label: gm/kg/min

Grasp
type: Class
subclass of: Health Related Factors
comment: 1 MD04095 2 Grasp 3 Grasping 4 Grasp 5 242899004 6 Grasped with hand 7 Grasped with hand (event) 8 grasp 9 C0220843
comment: 1 MD04095-1 2 Grasp 3 Grasping 4 grasp 5 247918002 6 Forced grasping 7 Forced grasping (finding) 8 grasp 9 C0220843
alternative label: Grasping

Gray hair
type: Class
subclass of: Sensory function, Pain and Skin function (Body region)
comment: Body region Sensory function, Pain and Skin function None 1 M00533 2 Gray hair 3 gray hairs, graying hair, graying hairs, grey hairs, greying hair ,greying hairs, hair gray 4 Gray hair 5 297994000 6 Gray hair 7 Gray hair (finding) 8 Gray hair 9 C0574765
alternative label: graying hair
alternative label: hair gray
alternative label: greying hair
alternative label: greying hairs
alternative label: gray hairs
alternative label: graying hairs
alternative label: grey hairs

Grit
type: Class
subclass of: Health Related Factors
comment: 1 MD02505 2 Grit 3 None 4 Grit 5 264359001 6 Grit 7 Grit (substance) 8 Grit 9 C0440273

Groin
type: Class
subclass of: Sensory function, Pain and Skin function (Body region)
comment: 1 M01761 2 Groin 3 Groins 4 Groin 5 26893007 6 Groin 7 Inguinal region structure (body structure) 8 Groin 9 C0018246

Gs
type: Class
subclass of: Units
comment: 1 M05095 2 Gs 3 None 4 Gs 5 767525000 6 unit 7 Unit (qualifier value) 8 Unit 9 C0439169

Guided Breathing
type: Class
subclass of: Sport
comment: 1 MD01019 2 Guided Breathing 3 None 4 Guided Breathing 5 12895002 6 Breathing exercises 7 Physiotherapeutic breathing exercise (regime/therapy) 8 Breathing exercises 9 C0006155

Gum
type: Class
subclass of: Units
comment: 1 M03524 2 Gum 3 Gums Gum - unit of product usage 4 Gum 5 113279002 6 Gum 7 Gingival structure (body structure) 8 Gingiva 9 C0017562
comment: 1 M03524-1 2 Gum 3 Gums Gum - unit of product usage 4 Gum 5 113279002 6 Gum 7 Gingival structure (body structure) 8 Gum Dose Form 9 C1378701
comment: 1 M03524-2 2 Gum 3 Gums Gum - unit of product usage 4 Gum 5 113279002 6 Gum 7 Gingival structure (body structure) 8 Gum - unit of product usage 9 C2316648
comment: 1 M03524-3 2 Gum 3 Gums Gum - unit of product usage 4 Gum 5 426210003 6 Gum 7 Gum (basic dose form) 8 Gingiva 9 C0017562
comment: 1 M03524-4 2 Gum 3 Gums Gum - unit of product usage 4 Gum 5 426210003 6 Gum 7 Gum (basic dose form) 8 Gum Dose Form 9 C1378701
comment: 1 M03524-5 2 Gum 3 Gums Gum - unit of product usage 4 Gum 5 426210003 6 Gum 7 Gum (basic dose form) 8 Gum - unit of product usage 9 C2316648
comment: 1 M03524-6 2 Gum 3 Gums Gum - unit of product usage 4 Gum 5 430281005 6 Gum 7 Gum - unit of product usage (qualifier value) 8 Gingiva 9 C0017562
comment: 1 M03524-7 2 Gum 3 Gums Gum - unit of product usage 4 Gum 5 430281005 6 Gum 7 Gum - unit of product usage (qualifier value) 8 Gum Dose Form 9 C1378701
comment: 1 M03524-8 2 Gum 3 Gums Gum - unit of product usage 4 Gum 5 430281005 6 Gum 7 Gum - unit of product usage (qualifier value) 8 Gum - unit of product usage 9 C2316648
alternative label: Gum - unit of product usage
alternative label: Gums

Gustatory perception
type: Class
subclass of: Nervous system and Mental function (Body measurement)
comment: 1 MD05675 2 Gustatory perception 3 None 4 Gustatory perception 5 1173082008 6 Gustatory perception 7 Gustatory perception function (observable entity) 8 Gustatory perception 9 C2350521

Gymnastic
type: Class
subclass of: Sport
comment: 1 M01058 2 Gymnastic 3 gymnastics, Gymnastics 4 Gymnastic 5 26029000 6 Exercises 7 Exercises (regime/therapy) 8 Gymnastics 9 C0018409
alternative label: Gymnastics
alternative label: gymnastics

Gynoid Fat
type: Class
subclass of: Musculoskeletal function (Body measurement)
comment: 1 MD03022 2 Gynoid Fat 3 None 4 Gynoid Fat 5 248312008 6 Gynoid Fat distrivution 7 Peripheral obesity (disorder) 8 Peripheral obesity 9 C0424629

HAMMER CUAL
type: Class
subclass of: Aerobic Exercise
comment: 1 MD01999 2 HAMMER CUAL 3 None 4 HAMMER CUAL 5 183301007 6 Physical exercises 7 Physical exercises (regime/therapy) 8 Physical therapy exercises 9 C0452241

HAND ROTATION
type: Class
subclass of: Health Related Factors
comment: 1 MD02019 2 HAND ROTATION 3 None 4 HAND ROTATION 5 70433009 6 Rotation 7 Musculoskeletal rotation (observable entity) 8 Musculoskeletal rotation 9 C0677597

HPF
type: Class
subclass of: Units
comment: 1 M03407 2 HPF 3 None 4 HPF 5 259034003 6 per high power field 7 per high power field (qualifier value) 8 High Power Field 9 C1552990

HV - Hyperventilation
type: Class
subclass of: Respiratory function (Symptom)
comment: 1 M01172 2 Hyperventilation 3 hyperventilate, hyperventilate, hyperventilated, hyperventilates, Hyperventilating, Hyperventilations 4 HV - Hyperventilation 5 68978004 6 HV - Hyperventilation 7 Hyperventilation (finding) 8 Hyperventilation 9 C0020578

Hacky sack
type: Class
subclass of: Equipment
comment: 1 M00407 2 Hacky sack 3 None 4 Hacky sack 5 708542002 6 Exercise equipment and/or device 7 Exercise equipment and/or device (physical object) 8 Exercise equipment 9 C0497977

Haematological system functions
type: Class
subclass of: Functions of Blood System, Metabolic system and Endocrine system (Body measurement)
comment: 1 MD05853 2 Haematological system functions 3 None 4 Haematological system functions 5 86084001 6 haematologic function 7 Hematologic function (observable entity) 8 Haematological system functions 9 C2371088

Haemoglobin saturation with oxygen
type: Class
subclass of: Functions of Blood System, Metabolic system and Endocrine system (Body measurement)
comment: 1 M02336 2 Haemoglobin saturation with oxygen 3 oxygen saturation, O2 saturation, hemoglobin oxygen saturation, O2 -oxygen saturation, saturation oxygen blood, Hemoglobin saturation with oxygen 4 Haemoglobin saturation with oxygen 5 103228002 6 Haemoglobin saturation with oxygen 7 Hemoglobin saturation with oxygen (observable entity) 8 Hemoglobin saturation with oxygen 9 C0428174
alternative label: hemoglobin oxygen saturation
alternative label: O2 -oxygen saturation
alternative label: Hemoglobin saturation with oxygen
alternative label: oxygen saturation
alternative label: O2 saturation

Haemolytic
type: Class
subclass of: Functions of Blood System, Metabolic system and Endocrine system (Symptom)
comment: 1 MD00500 2 Haemolytic 3 None 4 Haemolytic 5 278215000 6 Haemolytic 7 Hemolytic (qualifier value) 8 Hemolytic (qualifier value) 9 C0312853

Hair growth
type: Class
subclass of: Hospital information, examination/diagnosis/treatment data
comment: 1 M00534 2 Hair growth 3 None 4 Hair growth 5 88911008 6 Hair growth 7 Hair growth, function (observable entity) 8 Hair growth 9 C0232407

Hair growth observable
type: Class
subclass of: Sensory function, Pain and Skin function (Body measurement)
comment: 1 M00238 2 Hair growth observable 3 None 4 Hair growth observable 5 364549000 6 Hair growth observable 7 Hair growth observable (observable entity) 8 Hair growth observable 9 C1286248

Hair not growing properly
type: Class
subclass of: Sensory function, Pain and Skin function (Symptom)
comment: 1 M01952 2 Hair not growing properly 3 None 4 Hair not growing properly 5 399289002 6 Hair not growing properly 7 Failure of hair growth (finding) 8 Hair not growing properly 9 C0232412

Hairiness
type: Class
subclass of: Sensory function, Pain and Skin function (Symptom)
comment: 1 M01163 2 Hairiness 3 None 4 Hairiness 5 271607001 6 Hairiness 7 Excessive hair growth (finding) 8 Hypertrichosis 9 C0020555

Hallucination
type: Class
subclass of: Nervous system and Mental function (Symptom)
comment: 1 M00493 2 Hallucination 3 hallucinate. hallucinated. hallucinating 4 Hallucination 5 7011001 6 Hallucinations 7 Hallucinations (finding) 8 Hallucinations 9 C0018524
alternative label: hallucinated
alternative label: hallucinating
alternative label: hallucinate

Hamstring exercises
type: Class
subclass of: Limb
comment: 1 M00352 2 Hamstring exercises 3 exercises hamstrings 4 Hamstring exercises 5 229156000 6 Hamstring exercises 7 Hamstring exercises (regime/therapy) 8 Hamstring exercises 9 C0454365
alternative label: exercises hamstrings

Hand-eye coordination
type: Class
subclass of: Hospital information, examination/diagnosis/treatment data
comment: 1 MD03214 2 Hand-eye coordination 3 None 4 Hand-eye coordination 5 85352007 6 Coordination 7 Coordination (observable entity) 8 eye-hand coordination 9 C0678855

Hand Dexterity Test
type: Class
subclass of: Questionnaire
comment: 1 MD04479 2 Hand Dexterity Test 3 Hand Dexterity 4 Hand Dexterity Test 5 252707007 6 Test of the hand 7 Test of the hand (procedure) 8 Test of the hand 9 C0430763
alternative label: Hand Dexterity

Hand Range of Motion
type: Class
subclass of: Musculoskeletal function (Body measurement)
comment: 1 MD03997 2 Hand Range of Motion 3 None 4 Hand Range of Motion 5 364564000 6 Range of motion 7 Range of joint movement (observable entity) 8 range of motion of hand 9 C2237184

Hand Sensory
type: Class
subclass of: Sensory function, Pain and Skin function (Body measurement)
comment: 1 MD04066 2 Hand Sensory 3 None 4 Hand Sensory 5 734994004 6 Nerve of hand 7 Structure of peripheral nerve of hand (body structure) 8 Sensory (qualifier value) 9 C0445254

Hand action
type: Class
subclass of: Health Related Factors
comment: 1 MD04088 2 Hand action 3 None 4 Hand action 5 129264002 6 Action 7 Action (qualifier value) 8 Action 9 C0441472
comment: 1 MD04088-1 2 Hand action 3 None 4 Hand action 5 129264002 6 Action 7 Action (qualifier value) 8 Action 9 C3266814
comment: 1 MD04088-2 2 Hand action 3 None 4 Hand action 5 273248003 6 Action 7 Action (attribute) 8 Action 9 C0441472
comment: 1 MD04088-3 2 Hand action 3 None 4 Hand action 5 273248003 6 Action 7 Action (attribute) 8 Action 9 C3266814

Hand and arm use
type: Class
subclass of: Health Related Factors
comment: 1 MD06322 2 Hand and arm use 3 None 4 Hand and arm use 5 85562004 6 Hand 7 Hand structure (body structure) 8 Hand and arm use 9 C2371413

Hand exercises
type: Class
subclass of: Limb
comment: 1 M00307 2 Hand exercises 3 hand exercise, exercises hand, exercise hands, exercises hands 4 Hand exercises 5 229119009 6 Hand exercises 7 Hand exercises (regime/therapy) 8 Hand exercises 9 C0454330
alternative label: exercises hand
alternative label: hand exercise
alternative label: exercise hands
alternative label: exercises hands

Hand function
type: Class
subclass of: Musculoskeletal function (Body measurement)
comment: 1 MD05071 2 Hand function 3 None 4 Hand function 5 284364006 6 Hand functions 7 Hand functions (observable entity) 8 Hand functions 9 C0562230

Hand strength
type: Class
subclass of: Musculoskeletal function (Body measurement)
comment: 1 MD04139 2 Hand strength 3 None 4 Hand strength 5 251433001 6 Grip strength 7 Grip strength (observable entity) 8 Hand strength 9 C0242959
comment: 1 MD04139-1 2 Hand strength 3 None 4 Hand strength 5 271708004 6 muscle power 7 Finding of power of skeletal muscle (finding) 8 Muscle Strength 9 C0517349

Handbiking
type: Class
subclass of: Sport
comment: 1 MD00996 2 Handbiking 3 None 4 Handbiking 5 300648001 6 rides a bicycle 7 Does ride a bicycle (finding) 8 Does ride a bicycle 9 C0577368

Handling crisis
type: Class
subclass of: Health Related Factors
comment: 1 MD06220 2 Handling crisis 3 None 4 Handling crisis 5 844005 6 Behavior finding 7 Behavior finding (finding) 8 Handling crisis 9 C2371329

Handling responsibilities
type: Class
subclass of: Health Related Factors
comment: 1 MD06218 2 Handling responsibilities 3 None 4 Handling responsibilities 5 844005 6 Behavior finding 7 Behavior finding (finding) 8 Handling responsibilities 9 C2371327

Handling stress
type: Class
subclass of: Health Related Factors
comment: 1 MD06219 2 Handling stress 3 None 4 Handling stress 5 844005 6 Behavior finding 7 Behavior finding (finding) 8 Handling stress 9 C2371328

Handling stress and other psychological demands
type: Class
subclass of: Sensory function, Pain and Skin function (Symptom)
comment: 1 MD06217 2 Handling stress and other psychological demands 3 None 4 Handling stress and other psychological demands 5 844005 6 Behavior finding 7 Behavior finding (finding) 8 Handling stress and other psychological demands 9 C2371326

Has a temperature
type: Class
subclass of: Hospital information, examination/diagnosis/treatment data
comment: 1 M01012 2 Has a temperature 3 None 4 Has a temperature 5 50177009 6 Has a temperature 7 Body temperature above reference range (finding) 8 Has a temperature 9 C0015967

Has the ability or potential to use a prosthesis for transfers or ambulation in level surfaces at a ﬁxed cadence. Typical of the limited and unlimited household ambulator
type: Class
subclass of: Questionnaire
comment: 1 MD04751 2 Has the ability or potential to use a prosthesis for transfers or ambulation in level surfaces at a ﬁxed cadence. Typical of the limited and unlimited household ambulator 3 None 4 Has the ability or potential to use a prosthesis for transfers or ambulation in level surfaces at a ﬁxed cadence. Typical of the limited and unlimited household ambulator 5 273389003 6 Daily activities questionnaire 7 Daily activities questionnaire (assessment scale) 8 Daily activities questionnaire 9 C0451094

He is always doing his hobby without the help of others
type: Class
subclass of: Questionnaire
comment: 1 MD05329 2 He is always doing his hobby without the help of others 3 None 4 He is always doing his hobby without the help of others 5 273389003 6 Daily activities questionnaire 7 Daily activities questionnaire (assessment scale) 8 Daily activities questionnaire 9 C0451094

Head and Neck
type: Class
subclass of: Respiratory function (Body region)
comment: 1 M00679 2 Head and Neck 3 head neck, Head+Neck, neck head 4 Head and Neck 5 774007 6 Head and neck structure 7 Structure of head and/or neck (body structure) 8 Head and neck structure 9 C0460004
alternative label: head neck
alternative label: Head+Neck
alternative label: neck head

Head and neck region
type: Class
subclass of: Digestive function (Body region)
comment: 1 M01502 2 Head and neck region 3 None 4 Head and neck region 5 118254002 6 Finding of head and neck region 7 Finding of head and neck region (finding) 8 Head and neck structure 9 C0460004

Head and neck structure
type: Class
subclass of: Exercise Type
comment: 1 M00260 2 Head and neck structure 3 None 4 Head and neck structure 5 774007 6 Head and neck structure 7 Structure of head and/or neck (body structure) 8 Head and neck structure 9 C0460004

Head circumference
type: Class
subclass of: Units
comment: 1 M00241 2 Head circumference 3 HC - Head circumference circumference head circumferences head 4 Head circumference 5 363812007 6 Head circumference 7 Head circumference (observable entity) 8 Head circumference 9 C0262499
alternative label: HC - Head circumference
alternative label: circumferences head
alternative label: circumference head

Head hair
type: Class
subclass of: Sensory function, Pain and Skin function (Body region)
comment: 1 MD07123 2 Head hair 3 None 4 Head hair 5 386045008 6 Hair 7 Hair structure (body structure) 8 Hair 9 C0018494

Head lifting exercise
type: Class
subclass of: Active exercise
comment: 1 M00280 2 Head lifting exercise 3 None 4 Head lifting exercise 5 229151005 6 Head lifting exercise 7 Head lifting exercise (regime/therapy) 8 Head lifting exercise 9 C0454360

Head part
type: Class
subclass of: Cardiovascular system function (Body region)
comment: 1 M00532 2 Head part 3 head, Head, head parts 4 Head part 5 123850002 6 Head part 7 Head part (body structure) 8 Head part 9 C1268215
alternative label: head parts
alternative label: head

Health Center Symbol
type: Class
subclass of: Units
comment: 1 MD00823 2 Health Center Symbol 3 None 4 Health Center Symbol 5 264361005 6 Health center 7 Health center (environment) 8 Health center 9 C0475309

Health Related Factors
type: Class
subclass of: Lifestyle
comment: 1 MD02515 2 Flow 3 None 4 Flow 5 54709006 6 Body measurement 7 Body measurement (procedure) 8 Flow 9 C0806140

Health age
type: Class
subclass of: Units
comment: 1 MD01169 2 Health age 3 None 4 Health age 5 263775005 6 health 7 Health (qualifier value) 8 health 9 C0018684

Health care
type: Class
subclass of: Health Related Factors
comment: 1 MD05515 2 Health care 3 None 4 Health care 5 392134007 6 Mange health care 7 Care regimes management (procedure) 8 Mange 9 C0024709

Health care and maintenance
type: Class
subclass of: Health Related Factors
comment: 1 MD05514 2 Health care and maintenance 3 None 4 Health care and maintenance 5 392134007 6 Mange health care 7 Care regimes management (procedure) 8 Mange 9 C0024709

Health center and county hospital
type: Class
subclass of: Classification of Hospital
comment: 1 MD00140 2 Health center and county hospital 3 None 4 Health center and county hospital 5 6827000 6 Local community health center 7 Local community health center (environment) 8 Community Health Centers 9 C0009469
comment: 1 MD00613 2 Health center and county hospital 3 None 4 Health center and county hospital 5 225732001 6 Community hospital 7 Community hospital (environment) 8 Hospitals, Community 9 C0020003

Health check-up code
type: Class
subclass of: Hospital Administration
comment: 1 MD00689 2 Health check-up code 3 None 4 Health check-up code 5 185349003 6 Encounter for check up 7 Encounter for check up (procedure) 8 Encounter for check up 9 C0422303

Health examination result
type: Class
subclass of: Hospital information, examination/diagnosis/treatment data
comment: 1 MD00692 2 Health examination result 3 None 4 Health examination result 5 30219900 6 Examination 7 Examination - action (qualifier value) 8 Medical Examination 9 C0582103

Health examination result date
type: Class
subclass of: Day
comment: 1 MD00821 2 Health examination result date 3 None 4 Health examination result date 5 432213005 6 Date of diagnosis 7 Date of diagnosis (observable entity) 8 Date of diagnosis 9 C2316983
comment: 1 MD00821-1 2 Health examination result date 3 None 4 Health examination result date 5 432213005 6 Date of diagnosis 7 Date of diagnosis (observable entity) 8 Value type - Date 9 C1548309

Health insurance
type: Class
subclass of: Hospital Administration
comment: 1 MD00163 2 Health insurance 3 None 4 Health insurance 5 185952002 6 Private health insurance held 7 Private health insurance held (finding) 8 Health insurance 9 C0021682

Health policies
type: Class
subclass of: Public Policy Factors
comment: 1 MD06797 2 Health policies 3 None 4 Health policies 5 276339004 6 environment 7 Environment (environment) 8 Health policies 9 C0018735

Health professionals
type: Class
subclass of: Hospital information, examination/diagnosis/treatment data
comment: 1 MD06692 2 Health professionals 3 None 4 Health professionals 5 14679004 6 Profession 7 Occupation (occupation) 8 Health professionals 9 C1704312

Health record
type: Class
subclass of: Hospital information, examination/diagnosis/treatment data
comment: 1 MD01168 2 Health record 3 None 4 Health record 5 417319006 6 Record of health event 7 Record of health event (record artifact) 8 health records 9 C0679919

Health services
type: Class
subclass of: Public Policy Factors
comment: 1 MD06795 2 Health services 3 None 4 Health services 5 224930009 6 services 7 Services (qualifier value) 8 Health services 9 C0018747

Health subcenter
type: Class
subclass of: Classification of Hospital
comment: 1 MD00137 2 Health subcenter 3 None 4 Health subcenter 5 6827000 6 Local community health center 7 Local community health center (environment) 8 Health center 9 C0475309

Health systems
type: Class
subclass of: Public Policy Factors
comment: 1 MD06796 2 Health systems 3 None 4 Health systems 5 246333005 6 system 7 System (attribute) 8 Health systems 9 C1456613

HealthyNote
type: Class
subclass of: Units
comment: 1 M05743 2 HealthyNote 3 None 4 HealthyNote 5 413568008 6 Application - unit of product usage (qualifier value) 7 Application - unit of product usage (qualifier value) 8 Application dose 9 C1533134

Hearing therapy
type: Class
subclass of: Sensory function, Pain and Skin function (Therapy)
comment: 1 M00579 2 Hearing therapy 3 therapy hearing 4 Hearing therapy 5 91193004 6 Hearing therapy 7 Hearing therapy (regime/therapy) 8 Hearing therapy 9 C0200310
alternative label: therapy hearing

Heart Murmurs
type: Class
subclass of: Cardiovascular system function (Symptom)
comment: 1 M00494 2 Heart Murmurs 3 heart murmuring, Heart Murmurs, Murmur, murmuring, murmurs 4 Heart Murmurs 5 88610006 6 Heart murmur 7 Heart murmur (finding) 8 Heart murmur 9 C0018808
alternative label: murmurs
alternative label: heart murmuring
alternative label: murmuring
alternative label: Murmur

Heart functions
type: Class
subclass of: Cardiovascular system function (Body measurement)
comment: 1 MD05833 2 Heart functions 3 None 4 Heart functions 5 739122008 6 heart function 7 Cardiac physiological function (observable entity) 8 Heart functions 9 C0232164

Heart rate range
type: Class
subclass of: Cardiovascular system function (Body measurement)
comment: 1 MD01907 2 Heart rate range 3 None 4 Heart rate range 5 364075005 6 Heart rate 7 Heart rate (observable entity) 8 heart rate 9 C0018810

Heart rate variability
type: Class
subclass of: Cardiovascular system function (Body measurement)
comment: 1 MD01784 2 Heart rate variability 3 None 4 Heart rate variability 5 361134000 6 Alteration in heart rate 7 Alteration in heart rate (finding) 8 Alteration in heart rate (finding) 9 C0232189
comment: 1 MD01784-1 2 Heart rate variability 3 None 4 Heart rate variability 5 251671002 6 Fetal heart rate variability 7 Fetal heart rate variability (observable entity) 8 Fetal heart rate variability - finding 9 C1287858

Heart rhythm
type: Class
subclass of: Cardiovascular system function (Body measurement)
comment: 1 MD05835 2 Heart rhythm 3 None 4 Heart rhythm 5 301112006 6 finding of heart rhythm 7 Finding of heart rhythm (finding) 8 Heart rhythm 9 C0232187

Heart transplant
type: Class
subclass of: Cardiovascular system function (Therapy)
comment: 1 MD00265 2 Heart transplant 3 None 4 Heart transplant 5 32413006 6 Heart transplant 7 Transplantation of heart (procedure) 8 Heart Transplantation 9 C0018823

Heartburn acidity
type: Class
subclass of: Digestive function (Body measurement)
comment: 1 M02733 2 Heartburn acidity 3 None 4 Heartburn acidity 5 178960009 6 Gastric acidity 7 Gastric acidity, function (observable entity) 8 Heartburn acidity 9 C0847097

Heat therapy with hot packs
type: Class
subclass of: Cardiovascular system function (Therapy)
comment: 1 M02679 2 Heat therapy with hot packs 3 None 4 Heat therapy with hot packs 5 398074008 6 Therapy with hot packs 7 Heat therapy (procedure) 8 Thermotherapy with hot packs 9 C0695361

Heavy cigarette smoker
type: Class
subclass of: Sub-Cultural Level
comment: 1 M00106 2 Heavy cigarette smoker 3 None 4 Heavy cigarette smoker 5 230063004 6 Heavy cigarette smoker 7 Heavy cigarette smoker (finding) 8 Heavy cigarette smoker 9 C0459847

Heavy drinker
type: Class
subclass of: Sub-Cultural Level
comment: 1 M00010 2 Heavy drinker 3 None 4 Heavy drinker 5 86933000 6 Heavy drinker 7 Heavy drinker (finding) 8 Alcoholic beverage heavy drinker 9 C0337678

Heavy equipment
type: Class
subclass of: Equipment
comment: 1 MD05044 2 Heavy equipment 3 None 4 Heavy equipment 5 246137000 6 Equipment 7 Equipment (attribute) 8 Equipment 9 C0014672

Heavy feeling
type: Class
subclass of: Hospital information, examination/diagnosis/treatment data
comment: 1 M00497 2 Heavy feeling 3 Heaviness sensation feel heavy feeling heavy feels heavy Heaviness sensation 4 Heavy feeling 5 161874006 6 Heavy feeling 7 Heavy feeling (finding) 8 Heavy feeling 9 C0581912
alternative label: Heaviness sensation
alternative label: feeling heavy
alternative label: feels heavy
alternative label: feel heavy

Help is also needed if you use a taxi or a private car
type: Class
subclass of: Questionnaire
comment: 1 MD05259 2 Help is also needed if you use a taxi or a private car 3 None 4 Help is also needed if you use a taxi or a private car 5 273389003 6 Daily activities questionnaire 7 Daily activities questionnaire (assessment scale) 8 questionnaire 9 C0034394

Hemodialysis
type: Class
subclass of: Hospital information, examination/diagnosis/treatment data
comment: 1 MD00118 2 Hemodialysis 3 None 4 Hemodialysis 5 302497006 6 Hemodialysis 7 Hemodialysis (procedure) 8 Hemodialysis 9 C0019004

Hemoglobin A1C
type: Class
subclass of: Functions of Blood System, Metabolic system and Endocrine system (Body measurement)
comment: 1 MD03065 2 Hemoglobin A1C 3 None 4 Hemoglobin A1C 5 43396009 6 Hemoglobin A1c measurement 7 Hemoglobin A1c measurement (procedure) 8 Hemoglobin A1c measurement 9 C0474680

Hemophilia
type: Class
subclass of: Hospital information, examination/diagnosis/treatment data
comment: 1 MD00253 2 Hemophilia 3 None 4 Hemophilia 5 90935002 6 Hemophilia 7 Hemophilia (disorder) 8 Hemophilia, NOS 9 C0684275
comment: 1 MD00253-1 2 Hemophilia 3 None 4 Hemophilia 5 90935002 6 Hemophilia 7 Hemophilia (disorder) 8 Hemophilia - specialty 9 C1321589
comment: 1 MD00253-2 2 Hemophilia 3 None 4 Hemophilia 5 408442008 6 Hemophilia 7 Hemophilia - specialty (qualifier value) 8 Hemophilia, NOS 9 C0684275
comment: 1 MD00253-3 2 Hemophilia 3 None 4 Hemophilia 5 408442008 6 Hemophilia 7 Hemophilia - specialty (qualifier value) 8 Hemophilia - specialty 9 C1321589

Hemoptysis
type: Class
subclass of: Respiratory function (Symptom)
comment: 1 M01112 2 Hemoptysis 3 Hemoptyses 4 Hemoptysis 5 66857006 6 Hemoptysis 7 Hemoptysis (finding) 8 Hemoptysis 9 C0019079
alternative label: Hemoptyses

Henry
type: Class
subclass of: Units
comment: 1 M04687 2 Henry 3 None 4 Henry 5 304612009 6 henry 7 henry (qualifier value) 8 henry 9 C0582517

HepatitisB
type: Class
subclass of: Digestive function (Symptom)
comment: 1 MD00945 2 Hepatitis B 3 None 4 Hepatitis B 5 66071002 6 Hepatitis B 7 Viral hepatitis type B (disorder) 8 Hepatitis B 9 C0019163

Hepatitis A
type: Class
subclass of: Hospital information, examination/diagnosis/treatment data
comment: 1 MD00973 2 Hepatitis A 3 None 4 Hepatitis A 5 40468003 6 Hepatitis A 7 Viral hepatitis, type A (disorder) 8 Hepatitis A 9 C0019159

Hepatitis B-antigen carrier
type: Class
subclass of: Hospital information, examination/diagnosis/treatment data
comment: 1 MD00808 2 Hepatitis B-antigen carrier 3 None 4 Hepatitis B-antigen carrier 5 235871004 6 Hepatitis B carrier (finding) 7 Hepatitis B carrier (finding) 8 Hepatitis B carrier (finding) 9 C0262505

Hereditary motor
type: Class
subclass of: Hospital information, examination/diagnosis/treatment data
comment: 1 MD00417 2 Hereditary motor 3 None 4 Hereditary motor 5 49793008 6 Hereditary motor neuron disease 7 Hereditary motor neuron disease (disorder) 8 Hereditary Motor Neuronopathy 9 C3661519

Hertz
type: Class
subclass of: Units
comment: 1 M04337 2 Hertz 3 Hz Herz 4 Hertz 5 259025008 6 hertz 7 Hertz (qualifier value) 8 hertz 9 C0439482
alternative label: Hz
alternative label: Herz

Hiccup
type: Class
subclass of: Respiratory function (Symptom)
comment: 1 M01122 2 Hiccup 3 Hiccough, HICCOUGH, Hiccough symptom, hiccoughing, HICCOUGHS, hiccuping, Hiccups, Observation of hiccoughs 4 Hiccup 5 65958008 6 Hiccough 7 Hiccoughs (finding) 8 Hiccoughs 9 C0019521
alternative label: Hiccough symptom
alternative label: HICCOUGHS
alternative label: Hiccups
alternative label: Observation of hiccoughs
alternative label: Hiccough
alternative label: hiccoughing
alternative label: hiccuping

Hidropoiesis
type: Class
subclass of: Sensory function, Pain and Skin function (Symptom)
comment: 1 M01424 2 Hidropoiesis 3 Hidrosis 4 Hidropoiesis 5 415691001 6 Hidropoiesis 7 Sweating, function (observable entity) 8 Hidropoiesis 9 C0038990
alternative label: Hidrosis

High
type: Class
subclass of: Units
comment: 1 MD01882 2 High 3 None 4 High 5 75540009 6 High 7 High (qualifier value) 8 High 9 C0205250

High Power Field
type: Class
subclass of: Units
comment: 1 M05099 2 High Power Field 3 None 4 High Power Field 5 767525000 6 unit 7 Unit (qualifier value) 8 Unit 9 C0439169

High Protein Diet
type: Class
subclass of: Nutritional management
comment: 1 MD02030 2 High Protein Diet 3 None 4 High Protein Diet 5 14627000 6 High protein diet 7 Increased protein diet (finding) 8 Diet, High-Protein 9 C0425403

High Walker
type: Class
subclass of: Equipment
comment: 1 MD04377 2 High Walker 3 None 4 High Walker 5 705406009 6 Walker 7 Walker (physical object) 8 Walker 9 C0043016

High blood pressure
type: Class
subclass of: Cardiovascular system function (Symptom)
comment: 1 M00499 2 High blood pressure 3 blood high pressure, Increased blood pressure 4 High blood pressure 5 38341003 6 High blood pressure 7 Hypertensive disorder, systemic arterial (disorder) 8 High blood pressure 9 C0020538
alternative label: Increased blood pressure
alternative label: blood high pressure

High density lipoprotein
type: Class
subclass of: Functions of Blood System, Metabolic system and Endocrine system (Body measurement)
comment: 1 MD00029 2 HDL 3 None 4 High density lipoprotein 5 94220009422000 6 High density lipoprotein 7 High density lipoprotein (substance) 8 High Density Lipoproteins 9 C0023821
comment: 1 MD00029-1 2 HDL 3 None 4 High density lipoprotein 5 17888004 6 High density lipoprotein measurement 7 High density lipoprotein measurement (procedure) 8 High Density Lipoproteins 9 C0023821

High humidity
type: Class
subclass of: Physical/Chemical Environment
comment: 1 M00250 2 High humidity 3 High humidity - physical agent 4 High humidity 5 86508006 6 High humidity 7 High humidity (physical force) 8 High humidity 9 C0337007
alternative label: High humidity - physical agent

High level of physical functioning
type: Class
subclass of: Questionnaire
comment: 1 MD04733 2 High level of physical functioning 3 None 4 High level of physical functioning 5 258395000 6 Levels 7 Levels (qualifier value) 8 level of functioning 9 C0935587

Higher-level cognitive functions
type: Class
subclass of: Nervous system and Mental function (Body measurement)
comment: 1 MD05687 2 Higher-level cognitive functions 3 None 4 Higher-level cognitive functions 5 311465003 6 Cognitive functions 7 Cognitive functions (observable entity) 8 Higher-level cognitive functions 9 C2370894

Higher education
type: Class
subclass of: Individual Related Factors
comment: 1 MD06515 2 Higher education 3 None 4 Higher education 5 161122005 6 Higher education 7 Higher education (finding) 8 Higher education 9 C0424933
comment: 1 MD06515-1 2 Higher education 3 None 4 Higher education 5 161122005 6 Higher education 7 Higher education (finding) 8 Higher education 9 C2584301
alternative label: highest score
alternative label: Higher-level cognitive functions, unspecified

Hind limb
type: Class
subclass of: Musculoskeletal function (Body region)
comment: 1 M02399 2 Hind limb 3 None 4 Hind limb 5 66019005 6 Limb 7 Limb structure (body structure) 8 Hindlimb 9 C1522391

Hip Abduction
type: Class
subclass of: Musculoskeletal function (Body measurement)
comment: 1 MD04284 2 Hip Abduction 3 None 4 Hip Abduction 5 299261001 6 Range of hip abduction 7 Range of hip abduction (observable entity) 8 Range of hip abduction - finding 9 C1288086

Hip Extension
type: Class
subclass of: Musculoskeletal function (Body measurement)
comment: 1 MD04283 2 Hip Extension 3 None 4 Hip Extension 5 299250009 6 Range of hip extension 7 Range of hip extension (observable entity) 8 Range of hip extension 9 C0576014

Hip Flexion
type: Class
subclass of: Musculoskeletal function (Body measurement)
comment: 1 MD04282 2 Hip Flexion 3 None 4 Hip Flexion 5 299239006 6 Range of hip flexion 7 Range of hip flexion (observable entity) 8 Range of hip flexion - finding 9 C1288079

Hip exercises
type: Class
subclass of: Limb
comment: 1 M00293 2 Hip exercises 3 exercises hip, exercises hips, hip exercise 4 Hip exercises 5 229153008 6 Hip exercises 7 Hip exercises (regime/therapy) 8 Hip exercises 9 C0454362
alternative label: exercises hip
alternative label: exercises hips
alternative label: hip exercise

Hip exercises in water
type: Class
subclass of: Active exercise
comment: 1 M00294 2 Hip exercises in water 3 None 4 Hip exercises in water 5 229189000 6 Hip exercises in water 7 Hip exercises in water (regime/therapy) 8 Hip exercises in water 9 C0454398

Hip hitching exercise
type: Class
subclass of: Active exercise
comment: 1 M00295 2 Hip hitching exercise 3 None 4 Hip hitching exercise 5 229143007 6 Hip hitching exercise 7 Hip hitching exercise (regime/therapy) 8 Hip hitching exercise 9 C0454353

Hip pendular exercises
type: Class
subclass of: Active exercise
comment: 1 M00296 2 Hip pendular exercises 3 None 4 Hip pendular exercises 5 229154002 6 Hip pendular exercises 7 Hip pendular exercises (regime/therapy) 8 Hip pendular exercises 9 C0454363

Hip structure
type: Class
subclass of: Musculoskeletal function (Body region)
comment: 1 M01574 2 Hip structure 3 Hip region structure 4 Hip structure 5 29836001 6 Hip region structure 7 Hip region structure (body structure) 8 Hip structure 9 C0019552
alternative label: Hip region structure

Hobbies
type: Class
subclass of: Individual Related Factors
comment: 1 MD05327 2 Hobbies 3 None 4 Hobbies 5 300758009 6 Engages in a hobby 7 Does engage in a hobby (finding) 8 Hobbies 9 C0019826

Hockey
type: Class
subclass of: Sport
comment: 1 M00410 2 hockey 3 None 4 Hockey 5 414251002 6 Hockey 7 Field hockey (qualifier value) 8 Field Hockey 9 C0016074

Home care
type: Class
subclass of: Hospital information, examination/diagnosis/treatment data
comment: 1 MD00519 2 Home care 3 None 4 Home care 5 60689008 6 home care of patient 7 Home care of patient (regime/therapy) 8 home care of patient 9 C0204977

Homeopathic Dilution Unit
type: Class
subclass of: Units
comment: 1 M05271 2 Homeopathic Dilution Unit 3 Homeopathic Dilution 4 Homeopathic Dilution Unit 5 767525000 6 unit 7 Unit (qualifier value) 8 Unit 9 C0439178
alternative label: Homeopathic Dilution

Hook
type: Class
subclass of: Tool
comment: 1 MD04102 2 Hook 3 None 4 Hook 5 260883005 6 Hook 7 Hook (attribute) 8 Hook 9 C0181209

Hook Grasp
type: Class
subclass of: Health Related Factors
comment: 1 MD04101 2 Hook Grasp 3 None 4 Hook Grasp 5 242899004 6 Grasped with hand 7 Grasped with hand (event) 8 grasp 9 C0220843

Hospital level or higher
type: Class
subclass of: Classification of Hospital
comment: 1 MD00232 2 Hospital level or higher 3 None 4 Hospital level or higher 5 568291000005106 6 Hospital unit 7 Hospital unit (environment) 8 Hospital Units 9 C0019988

Hospitalizations
type: Class
subclass of: Hospital information, examination/diagnosis/treatment data
comment: 1 MD03050 2 Hospitalizations 3 None 4 Hospitalizations 5 1172821006 6 Hospital care 7 Hospital care (regime/therapy) 8 Hospitalization 9 C0019993

Hot pack treatment
type: Class
subclass of: Cardiovascular system function (Therapy)
comment: 1 M02680 2 Hot pack treatment 3 Thermotherapy with hot packs Hot packs - therapy HP - Hot pack therapy Therapy with hot packs 4 Hot pack treatment 5 398074008 6 Hot packs - therapy 7 Thermotherapy with hot packs (regime/therapy) 8 Thermotherapy with hot packs 9 C0695361
alternative label: HP - Hot pack therapy
alternative label: Therapy with hot packs
alternative label: Thermotherapy with hot packs
alternative label: Hot packs - therapy

Houghton score questions
type: Class
subclass of: Tool
comment: 1 MD04718 2 Houghton score questions 3 None 4 Houghton score questions 5 278061009 6 Scores 7 Scores (qualifier value) 8 Score 9 C0449820

Hour
type: Class
subclass of: Time patterns
comment: 1 M03771 2 Hour 3 hrs hr hours 4 Hour 5 258702006 6 hour 7 hour (qualifier value) 8 hour 9 C0439227
alternative label: hours
alternative label: hr
alternative label: hrs

Housing policies
type: Class
subclass of: Public Policy Factors
comment: 1 MD06731 2 Housing policies 3 None 4 Housing policies 5 276339004 6 environment 7 Environment (environment) 8 Housing policies 9 C2371762

Housing services
type: Class
subclass of: Public Policy Factors
comment: 1 MD06729 2 Housing services 3 None 4 Housing services 5 224930009 6 services 7 Services (qualifier value) 8 Housing services 9 C2584333

Housing systems
type: Class
subclass of: Public Policy Factors
comment: 1 MD06730 2 Housing systems 3 None 4 Housing systems 5 246333005 6 system 7 System (attribute) 8 Housing systems 9 C2371761

Human-caused events
type: Class
subclass of: Characteristics of the community
comment: 1 MD06660 2 Human-caused events 3 None 4 Human-caused events 5 272379006 6 Event 7 Event (event) 8 Human-caused events 9 C2371698

Human immunodeficiency virus
type: Class
subclass of: Hospital information, examination/diagnosis/treatment data
comment: 1 MD00047 2 Human immunodeficiency virus 3 None 4 Human immunodeficiency virus 5 19030005 6 Human immunodeficiency virus 7 Human immunodeficiency virus (organism) 8 HIV 9 C0019682

Human rights
type: Class
subclass of: Individual Related Factors
comment: 1 MD06563 2 Human rights 3 None 4 Human rights 5 225792003 6 Knows rights 7 Knows rights (finding) 8 Human rights 9 C0020138

Humanistic and integrative therapy
type: Class
subclass of: Nervous system and Mental function (Therapy)
comment: 1 M00633 2 Humanistic and integrative therapy 3 None 4 Humanistic and integrative therapy 5 302243009 6 Humanistic and integrative therapy 7 Humanistic and integrative therapy (regime/therapy) 8 Humanistic and integrative therapy 9 C0579056

Humanistic psychotherapy
type: Class
subclass of: Nervous system and Mental function (Therapy)
comment: 1 M00610 2 Humanistic psychotherapy 3 Nonoe 4 Humanistic psychotherapy 5 304825004 6 Humanistic psychotherapy 7 Humanistic psychotherapy (regime/therapy) 8 Humanistic psychotherapy 9 C0542307

Humidification therapy
type: Class
subclass of: Digestive function (Therapy)
comment: 1 M00598 2 Humidification therapy 3 Humidifying inhalation therapy 4 Humidification therapy 5 243130008 6 Humidification therapy 7 Humidification therapy (regime/therapy) 8 Humidification therapy 9 C0418987
alternative label: Humidifying inhalation therapy

Humidity
type: Class
subclass of: Physical/Chemical Environment
comment: 1 M00249 2 Humidity 3 Humidities, Humidity - physical agent 4 Humidity 5 3525006 6 Humidity 7 Humidity (physical force) 8 Humidity 9 C0020167
alternative label: Humidity - physical agent
alternative label: Humidities

Hundred International Units per Milliliter
type: Class
subclass of: Units
comment: 1 M05438 2 Hundred International Units per Milliliter 3 None 4 Hundred International Units per Milliliter 5 767525000 6 unit 7 Unit (qualifier value) 8 Unit 9 C0439189

Hydration
type: Class
subclass of: Health Related Factors
comment: 1 MD01128 2 Hydration 3 None 4 Hydration 5 405006006 6 Hydration 7 Hydration status (observable entity) 8 Hydration status 9 C1321013

Hydrogen-ion concentration
type: Class
subclass of: Units
comment: 1 M02158 2 Hydrogen-ion concentration 3 pH hydrogen-Ion concentration (pH) hydrogen ion concentration 4 Hydrogen-ion concentration 5 27327002 6 hydrogen ion concentration 7 Hydrogen ion concentration (observable entity) 8 Hydrogen-Ion Concentration 9 C0020283

Hydrotherapy
type: Class
subclass of: Sensory function, Pain and Skin function (Therapy)
comment: 1 M00597 2 Hydrotherapy 3 Hydrotherapy regimes Hydrotherapy relaxation HYDROTHER Hydrotherapies 4 Hydrotherapy 5 46903006 6 Hydrotherapy 7 Hydrotherapy (regime/therapy) 8 Hydrotherapy 9 C0020311
alternative label: Hydrotherapy regimes
alternative label: HYDROTHER
alternative label: Hydrotherapy relaxation
alternative label: Hydrotherapies

Hypacusis
type: Class
subclass of: Body functions of disability
comment: 1 MD02931 2 Hypacusis 3 None 4 Hypacusis 5 15188001 6 Hypoacusis 7 Hearing loss (disorder) 8 hearing impairment 9 C1384666

Hyperalimentation
type: Class
subclass of: Nutritional status
comment: 1 M01274 2 Hyperalimentation 3 hyperalimentation therapy 4 Hyperalimentation 5 183026009 6 Hyperalimentation 7 Hyperalimentation (product) 8 Hyperalimentation 9 C0030548
comment: 1 M01274-1 2 Hyperalimentation 3 hyperalimentation therapy 4 Hyperalimentation 5 183026009 6 Hyperalimentation 7 Hyperalimentation (product) 8 Hyperalimentation 9 C1368829
comment: 1 M01274-2 2 Hyperalimentation 3 hyperalimentation therapy 4 Hyperalimentation 5 225372007 6 Hyperalimentation 7 Total parenteral nutrition (regime/therapy) 8 Hyperalimentation 9 C0030548
comment: 1 M01274-3 2 Hyperalimentation 3 hyperalimentation therapy 4 Hyperalimentation 5 225372007 6 Hyperalimentation 7 Total parenteral nutrition (regime/therapy) 8 Hyperalimentation 9 C1368829
alternative label: hyperalimentation therapy

Hyperlipidemia
type: Class
subclass of: Functions of Blood System, Metabolic system and Endocrine system (Symptom)
comment: 1 MD00805 2 Hyperlipidemia 3 None 4 Hyperlipidemia 5 55822004 6 Hyperlipidemia 7 Hyperlipidemia (disorder) 8 Hyperlipidemia 9 C0020473

Hyperpiesis
type: Class
subclass of: Cardiovascular system function (Symptom)
comment: 1 M01139 2 Hyperpiesis 3 Hyperpiesia 4 Hyperpiesis 5 38341003 6 Hypertension 7 Hypertensive disorder, systemic arterial (disorder) 8 Hypertensive disease 9 C0020538
alternative label: Hyperpiesia

Hyperpyrexia
type: Class
subclass of: Immune system function (Symptom)
comment: 1 M00154 2 Hyperpyrexia 3 None 4 Hyperpyrexia 5 409702008 6 Hyperpyrexia 7 Hyperpyrexia (finding) 8 Hyperpyrexia 9 C0392676

Hypersensitivity reactions
type: Class
subclass of: Immune system function (Body measurement)
comment: 1 MD05866 2 Hypersensitivity reactions 3 None 4 Hypersensitivity reactions 5 421961002 6 Hypersensitivity reaction 7 Hypersensitivity reaction (disorder) 8 Hypersensitivity reactions 9 C0020517

Hypersomnia
type: Class
subclass of: Nervous system and Mental function (Symptom)
comment: 1 M02757 2 Hypersomnia 3 Hypersomnias 4 Hypersomnia 5 77692006 6 Hypersomnia 7 Hypersomnia (disorder) 8 Hypersomnia 9 C0917799
alternative label: Hypersomnias

Hypertensive disorder
type: Class
subclass of: Cardiovascular system function (Symptom)
comment: 1 M01143 2 Hypertensive disorder 3 Hypertensive disease 4 Hypertensive disorder 5 38341003 6 Hypertensive disorder 7 Hypertensive disorder, systemic arterial (disorder) 8 Hypertensive disease 9 C0020538
alternative label: Hypertensive disease

Hypertensive vascular degeneration
type: Class
subclass of: Cardiovascular system function (Symptom)
comment: 1 M01144 2 Hypertensive vascular degeneration 3 None 4 Hypertensive vascular degeneration 5 38341003 6 Hypertensive vascular degeneration 7 Hypertensive disorder, systemic arterial (disorder) 8 Hypertensive disease 9 C0020538

Hypertensive vascular disease
type: Class
subclass of: Cardiovascular system function (Symptom)
comment: 1 M01145 2 Hypertensive vascular disease 3 None 4 Hypertensive vascular disease 5 38341003 6 Hypertensive vascular disease 7 Hypertensive disorder, systemic arterial (disorder) 8 Hypertensive disease 9 C0020538

Hyperthermia
type: Class
subclass of: Immune system function (Symptom)
comment: 1 M00155 2 Hyperthermia 3 Hyperthermias, hyperthermic, Hyperthermia - disorder 4 Hyperthermia 5 1197782006 6 Hyperthermia 7 Hyperthermia (disorder) 8 Hyperthermia 9 C5232927
alternative label: Hyperthermias
alternative label: Organic sleep disorders
alternative label: hyperthermic

Hypertrichoses
type: Class
subclass of: Sensory function, Pain and Skin function (Symptom)
comment: 1 M01166 2 Hypertrichoses 3 Hypertrichiasis 4 Hypertrichoses 5 29966009 6 Hypertrichosis 7 Hypertrichosis (disorder) 8 Hypertrichosis 9 C0020555
alternative label: Hypertrichiasis

Hypertrichosis
type: Class
subclass of: Sensory function, Pain and Skin function (Symptom)
comment: 1 M01167 2 Hypertrichosis 3 Hirsutism - hypertrichosis 4 Hypertrichosis 5 29966009 6 Hypertrichosis 7 Hypertrichosis (disorder) 8 Hypertrichosis 9 C0020555
alternative label: Hirsutism - hypertrichosis

Hyperventilating
type: Class
subclass of: Respiratory function (Symptom)
comment: 1 M01176 2 Hyperventilation 3 HV - Hyperventilation hyperventilate hyperventilate hyperventilated hyperventilates Hyperventilations 4 Hyperventilating 5 68978004 6 Hyperventilating 7 Hyperventilation (finding) 8 Hyperventilation 9 C0020578

Hyperventilations
type: Class
subclass of: Respiratory function (Symptom)
comment: 1 M01177 2 Hyperventilation 3 HV - Hyperventilation hyperventilate hyperventilate hyperventilated hyperventilates Hyperventilating 4 Hyperventilations 5 68978004 6 Hyperventilation 7 Hyperventilation (finding) 8 Hyperventilation 9 C0020578

Hypochondrial Region
type: Class
subclass of: Musculoskeletal function (Body region)
comment: 1 M00696 2 Hypochondrial Region 3 None 4 Hypochondrial Region 5 271853005 6 Hypochondrial pain 7 Hypochondrial pain (finding) 8 Hypochondrial pain 9 C0476305

Hypogastric
type: Class
subclass of: Digestive function (Body region)
comment: 1 M01659 2 Hypogastric 3 Hypogastric Region, Hypogastrium, Hypogastric part of abdomen, Hypogastric region structure 4 Hypogastric 5 245357003 6 Hypogastric node 7 Structure of internal iliac node (body structure) 8 Structure of hypogastric nerves 9 Structure of hypogastric nerves
alternative label: Hypogastric region structure
alternative label: Hypogastric part of abdomen
alternative label: Hypogastrium
alternative label: Hypogastric Region

Hypopiesis
type: Class
subclass of: Cardiovascular system function (Symptom)
comment: 1 M01200 2 Hypopiesis 3 Hypotension, hypotension arterial 4 Hypopiesis 5 45007003 6 Hypopiesis 7 Low blood pressure (disorder) 8 Hypotension 9 C0020649
alternative label: hypotension arterial
alternative label: Hypotension

Hypoplastic
type: Class
subclass of: Cardiovascular system function (Symptom)
comment: 1 MD00366 2 Hypoplastic 3 None 4 Hypoplastic 5 55199003 6 Hypoplasia 7 Hypoplasia (morphologic abnormality) 8 Hypoplasia 9 C0243069

Hypothermia
type: Class
subclass of: Immune system function (Symptom)
comment: 1 M00157 2 Hypothermia 3 None 4 Hypothermia 5 386689009 6 Hypothermia 7 Hypothermia (finding) 8 Hypothermia, natural 9 C0020672

IADL sorting
type: Class
subclass of: Tool
comment: 1 MD05337 2 IADL sorting 3 None 4 IADL sorting 5 129063003 6 IADL 7 Instrumental activity of daily living (finding) 8 Instrumental activities of daily living 9 C1290928

IMP
type: Class
subclass of: Units
comment: 1 M05292 2 IMP 3 None 4 IMP 5 118580000 6 IMP 7 Impression AND/OR interpretation of study (property) (qualifier value) 8 IMP 9 C1264692

IMU
type: Class
subclass of: Equipment
comment: 1 MD03162 2 IMU 3 None 4 IMU 5 50643003 6 Imu 7 Latah (disorder) 8 Imu 9 C0270602

IN
type: Class
subclass of: Units
comment: 1 M03732 2 IN 3 None 4 IN 5 18720000 6 In 7 In (attribute) 8 In 9 C0332285

INCREASED SLEEPING
type: Class
subclass of: Nervous system and Mental function (Symptom)
comment: 1 M02760 2 INCREASED SLEEPING 3 increased sleep 4 INCREASED SLEEPING 5 77692006 6 Excessive sleep 7 Hypersomnia (disorder) 8 Hypersomnia 9 C0917799
alternative label: increased sleep

INHAL INJ SMOKE
type: Class
subclass of: Sub-Cultural Level
comment: 1 M01399 2 INHAL INJ SMOKE 3 INJ SMOKE INHAL, SMOKE INHAL INJ INHAL INJ SMOKE 5 426936004 6 Smoke inhalation injury 7 Smoke inhalation injury (disorder) 8 Smoke inhalation injury 9 C0037367

INJ SMOKE INHAL
type: Class
subclass of: Sub-Cultural Level
comment: 1 M01400 2 INHAL INJ SMOKE 3 SMOKE INHAL INJ 4 INJ SMOKE INHAL 5 426936004 6 Smoke inhalation injury 7 Smoke inhalation injury (disorder) 8 Smoke inhalation injury 9 C0037367

IP
type: Class
subclass of: Musculoskeletal function (Body region)
comment: 1 MD04030 2 IP 3 None 4 IP 5 732165008 6 Entire interphalangeal joint 7 Entire interphalangeal joint (body structure) 8 Entire interphalangeal joint 9 C4517060

IP Flexion
type: Class
subclass of: Musculoskeletal function (Body measurement)
comment: 1 MD04029 2 IP Flexion 3 None 4 IP Flexion 5 299063008 6 Range of finger flexion 7 Range of finger flexion (observable entity) 8 Range of finger flexion 9 C0575831

IU per unit mass
type: Class
subclass of: Units
comment: 1 M03167 2 international units per unit mass 3 None 4 IU per unit mass 5 282352002 6 IU per unit mass 7 International units per unit mass (qualifier value) 8 IU per unit mass 9 C0560245

IU per unit volume
type: Class
subclass of: Units
comment: 1 M03164 2 international units per unit volume 3 None 4 IU per unit volume 5 282349005 6 IU per unit volume 7 International units per unit volume (qualifier value) 8 IU per unit volume 9 C0560242

I do it alone without any difficulties
type: Class
subclass of: Questionnaire
comment: 1 MD05251 2 I do it alone without any difficulties 3 None 4 I do it alone without any difficulties 5 273389003 6 Daily activities questionnaire 7 Daily activities questionnaire (assessment scale) 8 questionnaire 9 C0034394

I do not do but wish to do
type: Class
subclass of: Questionnaire
comment: 1 MD05347 2 I do not do but wish to do 3 None 4 I do not do but wish to do 5 717896003 6 Does not 7 Does not (qualifier value) 8 Does not 9 C1299585

I do now with difficulty
type: Class
subclass of: Questionnaire
comment: 1 MD05345 2 I do now with difficulty 3 None 4 I do now with difficulty 5 371157007 6 Difficulty 7 Able with difficulty (qualifier value) 8 Difficult (qualifier value) 9 C0332218

I do now with no problem
type: Class
subclass of: Questionnaire
comment: 1 MD05343 2 I do now with no problem 3 None 4 I do now with no problem 5 373067005 6 No 7 No (qualifier value) 8 No 9 C1298908

I only call a few numbers I know very well
type: Class
subclass of: Questionnaire
comment: 1 MD05227 2 I only call a few numbers I know very well 3 None 4 I only call a few numbers I know very well 5 273389003 6 Daily activities questionnaire 7 Daily activities questionnaire (assessment scale) 8 questionnaire 9 C0034394

I remember what I heard indirectly or what I saw on TV
type: Class
subclass of: Questionnaire
comment: 1 MD05322 2 I remember what I heard indirectly or what I saw on TV 3 None 4 I remember what I heard indirectly or what I saw on TV 5 273389003 6 Daily activities questionnaire 7 Daily activities questionnaire (assessment scale) 8 Daily activities questionnaire 9 C0451094

I tend to have a hobby sometimes
type: Class
subclass of: Questionnaire
comment: 1 MD05330 2 I tend to have a hobby sometimes 3 None 4 I tend to have a hobby sometimes 5 273389003 6 Daily activities questionnaire 7 Daily activities questionnaire (assessment scale) 8 Daily activities questionnaire 9 C0451094

I use public transportation to travel alone or drive by myself
type: Class
subclass of: Questionnaire
comment: 1 MD05257 2 I use public transportation to travel alone or drive by myself 3 None 4 I use public transportation to travel alone or drive by myself 5 273389003 6 Daily activities questionnaire 7 Daily activities questionnaire (assessment scale) 8 questionnaire 9 C0034394

Ice hockey
type: Class
subclass of: Sport
comment: 1 M00447 2 Ice hockey 3 ice hiking, hockey ice, Ice Hockeys 4 Ice hockey 5 414446006 6 Ice hockey 7 Ice hockey (qualifier value) 8 Ice hockey 9 C0020748
alternative label: hockey ice
alternative label: Ice Hockeys

Ice skating
type: Class
subclass of: Sport
comment: 1 MD01050 2 Ice skating 3 None 4 Ice skating 5 86025003 6 Ice skating 7 Ice skating (qualifier value) 8 Ice Skating (recreational activity) 9 C0020749

Idiopathic
type: Class
subclass of: Hospital information, examination/diagnosis/treatment data
comment: 1 MD00525 2 Idiopathic 3 None 4 Idiopathic 5 54690008 6 Idiopathic 7 Unknown (origin) (qualifier value) 8 Unknown (origin) (qualifier value) 9 C0332240

Imagination
type: Class
subclass of: Health Related Factors
comment: 1 MD00563 2 fancy 3 None 4 Imagination 5 247659005 6 imagination 7 Use of imagination (observable entity) 8 Imagination 9 C0020913

Imaging diagnosis
type: Class
subclass of: Hospital Administration
comment: 1 MD00155 2 Imaging diagnosis 3 None 4 Imaging diagnosis 5 308590000 6 Payment for service procedure 7 Payment for service procedure (procedure) 8 Diagnostic Imaging 9 C0011923

Imaging diagnosis and radiation therapy fee
type: Class
subclass of: Hospital Administration
comment: 1 MD00154 2 Imaging diagnosis and radiation therapy fee 3 None 4 Imaging diagnosis and radiation therapy fee 5 308590000 6 Payment for service procedure 7 Payment for service procedure (procedure) 8 Fees, Medical 9 C0015754

Imaging diagnosis fee
type: Class
subclass of: Hospital Administration
comment: 1 MD00204 2 Imaging diagnosis fee 3 None 4 Imaging diagnosis fee 5 308590000 6 Payment for service procedure 7 Payment for service procedure (procedure) 8 Diagnostic Imaging 9 C0011923

Immediate family
type: Class
subclass of: Characteristics of the community
comment: 1 MD06683 2 Immediate family 3 None 4 Immediate family 5 394854006 6 Immediate family member 7 Immediate family member (person) 8 Immediate family 9 C2371717

Immune response
type: Class
subclass of: Immune system function (Body measurement)
comment: 1 MD05861 2 Immune response 3 None 4 Immune response 5 35024006 6 Immune response 7 Immune response, function (observable entity) 8 Immune response 9 C0020964

Immunological system functions
type: Class
subclass of: Immune system function (Body measurement)
comment: 1 MD05860 2 Immunological system functions 3 None 4 Immunological system functions 5 106183005 6 immunologic function 7 Immunologic function (observable entity) 8 Immunological system functions 9 C2371094

Impaired coordination
type: Class
subclass of: Nervous system and Mental function (Symptom)
comment: 1 M02575 2 Impaired coordination 3 None 4 Impaired coordination 5 281016006 6 Abnormal coordination 7 Coordination problem (finding) 8 Abnormal coordination 9 C0520966

Implant
type: Class
subclass of: Units
comment: 1 M03465 2 Implant 3 None 4 Implant 5 40388003 6 Implant 7 Implant, device (physical object) 8 Implants 9 C0021102
comment: 1 M03465-1 2 Implant 3 None 4 Implant 5 40388003 6 Implant 7 Implant, device (physical object) 8 Drug Implant 9 C1704229
comment: 1 M03465-10 2 Implant - unit of product usage 3 Implant 4 Implant 5 732996003 6 Implant 7 Implant (unit of presentation) 8 Implants 9 C0021102
comment: 1 M03465-11 2 Implant - unit of product usage 3 Implant 4 Implant 5 732996003 6 Implant 7 Implant (unit of presentation) 8 Drug Implant 9 C1704229
comment: 1 M03465-12 2 Implant - unit of product usage 3 Implant 4 Implant 5 732996003 6 Implant 7 Implant (unit of presentation) 8 Administration via Implantation 9 C1711357
comment: 1 M03465-13 2 Implant - unit of product usage 3 Implant 4 Implant 5 732996003 6 Implant 7 Implant (unit of presentation) 8 Implant (unit of presentation) 9 C4319676
comment: 1 M03465-14 2 Implant - unit of product usage 3 Implant 4 Implant 5 732996003 6 Implant 7 Implant (unit of presentation) 8 Implant - dosing instruction imperative 9 C4721997
comment: 1 M03465-2 2 Implant 3 None 4 Implant 5 40388003 6 Implant 7 Implant, device (physical object) 8 Administration via Implantation 9 C1711357
comment: 1 M03465-3 2 Implant 3 None 4 Implant 5 40388003 6 Implant 7 Implant, device (physical object) 8 Implant (unit of presentation) 9 C4319676
comment: 1 M03465-4 2 Implant 3 None 4 Implant 5 40388003 6 Implant 7 Implant, device (physical object) 8 Implant - dosing instruction imperative 9 C4721997
comment: 1 M03465-5 2 Implant 3 None 4 Implant 5 827107003 6 Implant 7 Implant (administration method) 8 Implants 9 C0021102
comment: 1 M03465-6 2 Implant 3 None 4 Implant 5 827107003 6 Implant 7 Implant (administration method) 8 Drug Implant 9 C1704229
comment: 1 M03465-7 2 Implant 3 None 4 Implant 5 827107003 6 Implant 7 Implant (administration method) 8 Administration via Implantation 9 C1711357
comment: 1 M03465-8 2 Implant 3 None 4 Implant 5 827107003 6 Implant 7 Implant (administration method) 8 Implant (unit of presentation) 9 C4319676
comment: 1 M03465-9 2 Implant 3 None 4 Implant 5 827107003 6 Implant 7 Implant (administration method) 8 Implant - dosing instruction imperative 9 C4721997

Implant - unit of product usage
type: Class
subclass of: Units
comment: 1 M05291 2 Implant - unit of product usage 3 Implant 4 Implant - unit of product usage 5 428177008 6 Implant - unit of product usage 7 Implant - unit of product usage (qualifier value) 8 Implant - unit of product usage 9 C1705604

Improvements
type: Class
subclass of: Questionnaire
comment: 1 MD04464 2 Improvements 3 improvement 4 Improvements 5 390771008 6 Improvement of status 7 Improvement of status (qualifier value) 8 Improvement 9 C2986411

Impulse control
type: Class
subclass of: Nervous system and Mental function (Body measurement)
comment: 1 MD05634 2 Impulse control 3 None 4 Impulse control 5 1145228009 6 Impulse control 7 Impulse control (observable entity) 8 Impulse control 9 C0150632

In-Hand
type: Class
subclass of: Musculoskeletal function (Body region)
comment: 1 MD04635 2 In-Hand 3 None 4 In-Hand 5 85562004 6 Hand 7 Hand structure (body structure) 8 Hand 9 C0018563

In-Hand Manipulation
type: Class
subclass of: Health Related Factors
comment: 1 MD04112 2 In-Hand Manipulation 3 None 4 In-Hand Manipulation 5 119665008 6 Hand Manipulation 7 Hand manipulation (procedure) 8 Hand Manipulation 9 C0556796

Inch
type: Class
subclass of: Units
comment: 1 M03730 2 Inch 3 in - inch inches Inch International 4 Inch 5 258677007 6 Inch 7 Inch (qualifier value) 8 Inch 9 C0439204
alternative label: Inch International
alternative label: in - inch
alternative label: inches

Incoordination
type: Class
subclass of: Nervous system and Mental function (Symptom)
comment: 1 M02576 2 Incoordination 3 Incoordinations 4 Incoordination 5 281016006 6 Incoordination 7 Incoordination (finding) 8 Abnormal coordination 9 C0520966
alternative label: Incoordinations

Increase in body fat
type: Class
subclass of: Functions of Blood System, Metabolic system and Endocrine system (Body measurement)
comment: 1 M00148 2 Increase in body fat 3 None 4 Increase in body fat 5 248301008 6 Increase in body fat 7 Increase in body fat (finding) 8 Increase in body fat 9 C0424619

Increased frequency of urination
type: Class
subclass of: Frequency
comment: 1 M01563 2 Increased frequency of urination 3 frequency increased urination, increased frequency urination, Increased urinary frequency 4 Increased frequency of urination 5 162116003 6 Increased frequency of urination 7 Increased frequency of urination (finding) 8 Increased frequency of urination 9 C0042023
alternative label: frequency increased urination
alternative label: increased frequency urination
alternative label: Increased urinary frequency

Increased hair growth
type: Class
subclass of: Sensory function, Pain and Skin function (Symptom)
comment: 1 M00541 2 Increased hair growth 3 None 4 Increased hair growth 5 13724007 6 Increased hair growth 7 Increased hair growth (finding) 8 Increased hair growth 9 C0232410
alternative label: Increased frequency of micturition

Increased heart rate
type: Class
subclass of: Cardiovascular system function (Symptom)
comment: 1 M00495 2 Increased heart rate 3 high heart rate, fast heart beat, high pulse rate, HEART RATE INCREASED, HEARTBEATS INCREASED, Increased pulse rate, PULSE RATE INCREASED, Rapid heart beat, RAPID HEART RATE, Rapid pulse, RAPID HEARTBEAT 4 Increased heart rate 5 3424008 6 Heart rate fast 7 Tachycardia (finding) 8 Heart rate fast 9 C0039231
alternative label: high pulse rate
alternative label: high heart rate
alternative label: Increased pulse rate
alternative label: RAPID HEART RATE
alternative label: Rapid heart beat
alternative label: PULSE RATE INCREASED
alternative label: RAPID HEARTBEAT
alternative label: HEART RATE INCREASED
alternative label: Rapid pulse
alternative label: HEARTBEATS INCREASED

Increased jugular venous pressure
type: Class
subclass of: Cardiovascular system function (Symptom)
comment: 1 M02564 2 Increased jugular venous pressure 3 Raised jugular venous pressure 4 Increased jugular venous pressure 5 22447003 6 Raised jugular venous pressure 7 Raised jugular venous pressure (finding) 8 aised jugular venous pressure 9 C0520861

Increased nutritional requirement
type: Class
subclass of: Nutritional status
comment: 1 M00464 2 Increased nutritional requirement 3 None 4 Increased nutritional requirement 5 87276001 6 Nutritional status 7 Nutritional status (observable entity) 8 Increased nutritional requirement 9 C0520919

Increased tendency to bruise
type: Class
subclass of: Sensory function, Pain and Skin function (Symptom)
comment: 1 M02267 2 Increased tendency to bruise 3 None 4 Increased tendency to bruise 5 424131007 6 Increased tendency to bruise 7 Easy bruising (finding) 8 Increased tendency to bruise 9 C0423798

Independence
type: Class
subclass of: Questionnaire
comment: 1 MD05559 2 Independence 3 independent, Independency 4 Independence 5 371153006 6 Independent 7 Independent (qualifier value) 8 independency 9 C0599749
alternative label: Independency
alternative label: independent

Index Finger
type: Class
subclass of: Musculoskeletal function (Body region)
comment: 1 MD04037 2 Index Finger 3 None 4 Index Finger 5 83738005 6 Index finger 7 Index finger structure (body structure) 8 Index finger 9 C0230388

Index of refraction
type: Class
subclass of: Units
comment: 1 M03446 2 Index of refraction 3 N - index of refraction Index of refraction - unit 4 Index of refraction 5 419634001 6 Index of refraction 7 Index of refraction (qualifier value) 8 Index of refraction - unit 9 C1690967
comment: 1 M03446-1 2 Index of refraction 3 N - index of refraction Index of refraction - unit 4 Index of refraction 5 419634001 6 Index of refraction 7 Index of refraction (qualifier value) 8 visual index of refraction 9 C1706370
comment: 1 M03446-2 2 Index of refraction 3 N - index of refraction Index of refraction - unit 4 Index of refraction 5 420772006 6 Index of refraction 7 Index of refraction (observable entity) 8 Index of refraction - unit 9 C1690967
comment: 1 M03446-3 2 Index of refraction 3 N - index of refraction Index of refraction - unit 4 Index of refraction 5 420772006 6 Index of refraction 7 Index of refraction (observable entity) 8 visual index of refraction 9 C1706370
alternative label: Index of refraction - unit
alternative label: N - index of refraction

Individual
type: Class
subclass of: Questionnaire
comment: 1 MD05187 2 Individual 3 individual 4 Individual 5 125676002 6 Person 7 Person (person) 8 Individual 9 C0237401

Individual attitudes of extended family members
type: Class
subclass of: Individual Related Factors
comment: 1 MD06697 2 Individual attitudes of extended family members 3 None 4 Individual attitudes of extended family members 5 225464009 6 Attitude 7 Attitude (observable entity) 8 Individual attitudes of extended family members 9 C2371728

Individual attitudes of friends
type: Class
subclass of: Individual Related Factors
comment: 1 MD06698 2 Individual attitudes of friends 3 None 4 Individual attitudes of friends 5 225464009 6 Attitude 7 Attitude (observable entity) 8 Individual attitudes of friends 9 C2371729

Individual attitudes of health professionals
type: Class
subclass of: Individual Related Factors
comment: 1 MD06704 2 Individual attitudes of health professionals 3 None 4 Individual attitudes of health professionals 5 225464009 6 attitude 7 Attitude (observable entity) 8 Individual attitudes of health professionals 9 C2371735

Individual attitudes of immediate family members
type: Class
subclass of: Individual Related Factors
comment: 1 MD06696 2 Individual attitudes of immediate family members 3 None 4 Individual attitudes of immediate family members 5 225464009 6 Attitude 7 Attitude (observable entity) 8 Individual attitudes of immediate family members 9 C2371727

Individual attitudes of other professionals
type: Class
subclass of: Individual Related Factors
comment: 1 MD06705 2 Individual attitudes of other professionals 3 None 4 Individual attitudes of other professionals 5 225464009 6 attitude 7 Attitude (observable entity) 8 Individual attitudes of other professionals 9 C2372125

Individual attitudes of people in positions of authority
type: Class
subclass of: Individual Related Factors
comment: 1 MD06700 2 Individual attitudes of people in positions of authority 3 None 4 Individual attitudes of people in positions of authority 5 225464009 6 Attitude 7 Attitude (observable entity) 8 Individual attitudes of people in positions of authority 9 C2371731

Individual attitudes of people in subordinate positions
type: Class
subclass of: Individual Related Factors
comment: 1 MD06701 2 Individual attitudes of people in subordinate positions 3 None 4 Individual attitudes of people in subordinate positions 5 225464009 6 Attitude 7 Attitude (observable entity) 8 Individual attitudes of people in subordinate positions 9 C2371732

Individual attitudes of personal care providers and personal assistants
type: Class
subclass of: Individual Related Factors
comment: 1 MD06702 2 Individual attitudes of personal care providers and personal assistants 3 None 4 Individual attitudes of personal care providers and personal assistants 5 225464009 6 attitude 7 Attitude (observable entity) 8 Individual attitudes of personal care providers and personal assistants 9 C2371733

Individual attitudes of strangers
type: Class
subclass of: Individual Related Factors
comment: 1 MD06703 2 Individual attitudes of strangers 3 None 4 Individual attitudes of strangers 5 225464009 6 attitude 7 Attitude (observable entity) 8 Individual attitudes of strangers 9 C2371734

Individual psychotherapy
type: Class
subclass of: Nervous system and Mental function (Therapy)
comment: 1 M00611 2 Individual psychotherapy 3 None 4 Individual psychotherapy 5 18512000 6 Individual psychotherapy 7 Individual psychotherapy (regime/therapy) 8 Individual psychotherapy 9 C0204525

Individual swallowing and eating
type: Class
subclass of: Health Related Factors
comment: 1 MD05186 2 Individual swallowing and eating 3 None 4 Individual swallowing and eating 5 844005 6 Behavior finding 7 Behavior finding (finding) 8 Behavior 9 C0004927

Indoor air quality
type: Class
subclass of: Physical/Chemical Environment
comment: 1 MD06677 2 Indoor air quality 3 None 4 Indoor air quality 5 263496004 6 Quality 7 Quality (attribute) 8 Indoor air quality 9 C0085760

Indoor skating
type: Class
subclass of: Sport
comment: 1 MD01052 2 Indoor skating 3 None 4 Indoor skating 5 7529004 6 Skating 7 Skating (qualifier value) 8 skating 9 C0037247

Industrial machine
type: Class
subclass of: Classification of Hospital
comment: 1 MD00654 2 Industrial Medicine department 3 None 4 Industrial machine 5 20273004 6 Industrial machine 7 Industrial machine, device (physical object) 8 Industrial machine 9 C0337076

Inefficient performance
type: Class
subclass of: Questionnaire
comment: 1 MD05596 2 Inefficient performance 3 None 4 Inefficient performance 5 398166005 6 Performed 7 Performed (qualifier value) 8 Performance 9 C0597198

Infantile atrophy
type: Class
subclass of: Nervous system and Mental function (Symptom)
comment: 1 M01682 2 Infantile atrophy 3 Primary infantile atrophy 4 Infantile atrophy 5 29740003 6 Infantile atrophy 7 Nutritional marasmus (disorder) 8 Infantile atrophy 9 C0086588
alternative label: Primary infantile atrophy

Infectious Disease
type: Class
subclass of: Classification of Hospital
comment: 1 MD00684 2 infectology 3 None 4 Infectious Disease 5 40733004 6 Infectious disease (disorder) 7 Infectious disease (disorder) 8 Infectious Disease Medicine 9 C1273849

Inferior member
type: Class
subclass of: Musculoskeletal function (Body region)
comment: 1 M02402 2 Inferior member 3 None 4 Inferior member 5 61685007 6 Lower limb structure 7 Lower limb structure (body structure) 8 Lower extremity structure 9 C0023216

Inflammatory
type: Class
subclass of: Nervous system and Mental function (Symptom)
comment: 1 MD00334 2 Inflammatory 3 None 4 Inflammatory 5 257552002 6 Inflammation 7 Inflammation (qualifier value) 8 Inflammatory 9 C0333348

Informal associations
type: Class
subclass of: Individual Related Factors
comment: 1 MD06544 2 Informal associations 3 None 4 Informal associations 5 263534001 6 Association 7 Association (attribute) 8 Informal associations 9 C2371606

Informal education
type: Class
subclass of: Individual Related Factors
comment: 1 MD06511 2 Informal education 3 None 4 Informal education 5 409073007 6 Education (procedure) 7 Education (procedure) 8 Informal education 9 C0681345

Informal relationships with acquaintances
type: Class
subclass of: Individual Related Factors
comment: 1 MD06490 2 Informal relationships with acquaintances 3 None 4 Informal relationships with acquaintances 5 272151006 6 Relationships 7 Relationships (qualifier value) 8 Informal relationships with acquaintances 9 C2371561

Informal relationships with co-inhabitants
type: Class
subclass of: Individual Related Factors
comment: 1 MD06491 2 Informal relationships with co-inhabitants 3 None 4 Informal relationships with co-inhabitants 5 272151006 6 Relationships 7 Relationships (qualifier value) 8 Informal relationships with co-inhabitants 9 C2371562

Informal relationships with friends
type: Class
subclass of: Individual Related Factors
comment: 1 MD06488 2 Informal relationships with friends 3 None 4 Informal relationships with friends 5 272151006 6 Relationships 7 Relationships (qualifier value) 8 Informal relationships with friends 9 C2371559

Informal relationships with neighbours
type: Class
subclass of: Individual Related Factors
comment: 1 MD06489 2 Informal relationships with neighbours 3 None 4 Informal relationships with neighbours 5 272151006 6 Relationships 7 Relationships (qualifier value) 8 Informal relationships with neighbours 9 C2371560

Informal relationships with peers
type: Class
subclass of: Individual Related Factors
comment: 1 MD06492 2 Informal relationships with peers 3 None 4 Informal relationships with peers 5 272151006 6 Relationships 7 Relationships (qualifier value) 8 Informal relationships with peers 9 C2371563

Informal social relationships
type: Class
subclass of: Individual Related Factors
comment: 1 MD06487 2 Informal social relationships 3 None 4 Informal social relationships 5 272151006 6 Relationships 7 Relationships (qualifier value) 8 Informal social relationships 9 C2371558

Infraclavicular
type: Class
subclass of: Musculoskeletal function (Body region)
comment: 1 M01750 2 Infraclavicular 3 Infraclavicular Region, Infraclavicular region, structure, Infraclavicular part of chest, Infraclavicular region 4 Infraclavicular 5 20253009 6 Infraclavicular region 7 Infraclavicular region structure (body structure) 8 Infraclavicular region structure 9 C0230108
alternative label: Infraclavicular region structure
alternative label: Infraclavicular Region
alternative label: Infraclavicular part of chest
alternative label: Infraclavicular region

Infrared therapy
type: Class
subclass of: Hospital information, examination/diagnosis/treatment data
comment: 1 M01779 2 Infrared therapy 3 Infrared radiation therapy Infra-red therapy 4 Infrared therapy 5 169421008 6 Infrared therapy 7 Infrared radiation therapy (regime/therapy) 8 Infrared therapy 9 C0204032
alternative label: Infra-red therapy
alternative label: Infrared radiation therapy

Infrequent urination
type: Class
subclass of: Urogenital function (Symptom)
comment: 1 M00501 2 Infrequent urination 3 None 4 Infrequent urination 5 249291007 6 Infrequent urination 7 Infrequent urination (finding) 8 Infrequent urination 9 C0426377

Ingestion functions
type: Class
subclass of: Digestive function (Body measurement)
comment: 1 MD05907 2 Ingestion functions 3 None 4 Ingestion functions 5 111984006 6 Ingestion 7 Ingestion (observable entity) 8 Ingestion functions 9 C0232478

Inguinal Canal
type: Class
subclass of: Musculoskeletal function (Body region)
comment: 1 M00719 2 Inguinal Canal 3 Inguinal Region, Inguinal canal structure, Inguinal Canals, Inguinal, Inguen, Inguinal region structure 4 Inguinal Canal 5 90785001 6 Inguinal canal 7 Inguinal canal structure (body structure) 8 Inguinal canal 9 C0021445
alternative label: Inguinal canal structure
alternative label: Inguinal
alternative label: Inguinal Region
alternative label: Inguen
alternative label: Inguinal region structure
alternative label: Inguinal Canals

Inhalation
type: Class
subclass of: Health Related Factors
comment: 1 M03458 2 Inhalation 3 Inhalations 4 Inhalation 5 14910006 6 Inhalation 7 Inspiration (observable entity) 8 Inspiration function 9 C0004048
comment: 1 M03458-1 2 Inhalation 3 Inhalations, Inhalation Dosing Unit, Inhalation - unit of product usage 4 Inhalation 5 422237004 6 Inhalation 7 Inhalation - unit of product usage (qualifier value) 8 Inhalation Dosing Unit 9 C1705211
comment: 1 M03458-2 2 Inhalation 3 Inhalations, Inhalation Dosing Unit, Inhalation - unit of product usage 4 Inhalation 5 422237004 6 Inhalation 7 Inhalation - unit of product usage (qualifier value) 8 Inspiration function 9 C0004048
comment: 1 M03458-3 2 Inhalation 3 None 4 Inhalation 5 14910006 6 Inhalation 7 Inspiration (observable entity) 8 Inhalation Dosing Unit 9 C1705211
alternative label: Inhalations
alternative label: Inhalation - unit of product usage

Inhalation Dosing Unit
type: Class
subclass of: Units
comment: 1 M05273 2 Inhalation Dosing Unit 3 None 4 Inhalation Dosing Unit 5 422237004 6 Inhalation 7 Inhalation - unit of product usage (qualifier value) 8 Inhalation Dosing Unit 9 C1705211

Inhalation preparations
type: Class
subclass of: Health Related Factors
comment: 1 M03652 2 Inhalation preparations 3 None 4 Inhalation preparations 5 367559008 6 Preparation - action 7 Preparation - action (qualifier value) 8 Preparation 9 C1521827

Initial performance
type: Class
subclass of: Questionnaire
comment: 1 MD05210 2 Initial performance 3 None 4 Initial performance 5 241000124106 6 Performance measure status 7 Performance measure status (finding) 8 Performance measure status 9 C3266294

Inpatient treatment
type: Class
subclass of: Hospital Administration
comment: 1 MD00234 2 Inpatient treatment 3 None 4 Inpatient treatment 5 394656005 6 Inpatient care 7 Inpatient care (regime/therapy) 8 hospital services: inpatient department 9 C3694484

Insight
type: Class
subclass of: Nervous system and Mental function (Body measurement)
comment: 1 MD05692 2 Insight 3 None 4 Insight 5 27026000 6 Insight 7 Insight, function (observable entity) 8 Insight 9 C0233820

Insomnia
type: Class
subclass of: Activities of disability
comment: 1 M00047 2 Insomnia 3 INSOMNIA DIS Insomnia Disorder Insomnia Disorders Insomnia symptom Insomnias Disturbances of sleep/insomnia 4 Insomnia 5 193462001 6 Insomnia 7 Insomnia (disorder) 8 Sleeplessness 9 C0917801
alternative label: Insomnia symptom
alternative label: Insomnia Disorder
alternative label: Insomnias
alternative label: Insomnia Disorders
alternative label: Disturbances of sleep/insomnia
alternative label: INSOMNIA DIS

Insomnia Adverse Event
type: Class
subclass of: Nervous system and Mental function (Body measurement)
comment: 1 M02837 2 Insomnia Adverse Event 3 None 4 Insomnia Adverse Event 5 193462001 6 Insomnia 7 Insomnia (disorder) 8 Insomnia, CTCAE 9 C4554626

Instagram
type: Class
subclass of: Units
comment: 1 M05745 2 Instagram 3 None 4 Instagram 5 413568008 6 Application - unit of product usage (qualifier value) 7 Application - unit of product usage (qualifier value) 8 Application dose 9 C1533134

Instant heart rate
type: Class
subclass of: Units
comment: 1 M05746 2 Instant heart rate 3 None 4 Instant heart rate 5 413568008 6 Application - unit of product usage (qualifier value) 7 Application - unit of product usage (qualifier value) 8 Application dose 9 C1533134

Instrumental Daily Life Behavior
type: Class
subclass of: Health Related Factors
comment: 1 MD05191 2 Instrumental Daily Life Behavior 3 None 4 Instrumental Daily Life Behavior 5 844005 6 Behavior finding 7 Behavior finding (finding) 8 Behavior 9 C0004927

Intakes nutrient
type: Class
subclass of: Nutrient intake
comment: 1 M00789 2 Intakes nutrient 3 None 4 Intakes nutrient 5 26320007 6 Nutrient intake 7 Nutrient intake (observable entity) 8 Nutrient intake - finding 9 C1287879

Intangible assets
type: Class
subclass of: Characteristics of the individual
comment: 1 MD06631 2 Intangible assets 3 None 4 Intangible assets 5 118598001 6 Property 7 Property (qualifier value) 8 Intangible assets 9 C2371681

Integrative language functions
type: Class
subclass of: Nervous system and Mental function (Body measurement)
comment: 1 MD05712 2 Integrative language functions 3 None 4 Integrative language functions 5 61909002 6 Language, function 7 Language, function (observable entity) 8 Integrative language functions 9 C2370906

Intellectual Disability
type: Class
subclass of: Body functions of disability
comment: 1 MD00082 2 Intellectual Disability 3 None 4 Intellectual Disability 5 110359009 6 Intellectual disability 7 Intellectual disability (disorder) 8 Intellectual disability 9 C3714756

Intellectual functions
type: Class
subclass of: Nervous system and Mental function (Body measurement)
comment: 1 MD05616 2 Intellectual functions 3 None 4 Intellectual functions 5 247572002 6 Intellectual functions 7 Intellect, function (observable entity) 8 Intellectual functions 9 C0392334

Intensive care unit
type: Class
subclass of: Hospital Administration
comment: 1 MD00180 2 Intensive care unit 3 None 4 Intensive care unit 5 309904001 6 Intensive care unit 7 Intensive care unit (environment) 8 Intensive care unit 9 C0021708

Interacting according to social rules
type: Class
subclass of: Individual Related Factors
comment: Lifestyle Individual Related Factors None 1 MD06475 2 Interacting according to social rules 3 None 4 Interacting according to social rules 5 225598002 6 Social interaction 7 Interaction with others (observable entity) 8 Interacting according to social rules 9 C2371545

Interaction with other departments or institutions
type: Class
subclass of: Questionnaire
comment: 1 MD05127 2 Interaction with other departments or institutions 3 None 4 Interaction with other departments or institutions 5 273389003 6 Daily activities questionnaire 7 Daily activities questionnaire (assessment scale) 8 questionnaire 9 C0034394

Intercostal muscles
type: Class
subclass of: Respiratory function (Body region)
comment: 1 MD06950 2 Intercostal muscles 3 None 4 Intercostal muscles 5 86419007 6 intercostal muscle 7 Structure of intercostal muscle (body structure) 8 Intercostal muscles 9 C0021724

Intermittent
type: Class
subclass of: Frequency
comment: 1 MD05033 2 Intermittent 3 None 4 Intermittent 5 7087005 6 Intermittent 7 Intermittent (qualifier value) 8 Intermittent 9 C0205267

Intermittent Fasting
type: Class
subclass of: Nutritional management
comment: 1 MD02035 2 Intermittent Fasting 3 None 4 Intermittent Fasting 5 792805006 6 Fasting 7 Fasting (regime/therapy) 8 Intermittent Fasting 9 C4704881

Intermittent interaction during work
type: Class
subclass of: Questionnaire
comment: 1 MD05125 2 Intermittent interaction during work 3 None 4 Intermittent interaction during work 5 273389003 6 Daily activities questionnaire 7 Daily activities questionnaire (assessment scale) 8 questionnaire 9 C0034394
alternative label: Intermittently need physical help from others

Internal Medicine
type: Class
subclass of: Classification of Hospital
comment: 1 MD00630 2 Internal Medicine 3 None 4 Internal Medicine 5 419192003 6 Internal medicine 7 Internal medicine (qualifier value) 8 Internal medicine specialty 9 C0021782

Internal Medicine Integration
type: Class
subclass of: Classification of Hospital
comment: 1 MD00677 2 Internal Medicine Integration 3 None 4 Internal Medicine Integration 5 419192003 6 internal medicine 7 internal medicine (qualifier value) 8 Internal medicine service 9 C5230764

Internal Medicine of Korean Medicine
type: Class
subclass of: Classification of Hospital
comment: 1 MD00668 2 Internal Medicine of Korean Medicine 3 None 4 Internal Medicine of Korean Medicine 5 419192003 6 Internal medicine 7 Internal medicine (qualifier value) 8 Internal medicine service 9 C5230764

Internal auditory meatus
type: Class
subclass of: Sensory function, Pain and Skin function (Body region)
comment: 1 MD06883 2 Internal auditory meatus 3 None 4 Internal auditory meatus 5 61671002 6 Internal auditory meatus 7 Structure of internal acoustic meatus of temporal bone (body structure) 8 Internal auditory meatus 9 C0222711

Internal medicine patient
type: Class
subclass of: Classification of Patient
comment: 1 MD00175 2 Internal medicine patient 3 None 4 Internal medicine patient 5 419192003 6 Internal medicine 7 Internal medicine (qualifier value) 8 Internal medicine patient 9 C3838887

Internal rotation
type: Class
subclass of: Musculoskeletal function (Body measurement)
comment: 1 MD04351 2 Internal rotation 3 Functional internal rotation 4 Internal rotation 5 12852001 6 Internal rotation 7 Internal rotation, function (observable entity) 8 Internal rotation 9 C0231459
comment: 1 MD04351-1 2 Internal rotation 3 Functional internal rotation 4 Internal rotation 5 257913003 6 Internal rotation 7 Internal rotation (qualifier value) 8 Internal rotation 9 C0231459
alternative label: Functional internal rotation

International Foot
type: Class
subclass of: Units
comment: 1 M05435 2 International Foot 3 None 4 International Foot 5 259051004 6 foot 7 Foot (qualifier value) 8 ft 9 C0347980

International Mile
type: Class
subclass of: Units
comment: 1 M03626 2 International Mile 3 None 4 International Mile 5 258678002 6 Mile 7 Mile (qualifier value) 8 Miles 9 C0439148

International Ounce
type: Class
subclass of: Units
comment: 1 M03758 2 International Ounce 3 None 4 International Ounce 5 258692008 6 ounce 7 ounces (qualifier value) 8 ounce 9 C0439218

International Unit
type: Class
subclass of: Units
comment: 1 M04273 2 International Unit 3 IU international units ius Unit International 4 International Unit 5 258997004 6 international unit 7 international unit (qualifier value) 8 international unit 9 C0439453
alternative label: international units
alternative label: IU
alternative label: Unit International
alternative label: ius

International Unit of Biological Activity
type: Class
subclass of: Units
comment: 1 M04272 2 International Unit of Biological Activity 3 None 4 International Unit of Biological Activity 5 258997004 6 international units 7 international unit (qualifier value) 6 international units 9 C0439453

International Unit per Gram
type: Class
subclass of: Units
comment: 1 M04814 2 International Unit per Gram 3 "IU/g international units per gram International Unit/Gram" 4 International Unit per Gram 5 408163000 6 International units per gram 7 International units per gram (qualifier value) 8 International units per gram 9 C1319631
alternative label: international units per gram
alternative label: IU/g
alternative label: International Unit/Gram

International Unit per Kilogram per Hour
type: Class
subclass of: Units
comment: 1 M05029 2 International Unit per Kilogram per Hour 3 IU/kg/h IU/kg/hr International Units per Kilogram per Hour International unit/kilogram/hour 4 International Unit per Kilogram per Hour 5 414522002 6 International unit per kilogram per hour 7 International unit/kilogram/hour (qualifier value) 8 International unit per kilogram per hour 9 C1532975
alternative label: IU/kg/h
alternative label: International Units per Kilogram per Hour
alternative label: International unit/kilogram/hour
alternative label: IU/kg/hr

International Unit per Liter
type: Class
subclass of: Units
comment: 1 M04286 2 International Unit per Liter 3 IU/L international unit/litre international unit/liter 4 International Unit per Liter 5 259001000 6 International unit/litre 7 International unit/liter (qualifier value) 8 International unit/litre 9 C0439457
alternative label: IU/L
alternative label: international unit/liter
alternative label: international unit/litre

International Unit per Milligram
type: Class
subclass of: Units
comment: 1 M04816 2 International Unit per Milligram 3 "IU/mg International Unit/Milligram" 4 International Unit per Milligram 5 408164006 6 International unit/milligram 7 International unit/milligram (qualifier value) 8 International unit/milligram 9 C1319632
alternative label: IU/mg
alternative label: International Unit/Milligram

International Unit per Milliliter
type: Class
subclass of: Units
comment: 1 M04295 2 International Unit per Milliliter 3 IU/mL international unit/millilitre international unit/milliliter 4 International Unit per Milliliter 5 259002007 6 international unit/milliliter 7 international unit/milliliter (qualifier value) 8 international unit/milliliter 9 C0439458
alternative label: international unit/milliliter
alternative label: international unit/millilitre
alternative label: IU/mL

International unit per deciliter
type: Class
subclass of: Units
comment: 1 M05407 2 International unit per deciliter 3 IU/dL International unit per decilitre International unit/decilitre International unit/deciliter 4 International unit per deciliter 5 426110007 6 International unit per deciliter 7 International unit/deciliter (qualifier value) 8 International unit per deciliter 9 C1960947
alternative label: International unit per decilitre
alternative label: IU/dL
alternative label: International unit/decilitre

International unit per gram of creatinine
type: Class
subclass of: Units
comment: 1 M04079 2 International unit per gram of creatinine 3 IU/g creat international unit/gram creatinine 4 International unit per gram of creatinine 5 258899002 6 International unit per gram of creatinine 7 International unit per gram of creatinine (qualifier value) 8 International unit per gram of creatinine 9 C0439370
alternative label: IU/g creat
alternative label: international unit/gram creatinine

International units per unit time
type: Class
subclass of: Units
comment: 1 M04559 2 International units per unit time 3 IU per unit time 4 International units per unit time 5 282351009 6 International units per unit time 7 International units per unit time (qualifier value) 8 International units per unit time 9 C0560244
alternative label: IU per unit time

Interval Training
type: Class
subclass of: Sport
comment: 1 MD01027 2 Interval Training 3 None 4 Interval Training 5 118629009 6 training 7 Functional training (procedure) 8 Sprint Interval Training 9 C4279979

Interval between menstruation
type: Class
subclass of: Frequency
comment: 1 MD06001 2 Interval between menstruation 3 None 4 Interval between menstruation 5 307167003 6 Temporal periods relating to menstruation 7 Temporal periods relating to menstruation (qualifier value) 8 Interval between menstruation 9 C2371177

Intolerant non-smoker
type: Class
subclass of: Classification of Patient
comment: 1 M02157 2 Intolerant non-smoker 3 None 4 Intolerant non-smoker 5 360929005 6 Intolerant non-smoker 7 Intolerant non-smoker (finding) 8 Intolerant non-smoker 9 C0337674

Intractable
type: Class
subclass of: Hospital information, examination/diagnosis/treatment data
comment: 1 MD00597 2 Intractable 3 None 4 Intractable 5 20646008 6 Intractable 7 Intractable (qualifier value) 8 Unresponsive to Treatment 9 C0205269

Investigation method
type: Class
subclass of: Questionnaire
comment: 1 MD04897 2 Investigation method 3 None 4 Investigation method 5 260686004 6 method 7 Method (attribute) 8 Methods 9 C0025663

Involuntary contractions of muscles
type: Class
subclass of: Musculoskeletal function (Body measurement)
comment: 1 MD06090 2 Involuntary contractions of muscles 3 None 4 Involuntary contractions of muscles 5 45352006 6 Spasm 7 Spasm (finding) 8 Involuntary contractions of muscles 9 C0235086

Involuntary movement functions
type: Class
subclass of: Musculoskeletal function (Body measurement)
comment: 1 MD06089 2 Involuntary movement functions 3 None 4 Involuntary movement functions 5 106146005 6 Reflexes 7 Reflex finding (finding) 8 Involuntary movement functions 9 C2371257

Involuntary movement reaction functions
type: Class
subclass of: Nervous system and Mental function (Body measurement)
comment: 1 MD06076 2 Involuntary movement reaction functions 3 None 4 Involuntary movement reaction functions 5 106146005 6 Reflexes 7 Reflex finding (finding) 8 Involuntary movement reaction functions 9 C2371246

Iodine
type: Class
subclass of: Nutritional management
comment: 1 MD01715 2 Iodine 3 None 4 Iodine 5 44588005 6 Iodine 7 Iodine (substance) 8 Iodine 9 C0021968

Iris
type: Class
subclass of: Sensory function, Pain and Skin function (Body region)
comment: 1 MD06860 2 Iris 3 None 4 Iris 5 41296002 6 Iris 7 Iris structure (body structure) 8 Iris 9 C0022077
comment: 1 MD06860-1 2 Iris 3 None 4 Iris 5 41296002 6 Iris 7 Iris structure (body structure) 8 Iris 9 C1001362
comment: 1 MD06860-2 2 Iris 3 None 4 Iris 5 27527003 6 Iris 7 Iris (plant) (organism) 8 Iris 9 C0022077
comment: 1 MD06860-3 2 Iris 3 None 4 Iris 5 27527003 6 Iris 7 Iris (plant) (organism) 8 Iris 9 C1001362

Irregular fever
type: Class
subclass of: Immune system function (Symptom)
comment: 1 M00162 2 Irregular fever 3 None 4 Irregular fever 5 271753002 6 Irregular fever 7 Irregular fever (finding) 8 Irregular fever 9 C0424783

Irregular sleep-wake pattern
type: Class
subclass of: Duration
comment: 1 M00062 2 Irregular sleep-wake pattern 3 None 4 Irregular sleep-wake pattern 5 271793004 6 Irregular sleep-wake pattern 7 Irregular sleep-wake pattern (disorder) 8 Irregular sleep-wake pattern 9 C0393771

Irritation in the ear
type: Class
subclass of: Sensory function, Pain and Skin function (Body measurement)
comment: 1 MD05776 2 Irritation in the ear 3 None 4 Irritation in the ear 5 162360008 6 Irritation of ear 7 Irritation of ear (finding) 8 Irritation in the ear 9 C0423576

Is your occupation or daily living limited by your shoulder
type: Class
subclass of: Questionnaire
comment: 1 MD04805 2 Is your occupation or daily living limited by your shoulder 3 None 4 Is your occupation or daily living limited by your shoulder 5 273389003 6 Daily activities questionnaire 7 Daily activities questionnaire (assessment scale) 8 Daily activities questionnaire 9 C0451094

Isokinetic Power
type: Class
subclass of: Units
comment: 1 MD03206 2 Isokinetic Power 3 None 4 Isokinetic Power 5 16709005 6 Isotonic exercise 7 Isotonic exercise (regime/therapy) 8 Isotonic exercise 9 C0454287

Isokinetic exercises
type: Class
subclass of: Muscle Strengthening Exercise
comment: 1 M02394 2 Isokinetic exercises 3 isokinetic exercise, exercise isokinetics, exercises isokinetic 4 Isokinetic exercises 5 16709005 6 Isokinetic exercises 7 Isotonic exercise (regime/therapy) 8 Isotonic exercise 9 C0454287
alternative label: isokinetic exercise
alternative label: exercise isokinetics
alternative label: exercises isokinetic

Isokinetic therapy
type: Class
subclass of: Musculoskeletal function (Therapy)
comment: 1 M02395 2 Isokinetic therapy 3 None 4 Isokinetic therapy 5 16709005 6 Isokinetic therapy 7 Isotonic exercise (regime/therapy) 8 Isotonic exercise 9 C0454287
alternative label: Isokinetics

Isolation room
type: Class
subclass of: Hospital Administration
comment: 1 MD00181 2 Isolation room 3 None 4 Isolation room 5 409688003 6 Hospital isolation room 7 Hospital isolation room (environment) 8 Hospital isolation room 9 C1443994

Isometric Force
type: Class
subclass of: Units
comment: 1 MD03205 2 Isometric Force 3 None 4 Isometric Force 5 258103008 6 Isometric effort 7 Isometric effort (observable entity) 8 Isometric effort 9 C0444705

Isometric exercise
type: Class
subclass of: Muscle Strengthening Exercise
comment: 1 MD02626 2 Isometric exercise 3 None 4 Isometric exercise 5 64838004 6 Isometric exercise 7 Isometric exercise (regime/therapy) 8 Isometric exercise 9 C0022206

Isometric strength test
type: Class
subclass of: Tool
comment: 1 MD04277 2 Isometric strength test 3 None 4 Isometric strength test 5 272393004 6 Tests 7 Tests (qualifier value) 8 Tests (qualifier value) 9 C0392366

Isotonic Power
type: Class
subclass of: Units
comment: 1 MD03207 2 Isotonic Power 3 None 4 Isotonic Power 5 16709005 6 Isotonic exercise 7 Isotonic exercise (regime/therapy) 8 Isotonic exercise 9 C0454287

Isotonic exercise
type: Class
subclass of: Active exercise
comment: 1 M00353 2 Isotonic exercise 3 None 4 Isotonic exercise 5 16709005 6 Isotonic exercise 7 Isotonic exercise (regime/therapy) 8 Isotonic exercise 9 C0454287

Isotonics
type: Class
subclass of: Limb
comment: 1 M02397 2 Isotonics 3 None 4 Isotonics 5 16709005 6 Isokinetic exercises 7 Isotonic exercise (regime/therapy) 8 Isotonic exercise 9 C0454289

JACKS
type: Class
subclass of: Aerobic Exercise
comment: 1 MD02020 2 JACKS 3 None 4 JACKS 5 256235009 6 Exercise 7 Exercise (observable entity) 8 Exercise 9 C0015259

Jai alai
type: Class
subclass of: Sport
comment: 1 M00412 2 Jai alai 3 None 4 Jai alai 5 2001002 6 Jai alai 7 Jai-alai (qualifier value) 8 Jai-alai 9 C0336937

Japanese encephalitis virus
type: Class
subclass of: Hospital information, examination/diagnosis/treatment data
comment: 1 MD00979 2 Japanese encephalitis virus 3 None 4 Japanese encephalitis virus 5 243603004 6 Japanese encephalitis virus 7 Japanese encephalitis virus (organism) 8 Japanese encephalitis virus 9 C0014047

Jar
type: Class
subclass of: Units
comment: 1 M03473 2 Jar 3 Jar Dosing Unit 4 Jar 5 705586008 6 Jar 7 Jar (physical object) 8 Jar - device 9 C0181427
alternative label: Jar Dosing Unit

Jebsen Taylor Hand Function Test
type: Class
subclass of: Tool
comment: 1 MD04181 2 Jebsen Taylor Hand Function Test 3 None 4 Jebsen Taylor Hand Function Test 5 246298000 6 Jebsen-Taylor hand function test score 7 Place of testing (attribute) 8 Jebsen Taylor hand function test 9 C0451237

Jingluo
type: Class
subclass of: Hospital information, examination/diagnosis/treatment data
comment: 1 M01921 2 Jingluo 3 None 4 Jingluo 5 468355003 6 Diagnostic body meridian system 7 Diagnostic body meridian system (physical object) 8 Diagnostic body meridian system 9 C3881837

Job-related
type: Class
subclass of: Questionnaire
comment: 1 MD05052 2 Job-related 3 None 4 Job-related 5 118193001 6 Role-related finding 7 Role-related finding (finding) 8 Role-related finding 9 C0562372

Job-related physical needs
type: Class
subclass of: Questionnaire
comment: 1 MD05051 2 Job-related physical needs 3 None 4 Job-related physical needs 5 225343006 6 Assessment of needs 7 Assessment of needs (procedure) 8 Needs Assessment 9 C0558005

Job description
type: Class
subclass of: Questionnaire
comment: 1 MD04896 2 Job description 3 None 4 Job description 5 900000000000446008 6 Description type 7 Description type (core metadata concept) 8 Job Description 9 C0022396
alternative label: job performance

Job description 2
type: Class
subclass of: Questionnaire
comment: 1 MD04947 2 Job description 2 3 None 4 Job description 2 5 900000000000446008 6 Description type 7 Description type (core metadata concept) 8 Job Description 9 C0022396

Job description for disaster victims 1
type: Class
subclass of: Questionnaire
comment: 1 MD04894 2 Job description for disaster victims 1 3 None 4 Job description for disaster victims 1 5 246137000 6 equipment 7 Equipment (attribute) 8 equipment 9 C0014672

Job description for disaster victims 2
type: Class
subclass of: Questionnaire
comment: 1 MD04945 2 Job description for disaster victims 2 3 None 4 Job description for disaster victims 2 5 698719009 6 Victim of tsunami 7 Victim of tsunami (finding) 8 Disaster Victims 9 C1405990

Job name
type: Class
subclass of: Hospital Administration
comment: 1 MD04918 2 Job name 3 None 4 Job name 5 734841007 6 Name 7 Name (property) (qualifier value) 8 Name 9 C0027365

Job summary
type: Class
subclass of: Questionnaire
comment: 1 MD04944 2 Job summary 3 None 4 Job summary 5 371534008 6 Summary report 7 Summary report (record artifact) 8 Summary report 9 C0242482

Joint Angle
type: Class
subclass of: Units
comment: 1 MD03202 2 Joint Angle 3 None 4 Joint Angle 5 1483009 6 Angle 7 Angular (qualifier value) 8 Angle 9 C0205143

Joint Angular Velocity
type: Class
subclass of: Units
comment: 1 MD03208 2 Joint Angular Velocity 3 angular velocity 4 Joint Angular Velocity 5 118592000 6 Velocity 7 Velocity (property) (qualifier value) 8 Velocity 9 C0439830
alternative label: angular velocity

Joint mobility exercises
type: Class
subclass of: Passive exercise
comment: 1 M02230 2 Joint mobility exercises 3 None 4 Joint mobility exercises 5 386294003 6 Joint mobility exercises 7 Joint mobility exercises (regime/therapy) 8 Joint mobility exercises 9 C0419122

Joint movement training
type: Class
subclass of: Active exercise
comment: 1 M01771 2 Joint movement training 3 Training in joint movements, Training of joint movements 4 Joint movement training 5 183314008 6 Joint movement training 7 Joint movement training (regime/therapy) 8 Joint movement training 9 C0203967
alternative label: Training in joint movements
alternative label: Training of joint movements

Joints of hand and fingers
type: Class
subclass of: Musculoskeletal function (Body region)
comment: 1 MD07044 2 Joints of hand and fingers 3 None 4 Joints of hand and fingers 5 40238009 6 Joint of hand 7 Hand joint structure (body structure) 8 Joints of hand and fingers 9 C2371073

Joints of head and neck region
type: Class
subclass of: Musculoskeletal function (Body region)
comment: 1 MD07015 2 Joints of head and neck region 3 None 4 Joints of head and neck region 5 280435009 6 Joint structure of head and neck 7 Joint structure of head and neck (body structure) 8 Joints of head and neck region 9 C2371058

Joints of pelvic region
type: Class
subclass of: Musculoskeletal function (Body region)
comment: 1 MD07053 2 Joints of pelvic region 3 None 4 Joints of pelvic region 5 1003618007 6 Entire joint of pelvic ring 7 Entire joint of pelvic ring (body structure) 8 Joints of pelvic region 9 C2371079

Joints of shoulder region
type: Class
subclass of: Musculoskeletal function (Body region)
comment: 1 MD07022 2 Joints of shoulder region 3 None 4 Joints of shoulder region 5 31398001 6 Joint of shoulder region 7 Joint structure of shoulder region (body structure) 8 Joints of shoulder region 9 C0037009

Judgement
type: Class
subclass of: Nervous system and Mental function (Body measurement)
comment: 1 MD05693 2 Judgement 3 None 4 Judgement 5 61254005 6 Judgement 7 Judgement (observable entity) 8 Judgement 9 C0022423

Jugular venous pulse
type: Class
subclass of: Cardiovascular system function (Body measurement)
comment: 1 M00195 2 Jugular venous pulse 3 Finding of jugular venous pressure 4 Jugular venous pulse 5 22921004 6 Jugular venous pulse 7 Jugular venous pulse, function (observable entity) 8 Jugular venous pulse 9 C0232133
alternative label: Finding of jugular venous pressure

Juvenile
type: Class
subclass of: Musculoskeletal function (Symptom)
comment: 1 MD00344 2 Juvenile 3 None 4 Juvenile 5 59223006 6 Juvenile 7 Juvenile (finding) 8 Juvenile 9 C3146221

K-LEVEL
type: Class
subclass of: Questionnaire
comment: 1 MD04746 2 K-LEVEL 3 None 4 K-LEVEL 5 273249006 6 Assessment scales 7 Assessment scales (assessment scale) 8 Assessment scales 9 C0450973

K-PASE
type: Class
subclass of: Tool
comment: 1 MD03258 2 K-PASE 3 None 4 K-PASE 5 278111002 6 scale 7 Scale - rank (attribute) 8 evaluation 9 C0220825
comment: 1 MD03684 2 K-PASE 3 None 4 K-PASE 5 273249006 6 Assessment scales 7 Assessment scales (assessment scale) 8 Assessment scales 9 C0450973

K-SCIM
type: Class
subclass of: Tool
comment: 1 MD03642 2 K-SCIM 3 None 4 K-SCIM 5 273469003 6 Functional independence measure 7 Functional independence measure (assessment scale) 8 Functional independence measure (assessment scale) 9 C0451172

KDSQ-C
type: Class
subclass of: Questionnaire
comment: 1 MD00750 2 KDSQ-C 3 None 4 KDSQ-C 5 386806002 6 Cognitive dysfunction 7 Impaired cognition (finding) 8 Impaired cognition 9 C0338656

KLOUT
type: Class
subclass of: Units
comment: 1 M05747 2 KLOUT 3 None 4 KLOUT 5 413568008 6 Application - unit of product usage (qualifier value) 7 Application - unit of product usage (qualifier value) 8 Application dose 9 C1533134

KNEE-CURL
type: Class
subclass of: Aerobic Exercise
comment: 1 MD02015 2 KNEE-CURL 3 None 4 KNEE-CURL 5 183301007 6 Physical exercises 7 Physical exercises (regime/therapy) 8 Exercisers, Leg Curl 9 C4287187

KSPEN
type: Class
subclass of: Units
comment: 1 M05748 2 KSPEN 3 None 4 KSPEN 5 413568008 6 Application - unit of product usage (qualifier value) 7 Application - unit of product usage (qualifier value) 8 Application dose 9 C1533134

KT
type: Class
subclass of: Units
comment: 1 M05229 2 KT 3 None 4 KT 5 419179001 6 Kits 7 Kit - unit of product usage (qualifier value) 8 Kits 9 C1690540

Kallikrein Inhibitor Unit
type: Class
subclass of: Units
comment: 1 M04852 2 Kallikrein Inhibitor Unit 3 None 4 Kallikrein Inhibitor Unit 5 767525000 6 unit 7 Unit (qualifier value) 8 Unit 9 C0439157

Kallikrein inactivator unit - KIU
type: Class
subclass of: Units
comment: 1 M04853 2 Kallikrein inactivator unit - KIU 3 Kallikrein inactivator unit 4 Kallikrein inactivator unit - KIU 5 411225003 6 Kallikrein inactivator unit - KIU 7 Kallikrein inactivator unit (qualifier value) 8 Kallikrein inactivator unit - KIU 9 C1445118
alternative label: Kallikrein inactivator unit

Kallmann Syndrome
type: Class
subclass of: Functions of Blood System, Metabolic system and Endocrine system (Symptom)
comment: 1 MD00407 2 Kallmann Syndrome 3 None 4 Kallmann Syndrome 5 93559003 6 Kallman's syndrome 7 Hypogonadism with anosmia (disorder) 8 Kallmann Syndrome 9 C0162809

Karate
type: Class
subclass of: Sport
comment: 1 MD01203 2 Karate 3 None 4 Karate 5 34811002 6 Karate 7 Karate (qualifier value) 8 Karate 9 C0079654

Karman
type: Class
subclass of: Units
comment: 1 MD01931 2 Karman 3 None 4 Karman 5 733020007 6 Syringe 7 Syringe (unit of presentation) 8 Syringe, Karman 9 C0039141

Katal
type: Class
subclass of: Units
comment: 1 M03810 2 Katal 3 kat 4 Katal 5 258777001 6 Katal 7 Katal (qualifier value) 8 Katal 9 C0439245
alternative label: kat

Keeping promises and meetings
type: Class
subclass of: Health Related Factors
comment: 1 MD05311 2 Keeping promises and meetings 3 None 4 Keeping promises and meetings 5 844005 6 Behavior finding 7 Behavior finding (finding) 8 Behavior 9 C0004927

Kegel exercises
type: Class
subclass of: Muscle Strengthening Exercise
comment: 1 M02041 2 Kegel exercises 3 kegel exercise, exercises kegel, exercises kegels 4 Kegel exercises 5 183306002 6 Kegel exercises 7 Pelvic floor exercises (regime/therapy) 8 Kegel exercises 9 C0262718
alternative label: exercises kegel
alternative label: exercises kegels
alternative label: kegel exercise

Keto Diet
type: Class
subclass of: Nutritional management
comment: 1 MD02032 2 Keto Diet 3 None 4 Keto Diet 5 765060000 6 Ketogenic diet 7 Ketogenic diet (regime/therapy) 8 Ketogenic Diet 9 C0259972

Kettlebell training
type: Class
subclass of: Sport
comment: 1 MD01030 2 Kettlebell training 3 None 4 Kettlebell training 5 118629009 6 training 7 Functional training (procedure) 8 training 9 C0220931

Key
type: Class
subclass of: Tool
comment: 1 MD04110 2 Key 3 None 4 Key 5 246137000 6 Equipment 7 Equipment (attribute) 8 Equipment 9 C0014672

Key Pinch
type: Class
subclass of: Health Related Factors
comment: 1 MD04109 2 Key Pinch 3 None 4 Key Pinch 5 251434007 6 Key pinch 7 Key pinch (observable entity) 8 Key pinch 9 C0429272

Ki
type: Class
subclass of: Units
comment: 1 MD01932 2 Ki 3 None 4 Ki 5 767525000 6 Unit 7 Unit (qualifier value) 8 Unit 9 C0439148

Kickball
type: Class
subclass of: Sport
comment: 1 M00415 2 Kickball 3 None 4 Kickball 5 415577004 6 Sport 7 Sport (qualifier value) 8 Kickball 9 C2712649

Kickboxing
type: Class
subclass of: Sport
comment: 1 MD01031 2 Kickboxing 3 None 4 Kickboxing 5 29506000 6 boxing 7 Boxing (qualifier value) 8 Boxing (sports activity) 9 C0006080

Kids
type: Class
subclass of: Questionnaire
comment: 1 MD05413 2 Kids 3 None 4 Kids 5 67822003 6 Child 7 Child (person) 8 Child 9 C0008059

Kilo International Unit
type: Class
subclass of: Units
comment: 1 M04277 2 Kilo International Unit 3 kIU Kilointernational Unit kilo international units 4 Kilo International Unit 5 258998009 6 Kilointernational unit 7 Kilointernational unit (qualifier value) 8 Kilointernational unit 9 C0439454
alternative label: Kilointernational Unit
alternative label: kIU

Kilo International Unit per Liter
type: Class
subclass of: Units
comment: 1 M04292 2 Kilo International Unit per Liter 3 kIU/L kilointernational unit/litre kilointernational unit/liter Kilointernational Unit per Liter 4 Kilo International Unit per Liter 5 259003002 6 kIU/L 7 Kilointernational unit/liter (qualifier value) 8 kIU/L 9 C0439458
alternative label: kIU/L
alternative label: kilointernational unit/litre
alternative label: kilointernational unit/liter
alternative label: Kilointernational Unit per Liter

Kilobecquerel per Gram
type: Class
subclass of: Units
comment: 1 M05479 2 Kilobecquerel per Gram 3 kBq/g 4 Kilobecquerel per Gram 5 282143001 6 Kilobecquerel 7 Kilobecquerel (qualifier value) 8 kBq 9 C0560040

Kilobecquerel per Kilogram
type: Class
subclass of: Units
comment: 1 M05459 2 Kilobecquerel per Kilogram 3 kBq/kg 4 Kilobecquerel per Kilogram 5 767525000 6 unit 7 Unit (qualifier value) 8 Unit 9 C0439190
alternative label: kBq/kg

Kilobecquerel per Liter
type: Class
subclass of: Units
comment: 1 M05484 2 Kilobecquerel per Liter 3 kBq/L 4 Kilobecquerel per Liter 5 282143001 6 Kilobecquerel 7 Kilobecquerel (qualifier value) 8 kBq 9 C0560040
alternative label: kBq/L

Kilobecquerel per Microgram
type: Class
subclass of: Units
comment: 1 M05653 2 Kilobecquerel per Microgram 3 kBq/mcg kBq/ug 4 Kilobecquerel per Microgram 5 282143001 6 Kilobecquerel 7 Kilobecquerel (qualifier value) 8 kBq 9 C0560040
alternative label: kBq/mcg
alternative label: kBq/ug

Kilobecquerel per Microliter
type: Class
subclass of: Units
comment: 1 M05191 2 Kilobecquerel per Microliter 3 kBq/uL Kilobecquerel/Microliter 4 Kilobecquerel per Microliter 5 767525000 6 unit 7 Unit (qualifier value) 8 Unit 9 C0439176
alternative label: Kilobecquerel/Microliter
alternative label: kBq/uL

Kilobecquerel per Milligram
type: Class
subclass of: Units
comment: 1 M05469 2 Kilobecquerel per Milligram 3 kBq/mg 4 Kilobecquerel per Milligram 5 767525000 6 unit 7 Unit (qualifier value) 8 Unit 9 C0439190

Kilobecquerel per milliliter
type: Class
subclass of: Units
comment: 1 M05216 2 Kilobecquerel per milliliter 3 KBq/mL kiloBecquerel/milliliter Kilobecquerel per millilitre 4 Kilobecquerel per milliliter 5 418081005 6 Kilobecquerel per milliliter 7 kiloBecquerel/milliliter (qualifier value) 8 Kilobecquerel per milliliter 9 C1690011
alternative label: kBq/mL
alternative label: Kilobecquerel per millilitre
alternative label: kiloBecquerel/milliliter

Kilocalories per kilogram per day
type: Class
subclass of: Units
comment: 1 M05241 2 Kilocalories per kilogram per day 3 Kcal/kg/day Kilocalories/kilogram/day 4 Kilocalories per kilogram per day 5 419764002 6 Kilocalories per kilogram per day 7 Kilocalories per kilogram per day (qualifier value) 8 Kilocalories per kilogram per day 9 C1690969
alternative label: Kcal/kg/day
alternative label: Kilocalories/kilogram/day

Kilocalories per kilogram per hour
type: Class
subclass of: Units
comment: 1 M05228 2 Kilocalories per kilogram per hour 3 Kcal/kg/hr Kilocalories/kilogram/hour 4 Kilocalories per kilogram per hour 5 419505001 6 Kilocalories per kilogram per hour 7 Kilocalories per kilogram per hour (qualifier value) 8 Kilocalories per kilogram per hour 9 C1690488
alternative label: Kilocalories/kilogram/hour
alternative label: Kcal/kg/hr

Kilodyne per centimeter squared
type: Class
subclass of: Units
comment: 1 M05723 2 Kilodyne per centimeter squared 3 Kdyn/cm2 4 Kilodyne per centimeter squared 5 2701000175108 6 Kilodyne per square centimeter 7 Kilodyne per square centimeter (qualifier value) 8 Kilodyne per square centimeter 9 C2985213
alternative label: Kdyn/cm2

Kilogram
type: Class
subclass of: Units
comment: 1 M03741 2 Kilogram 3 kg kilograms kgs 4 Kilogram 5 258683005 6 kilogram 7 kilogram (qualifier value) 8 kilogram 9 C0439209
alternative label: kg
alternative label: kilograms

Kilogram-Calorie
type: Class
subclass of: Units
comment: 1 M05105 2 Kilogram Calorie 3 None 4 Kilogram-Calorie 5 258790011 6 calorie 7 calorie (qualifier value) 8 calorie 9 C1879988

Kilogram-meter
type: Class
subclass of: Units
comment: 1 M05006 2 Kilogram meter 3 kg-m Kilogram metre 4 Kilogram-meter 5 414557004 6 Kilogram-meter 7 Kilogram-meter (qualifier value) 8 Kilogram-meter 9 C1532718

Kilogram-meter per square meter
type: Class
subclass of: Units
comment: 1 M05012 2 Kilogram-meter per square meter 3 kg-m/m2 Kilogram-meter/square metre Kilogram-meter/square meter Kilogram-meter per square metre Kilogram-meter per metre squared Kilogram-meter per meter squared 4 Kilogram-meter per square meter 5 414558009 6 Kilogram-meter per square meter 7 Kilogram-meter/square meter (qualifier value) 8 Kilogram-meter per square meter 9 C1532719
alternative label: kg-m/m2
alternative label: Kilogram-meter per square metre
alternative label: Kilogram-meter per meter squared
alternative label: Kilogram-meter/square metre
alternative label: Kilogram-meter per metre squared
alternative label: Kilogram-meter/square meter

Kilogram Calorie
type: Class
subclass of: Units
comment: 1 M05106 2 Kilogram Calorie 3 Kilogram-Calorie 4 Kilogram Calorie 5 258790012 6 calorie 7 calorie (qualifier value) 8 calorie 9 C1879989

Kilogram meter
type: Class
subclass of: Units
comment: 1 M05008 2 Kilogram meter 3 kg-m Kilogram metre Kilogram-meter 4 Kilogram meter 5 414557004 6 Kilogram meter 7 Kilogram-meter (qualifier value) 8 Kilogram meter 9 C1532718
alternative label: kg-m
alternative label: Kilogram metre

Kilogram per Cubic Meter
type: Class
subclass of: Units
comment: 1 M03985 2 Kilogram per Cubic Meter 3 Kilogram/Cubic Meter kilogram per meter cubed kg/m3 4 Kilogram per Cubic Meter 5 396153000 6 kg/m3 7 Kilogram/cubic meter (qualifier value) 8 kg/m3 9 C0439294
alternative label: kilogram per meter cubed
alternative label: kg/m3
alternative label: Kilogram/Cubic Meter

Kilogram per Kilogram
type: Class
subclass of: Units
comment: 1 M04822 2 Kilogram per Kilogram 3 kg/kg 4 Kilogram per Kilogram 5 767525000 6 unit 7 Unit (qualifier value) 8 Unit 9 C0439157
alternative label: kg/kg

Kilogram per Kilogram per Day
type: Class
subclass of: Units
comment: 1 M05673 2 Kilogram per Kilogram per Day 3 kg/kg/d 4 Kilogram per Kilogram per Day 5 258831001 6 Kilogram/day 7 Kilogram/day (qualifier value) 8 kg/day 9 C0439418
alternative label: kg/kg/d

Kilogram per Square Centimeter
type: Class
subclass of: Units
comment: 1 M05443 2 Kilogram per Square Centimeter 3 kg/cm2 Kilogram/Square Centimeter Kilogram per Centimeter Squared 4 Kilogram per Square Centimeter 5 767525000 6 unit 7 Unit (qualifier value) 8 Unit 9 C0439189
alternative label: Kilogram per Centimeter Squared
alternative label: Kilogram/Square Centimeter
alternative label: kg/cm2

Kilogram per Square Meter
type: Class
subclass of: Units
comment: 1 M04423 2 Kilogram per Square Meter 3 Kilograms per meters squared kg/m2 Kilogram/Square Meter kilogram/metre squared Kilogram per Meter Squared kg/sq.m kg/sq. m kg/s2 4 Kilogram per Square Meter 5 258896009 6 Kilogram/square meter 7 Kilogram/square meter (qualifier value) 8 Kilogram/square meter 9 C0456689
alternative label: kg/m2
alternative label: Kilograms per meters squared
alternative label: Kilogram per Meter Squared
alternative label: Kilogram/Square Meter
alternative label: kg/sq.m
alternative label: kilogram/metre squared
alternative label: kilogram/meter squared

Kilogram per hour
type: Class
subclass of: Units
comment: 1 M05016 2 Kilogram per hour 3 kg/hr Kilogram/hour 4 Kilogram per hour 5 414559001 6 Kilogram per hour 7 Kilogram/hour (qualifier value) 8 Kilogram per hour 9 C1532756
alternative label: kg/hr
alternative label: Kilogram/hour

Kilogram per minute
type: Class
subclass of: Units
comment: 1 M05018 2 Kilogram per minute 3 kg/min Kilogram/minute 4 Kilogram per minute 5 414560006 6 Kilogram per minute 7 Kilogram/minute (qualifier value) 8 Kilogram per minute 9 C1532757
alternative label: kg/min
alternative label: Kilogram/minute

Kilointernational Unit per Kilogram
type: Class
subclass of: Units
comment: 1 M04811 2 Kilointernational Unit per Kilogram 3 kIU/kg 4 Kilointernational Unit per Kilogram 5 767525000 6 unit 7 Unit (qualifier value) 8 Unit 9 C0439157
alternative label: kIU/kg

Kilojoule
type: Class
subclass of: Units
comment: 1 M01576 2 Kilojoule 3 kJ kilojoules 4 Kilojoule 5 258788007 6 kilojoule 7 kilojoule (qualifier value) 8 kilojoule 9 C0439255
alternative label: kilojoules
alternative label: kJ

Kilonewton per Centimeter Squared
type: Class
subclass of: Units
comment: 1 M05722 2 Kilonewton per Centimeter Squared 3 kN/cm2 4 Kilonewton per Centimeter Squared 5 2701000175108 6 Kilodyne per square centimeter 7 Kilodyne per square centimeter (qualifier value) 8 Kilodyne per square centimeter 9 C2985213
alternative label: kN/cm2

Kilopascal
type: Class
subclass of: Units
comment: 1 M04320 2 Kilopascal 3 kPa 4 Kilopascal 5 259017006 6 Kilopascal 7 Kilopascal (qualifier value) 8 Kilopascal 9 C0439474
alternative label: kPa

Kilounit per Liter
type: Class
subclass of: Units
comment: 1 M04046 2 Kilounit per Liter 3 kU/L kilounit/litre kilounit/liter 4 Kilounit per Liter 5 258951001 6 Kilounit/liter 7 Kilounit/liter (qualifier value) 8 Kilounit/liter 9 C0439340
alternative label: kilounit/liter
alternative label: kilounit/litre
alternative label: kU/L

Kit
type: Class
subclass of: Units
comment: 1 M03443 2 Kit 3 Kits Kit Dosing Unit Kit - unit of product usage 4 Kit 5 419179001 6 Kit 7 Kit - unit of product usage (qualifier value) 8 Kit Dosing Unit 9 C1690540
alternative label: Kits
alternative label: Kit - unit of product usage
alternative label: Kit Dosing Unit

Kite skiing
type: Class
subclass of: Sport
comment: 1 MD01059 2 Kite skiing 3 None 4 Kite skiing 5 45033006 6 skiing 7 Skiing (qualifier value) 8 Skiing (recreational activity) 9 C0037264

Knee-to-Knee Push-Ups
type: Class
subclass of: Muscle Strengthening Exercise
comment: 1 MD02807 2 Knee-to-Knee Push-Ups 3 None 4 Knee-to-Knee Push-Ups 5 61686008 6 physical exercise 7 Physical exercise (observable entity) 8 Push-ups 9 C3166242

Knee exercises
type: Class
subclass of: Limb
comment: 1 M00297 2 Knee exercises 3 exercises knee, exercise knees, exercise knee, exercises knees, knee exercise Knee exercises 5 229155001 6 Knee exercises 7 Knee exercises (regime/therapy) 8 Knee exercises 9 C0454364

Knee exercises in water
type: Class
subclass of: Active exercise
comment: 1 M00298 2 Knee exercises in water 3 None 4 Knee exercises in water 5 229190009 6 Knee exercises in water 7 Knee exercises in water (regime/therapy) 8 Knee exercises in water 9 C0454399

Knee extension
type: Class
subclass of: Limb
comment: 1 MD02902 2 Knee extension 3 None 4 Knee extension 5 255536004 6 Extension 7 Extension (qualifier value) 8 Extension 9 C0231448

Knee rolling exercises
type: Class
subclass of: Active exercise
comment: 1 M00299 2 Knee rolling exercises 3 None 4 Knee rolling exercises 5 229147008 6 Knee rolling exercises 7 Knee rolling exercises (regime/therapy) 8 Knee rolling exercises 9 C0454356

Knee to Chest Movement
type: Class
subclass of: Aerobic Exercise
comment: 1 MD02909 2 Knee to Chest Movement 3 None 4 Knee to Chest Movement 5 255324009 6 Movement 7 Movement (observable entity) 8 Movement 9 C0026649

Kneeling
type: Class
subclass of: Health Related Factors
comment: 1 MD06278 2 Kneeling 3 None 4 Kneeling 5 55864004 6 Kneeling 7 Kneeling (finding) 8 Kneeling 9 C1260920
comment: 1 MD06278-1 2 Kneeling 3 None 4 Kneeling 5 55864004 6 Kneeling 7 Kneeling (finding) 8 Kneeling 9 C2584307

Knife
type: Class
subclass of: Tool
comment: 1 MD04600 2 Knife 3 None 4 Knife 5 17472008 6 Knife 7 Knife, device (physical object) 8 Knife 9 C0181467

Korean Medicine Hospital
type: Class
subclass of: Classification of Hospital
comment: 1 MD00614 2 Korean Medicine Hospital 3 None 4 Korean Medicine Hospital 5 773412008 6 Traditional medicine 7 Traditional medicine (regime/therapy) 8 Medicine, Korean Traditional 9 C2350504

Korean Oswestry Disability Index
type: Class
subclass of: Tool
comment: 1 MD04308 2 Korean Oswestry Disability Index 3 None 4 Korean Oswestry Disability Index 5 273675001 6 Oswestry Disability Index 7 Oswestry disability index (assessment scale) 8 Oswestry Disability Index 9 C0451360

Korean Vocational Dictionary
type: Class
subclass of: Questionnaire
comment: 1 MD04908 2 Korean Vocational Dictionary 3 None 4 Korean Vocational Dictionary 5 246137000 6 equipment 7 Equipment (attribute) 8 equipment 9 C0014672

Korean traditional medicine
type: Class
subclass of: Classification of Hospital
comment: 1 MD00141 2 Korean traditional medicine 3 None 4 Korean traditional medicine 5 773412008 6 Traditional medicine 7 Traditional medicine (regime/therapy) 8 Medicine, Korean Traditional 9 C2350504

Korean traditional medicine Clinic
type: Class
subclass of: Classification of Hospital
comment: 1 MD00144 2 Korean traditional medicine Clinic 3 None 4 Korean traditional medicine Clinic 5 773412008 6 Traditional medicine 7 Traditional medicine (regime/therapy) 8 Traditional therapy 9 C3650840

Korean traditional medicine General Hospital
type: Class
subclass of: Classification of Hospital
comment: 1 MD00142 2 Korean traditional medicine General Hospital 3 None 4 Korean traditional medicine General Hospital 5 34271000087101 6 General hospital 7 General hospital (environment) 8 Medicine, Korean Traditional 9 C2350504

Korean traditional medicine Hospital
type: Class
subclass of: Classification of Hospital
comment: 1 MD00143 2 Korean traditional medicine Hospital 3 None 4 Korean traditional medicine Hospital 5 773412008 6 Traditional medicine 7 Traditional medicine (regime/therapy) 8 Traditional therapy 9 C3650840

Korean traditional medicine admission
type: Class
subclass of: Hospital Administration
comment: 1 MD00116 2 Korean traditional medicine admission 3 None 4 Korean traditional medicine admission 5 32485007 6 Hospital admission 7 Hospital admission (procedure) 8 Medicine, Korean Traditional 9 C2350504

Korean traditional medicine pharmacy
type: Class
subclass of: Classification of Hospital
comment: 1 MD00145 2 Korean traditional medicine pharmacy 3 None 4 Korean traditional medicine pharmacy 5 349365008 6 Herbal medicine 7 Herbal medicine (product) 8 Medicinal Herbs 9 C0025125

L-test
type: Class
subclass of: Tool
comment: 1 MD04391 2 L-test 3 L-Test Note 4 L-test 5 86967005 6 Tool 7 Tool, device (physical object) 8 Tests (qualifier value) 9 C0392366
alternative label: L-Test Note

LARK UP
type: Class
subclass of: Units
comment: 1 M05749 2 LARK UP 3 None 4 LARK UP 5 413568008 6 Application - unit of product usage (qualifier value) 7 Application - unit of product usage (qualifier value) 8 Application dose 9 C1533134

LATERAL RAISE
type: Class
subclass of: Aerobic Exercise
comment: 1 MD02009 2 LATERAL RAISE 3 None 4 LATERAL RAISE 5 183301007 6 Physical exercises 7 Physical exercises (regime/therapy) 8 Physical therapy exercises 9 C0452240

LOC - Loss of consciousness
type: Class
subclass of: Nervous system and Mental function (Symptom)
comment: 1 M01531 2 LOC - Loss of consciousness 3 Loss of consciousness, CONSCIOUSNESS LOSS OF locs 4 LOC - Loss of consciousness 5 419045004 6 Loss of consciousness 7 Loss of consciousness (finding) 8 Loss of consciousness 9 C0041657
alternative label: locs
alternative label: Loss of consciousness

LPF
type: Class
subclass of: Units
comment: 1 M03408 2 LPF 3 None 4 LPF 5 415059001 6 Per low power field 7 Per low power field (qualifier value) 8 Low Power Field 9 C1552991

Labia majora
type: Class
subclass of: Urogenital function (Body region)
comment: 1 MD06997 2 Labia majora 3 None 4 Labia majora 5 82462005 6 Labium majus 7 Labium majus structure (body structure) 8 Labia majora 9 C0227760

Labia minora
type: Class
subclass of: Urogenital function (Body region)
comment: 1 MD06998 2 Labia minora 3 None 4 Labia minora 5 32104003 6 Labium minus 7 Labium minus structure (body structure) 8 Labia minora 9 C0227766

Labile in mood
type: Class
subclass of: Nervous system and Mental function (Symptom)
comment: 1 M01670 2 Labile in mood 3 Labile mood 4 Labile in mood 5 18963009 6 Labile in mood 7 Mood swings (finding) 8 Labile in mood 9 C0085633
alternative label: Labile mood

Laboratory Medicine
type: Class
subclass of: Classification of Hospital
comment: 1 MD00648 2 Laboratory Medicine 3 None 4 Laboratory Medicine 5 61246008 6 Laboratory medicine specialist 7 Laboratory medicine specialist (occupation) 8 Laboratory medicine specialist 9 C0334899

Labour and employment policies
type: Class
subclass of: Public Policy Factors
comment: 1 MD06809 2 Labour and employment policies 3 None 4 Labour and employment policies 5 276339004 6 environment 7 Environment (environment) 8 Labour and employment policies 9 C2371831

Labour and employment services
type: Class
subclass of: Public Policy Factors
comment: 1 MD06807 2 Labour and employment services 3 None 4 Labour and employment services 5 224930009 6 services 7 Services (qualifier value) 8 Labour and employment services 9 C2371829

Labour and employment systems
type: Class
subclass of: Public Policy Factors
comment: 1 MD06808 2 Labour and employment systems 3 None 4 Labour and employment systems 5 246333005 6 system 7 System (attribute) 8 Labour and employment systems 9 C2371830

Lack of color
type: Class
subclass of: Sensory function, Pain and Skin function (Symptom)
comment: 1 M01263 2 Lack of color 3 Lack of colour 4 Lack of color 5 398912001 6 Loss of color 7 Loss of color (finding) 8 Pallor 9 C0030232
alternative label: Lack of colour

Lack of coordination
type: Class
subclass of: Nervous system and Mental function (Symptom)
comment: 1 M00502 2 Lack of coordination 3 Coordination Lack, lack coordination 4 Lack of coordination 5 281016006 6 Lack of coordination 7 Incoordination (finding) 8 Lack of coordination 9 C0520966
alternative label: lack coordination
alternative label: Coordination Lack

Lack of energy
type: Class
subclass of: Nutritional status
comment: 1 M00992 2 Lack of energy 3 Lack Energy, lacking energy, Lacking in energy 4 Lack of energy 5 248274002 6 Lack of energy 7 Lack of energy (finding) 8 Fatigue 9 C0015672
alternative label: Lack Energy
alternative label: Lacking in energy
alternative label: lacking energy

Lack of exercise
type: Class
subclass of: Frequency of exercise
comment: 1 M00378 2 Lack of exercise 3 exercise lack, exercise lack of, exercise lacking 4 Lack of exercise 5 40979000 6 Lack of exercise 7 Lack of exercise (finding) 8 Lack of exercise finding 9 C0277807
alternative label: exercise lack of
alternative label: exercise lacking
alternative label: exercise lack

Lack of physical exercise
type: Class
subclass of: Hospital information, examination/diagnosis/treatment data
comment: 1 M02069 2 Lack of physical exercise 3 None 4 Lack of physical exercise 5 40979000 6 Lack of physical exercise 7 Lack of exercise (finding) 8 Lack of physical exercise 9 C0277807

Lacrosse
type: Class
subclass of: Sport
comment: 1 M00416 2 Lacrosse 3 None 4 Lacrosse 5 29832004 6 Lacrosse 7 Lacrosse (qualifier value) 8 Lacrosse 9 C0022909

Lacrymal gland and related structures
type: Class
subclass of: Sensory function, Pain and Skin function (Body region)
comment: 1 MD06867 2 Lachrymal gland and related structures 3 None 4 Lacrymal gland and related structures 5 13561001 6 lacrimal gland 7 Lacrimal gland structure (body structure) 8 Lachrymal gland and related structures 9 C2371866

Lambda
type: Class
subclass of: Units
comment: 1 M01776 2 Lambda 3 None 4 Lambda 5 422253001 6 Lambda 7 Greek letter lambda (qualifier value) 8 Greek letter lambda 9 C1720314

Lambda Sutural Junction
type: Class
subclass of: Musculoskeletal function (Body region)
comment: 1 M00749 2 Lambda Sutural Junction 3 None 4 Lambda Sutural Junction 5 422253001 6 Lambda 7 Greek letter lambda (qualifier value) 8 Lambda (Sutural junction) 9 C0926407

Lambda junction
type: Class
subclass of: Nervous system and Mental function (Body region)
comment: 1 M01778 2 Lambda junction 3 None 4 Lambda junction 5 422253001 6 Lambda 7 Greek letter lambda (qualifier value) 8 Greek letter lambda 9 C1720314

Land forms
type: Class
subclass of: Physical/Chemical Environment
comment: 1 MD06637 2 Land forms 3 None 4 Land forms 5 224718008 6 Landing 7 Landing (environment) 8 Land forms 9 C2371687

Language therapy
type: Class
subclass of: Voice and Speaking (Therapy)
comment: 1 M00580 2 Language therapy 3 Language promotion therapy Language Therapies 4 Language therapy 5 17395000 6 Language therapy 7 Language therapy (regime/therapy) 8 Language therapy 9 C0023017
alternative label: Language promotion therapy
alternative label: Language Therapies

Large-scale
type: Class
subclass of: Questionnaire
comment: 1 MD05085 2 Large-scale 3 None 4 Large-scale 5 19892000 6 Scale 7 Scale, device (physical object) 8 Physical object 9 C0347997

Large-scale stewing and handling of objects
type: Class
subclass of: Questionnaire
comment: 1 MD05084 2 Large-scale stewing and handling of objects 3 None 4 Large-scale stewing and handling of objects 5 273389003 6 Daily activities questionnaire 7 Daily activities questionnaire (assessment scale) 8 questionnaire 9 C0034394

Large Calorie
type: Class
subclass of: Units
comment: 1 M05104 2 Large Calorie 3 None 4 Large Calorie 5 258790010 6 calorie 7 calorie (qualifier value) 8 calorie 9 C1879987

Lassitude
type: Class
subclass of: Nervous system and Mental function (Symptom)
comment: 1 M01627 2 Lassitude 3 None 4 Lassitude 5 13791008 6 Lassitude 7 Asthenia (finding) 8 Lassitude 9 C3714552

Last.fm
type: Class
subclass of: Units
comment: 1 M05750 2 Last.fm 3 None 4 Last.fm 5 413568008 6 Application - unit of product usage (qualifier value) 7 Application - unit of product usage (qualifier value) 8 Application dose 9 C1533134

Last Name
type: Class
subclass of: Units
comment: 1 MD01917 2 Last Name 3 None 4 Last Name 5 371484003 6 Patient name 7 Patient name (observable entity) 8 Last Name 9 C1301584

Lat Pull-down
type: Class
subclass of: Muscle Strengthening Exercise
comment: 1 MD02629 2 Lat Pull-down 3 lat pull down 4 Lat Pull-down 5 256235009 6 exercise 7 Exercise (observable entity) 8 Exercise 9 C0015259

Lateral Bridge
type: Class
subclass of: Muscle Strengthening Exercise
comment: 1 MD04303 2 Lateral Bridge 3 None 4 Lateral Bridge 5 256235009 6 Exercise 7 Exercise (observable entity) 8 Exercise 9 C0015259

Lateral lumbar region of abdomen
type: Class
subclass of: Hospital information, examination/diagnosis/treatment data
comment: 1 M01394 2 Lateral lumbar region of abdomen 3 None 4 Lateral lumbar region of abdomen 5 58602004 6 Flank 7 Flank structure (body structure) 8 Flank (surface region) 9 C0230171

Lateral region
type: Class
subclass of: Hospital information, examination/diagnosis/treatment data
comment: 1 M01402 2 Lateral region 3 Lateral region of abdomen 4 Lateral region 5 58602004 6 Flank 7 Flank structure (body structure) 8 Flank (surface region) 9 C0230171
alternative label: Lateral region of abdomen

Lateralization of sound
type: Class
subclass of: Sensory function, Pain and Skin function (Body measurement)
comment: 1 MD05761 2 Lateralization of sound 3 None 4 Lateralization of sound 5 247310003 6 Lateralization of sound 7 Lateralization of sound (observable entity) 8 Lateralization of sound 9 C0475406

Latest
type: Class
subclass of: Units
comment: 1 MD01909 2 Latest 3 None 4 Latest 5 6493001 6 Recent 7 Recent (qualifier value) 8 Current (present time) 9 C0521116

Latus
type: Class
subclass of: Hospital information, examination/diagnosis/treatment data
comment: 1 M01422 2 Latus 3 None 4 Latus 5 58602004 6 Flank 7 Flank structure (body structure) 8 Flank (surface region) 9 C0230171

Laundry arrangements
type: Class
subclass of: Health Related Factors
comment: 1 MD05396 2 Laundry arrangements 3 None 4 Laundry arrangements 5 286068000 6 Folds laundry 7 Does fold laundry (finding) 8 Does fold laundry 9 C0563928

Leakage of urine
type: Class
subclass of: Urogenital function (Symptom)
comment: 1 M00503 2 Leakage of urine 3 leakage urine urine leakage 4 Leakage of urine 5 67502006 6 Leakage of urine 7 Extravasation of urine (morphologic abnormality) 8 Leakage of urine 9 C0152245
alternative label: urine leakage
alternative label: leakage urine

Lean Body Mass
type: Class
subclass of: Sensory function, Pain and Skin function (Body measurement)
comment: 1 MD03004 2 Lean Body Mass 3 None 4 Lean Body Mass 5 248362003 6 Lean body mass 7 Lean body mass (observable entity) 8 Lean body mass 9 C0424678

Learning by relating symbolically to objects
type: Class
subclass of: Health Related Factors
comment: 1 MD06128 2 Learning by relating symbolically to objects 3 None 4 Learning by relating symbolically to objects 5 69998004 6 Learning 7 Learning, function (observable entity) 8 Learning through actions by relating two or more objects 9 C2371967

Learning through actions by relating object with regard to specific features
type: Class
subclass of: Health Related Factors
comment: 1 MD06127 2 Learning through actions by relating object with regard to specific features 3 None 4 Learning through actions by relating object with regard to specific features 5 69998004 6 Learning 7 Learning, function (observable entity) 8 Learning through actions by relating two or more objects with regard to specific features 9 C2371968

Learning through actions by relating objects
type: Class
subclass of: Health Related Factors
comment: 1 MD06126 2 Learning through actions by relating objects 3 None 4 Learning through actions by relating objects 5 69998004 6 Learning 7 Learning, function (observable entity) 8 Learning through actions with objects 9 C2371965

Learning through actions with objects
type: Class
subclass of: Health Related Factors
comment: 1 MD06124 2 Learning through actions with objects 3 None 4 Learning through actions with objects 5 69998004 6 Learning 7 Learning, function (observable entity) 8 Learning through actions with objects 9 C2371965

Learning through simple actions with a single object
type: Class
subclass of: Health Related Factors
comment: 1 MD06125 2 Learning through simple actions with a single object 3 None 4 Learning through simple actions with a single object 5 69998004 6 Learning 7 Learning, function (observable entity) 8 Learning through simple actions with a single object 9 C2371966

Learning to calculate
type: Class
subclass of: Health Related Factors
comment: 1 MD06157 2 Learning to calculate 3 None 4 Learning to calculate 5 69998004 6 Learning 7 Learning, function (observable entity) 8 Learning to calculate 9 C2371290

Learning to read
type: Class
subclass of: Health Related Factors
comment: 1 MD06145 2 Learning to read 3 None 4 Learning to read 5 69998004 6 Learning 7 Learning, function (observable entity) 8 Learning to read 9 C2371288

Learning to write
type: Class
subclass of: Health Related Factors
comment: 1 MD06151 2 Learning to write 3 None 4 Learning to write 5 69998004 6 Learning 7 Learning, function (observable entity) 8 Learning to write 9 C2371289

Left
type: Class
subclass of: Units
comment: 1 MD02614 2 left 3 None 4 Left 5 7771000 6 Left 7 Left (qualifier value) 8 Left 9 C0205091

Left hypochondriac region
type: Class
subclass of: Musculoskeletal function (Body region)
comment: 1 M02269 2 Left hypochondriac region 3 Left hypochondriac region structure, Left hypochondriac part of abdomen, Left hypochondrium 4 Left hypochondriac region 5 133945003 6 Left hypochondriac region 7 Left hypochondriac region structure (body structure) 8 Left hypochondriac region structure 9 C0738591
alternative label: Left hypochondriac region structure
alternative label: Left hypochondrium
alternative label: Left hypochondriac part of abdomen

Left iliac fossa viewed surgically
type: Class
subclass of: Musculoskeletal function (Body measurement)
comment: 1 M02314 2 Left iliac fossa viewed surgically 3 None 4 Left iliac fossa viewed surgically 5 243964006 6 Left iliac fossa 7 Structure of left iliac fossa (body structure) 8 Left iliac fossa 9 C0446498

Left iliac region
type: Class
subclass of: Musculoskeletal function (Body region)
comment: 1 M02310 2 Left iliac region 3 None 4 Left iliac region 5 34281002 6 Iliacus muscle 7 Structure of iliacus muscle (body structure) 8 Bone structure of ilium 9 C0020889

Left inguinal region
type: Class
subclass of: Musculoskeletal function (Body region)
comment: 1 M02311 2 Left inguinal region 3 Left inguinal part of abdomen Left inguinal region structure 4 Left inguinal region 5 85119005 6 Left inguinal region 7 Left inguinal region structure (body structure) 8 Left iliac region 9 C0230321
alternative label: Left inguinal part of abdomen
alternative label: Left inguinal region structure

Left lumbar region
type: Class
subclass of: Musculoskeletal function (Body region)
comment: 1 M02430 2 Left lumbar region 3 None 4 Left lumbar region 5 1017210004 6 Left lumbar back region 7 Structure of left lumbar region of back (body structure) 8 Left lumbar region 9 C1297910

Legal policies
type: Class
subclass of: Public Policy Factors
comment: 1 MD06761 2 Legal policies 3 None 4 Legal policies 5 276339004 6 environment 7 Environment (environment) 8 Legal policies 9 C2371787

Legal services
type: Class
subclass of: Public Policy Factors
comment: 1 MD06759 2 Legal services 3 None 4 Legal services 5 224930009 6 services 7 Services (qualifier value) 8 Legal services 9 C2584330

Legal systems
type: Class
subclass of: Public Policy Factors
comment: 1 MD06760 2 Legal systems 3 None 4 Legal systems 5 246333005 6 system 7 System (attribute) 8 Legal systems 9 C0728724

Leisure activities
type: Class
subclass of: Individual Related Factors
comment: 1 MD05326 2 Leisure activities 3 leisure 4 Leisure activities 5 300740003 6 Participates in leisure activities 7 Does participate in leisure activities (finding) 8 Does participate in leisure activity 9 C0577454
alternative label: leisure

Length measurement of amputation stump
type: Class
subclass of: Musculoskeletal function (Body measurement)
comment: 1 MD04419 2 Length measurement of amputation stump 3 None 4 Length measurement of amputation stump 5 401238003 6 Length of wound 7 Length of wound (observable entity) 8 Length of wound (observable entity) 9 C1303203

Lennox-Gastaut syndrome
type: Class
subclass of: Hospital information, examination/diagnosis/treatment data
comment: 1 MD00521 2 Lennox-Gastaut syndrome 3 None 4 Lennox-Gastaut syndrome 5 230418006 6 Lennox-Gastaut syndrome 7 Lennox-Gastaut syndrome (disorder) 8 Lennox-Gastaut syndrome 9 C0238111

Lens of eyeball
type: Class
subclass of: Sensory function, Pain and Skin function (Body region)
comment: 1 MD06862 2 Lens of eyeball 3 None 4 Lens of eyeball 5 78076003 6 lens 7 Structure of lens of eye (body structure) 8 Lens of eyeball 9 C2371862

Leprechaunism
type: Class
subclass of: Functions of Blood System, Metabolic system and Endocrine system (Symptom)
comment: 1 MD00409 2 Leprechaunism 3 None 4 Leprechaunism 5 111307005 6 Leprechaunism 7 Leprechaunism syndrome (disorder) 8 Donohue Syndrome 9 C0265344

Lesch-Nyhan syndrome
type: Class
subclass of: Functions of Blood System, Metabolic system and Endocrine system (Symptom)
comment: 1 MD00503 2 Lesch-Nyhan syndrome 3 None 4 Lesch-Nyhan syndrome 5 10406007 6 Lesch-Nyhan syndrome 7 Lesch-Nyhan syndrome (disorder) 8 Lesch-Nyhan syndrome 9 C0023374

Less
type: Class
subclass of: Urogenital function (Body measurement)
comment: 1 MD01729 2 Less 3 None 4 Less 5 57176003 6 Few 7 Few (qualifier value) 8 Few 9 C0205388

Level of anxiety
type: Class
subclass of: Nervous system and Mental function (Symptom)
comment: 1 M02636 2 Level of anxiety 3 level anxiety 4 Level of anxiety 5 286644009 6 Level of anxiety 7 Level of anxiety (finding) 8 Level of anxiety 9 C0564474
comment: 1 M02636-1 2 Level of anxiety 3 level anxiety 4 Level of anxiety 5 405051006 6 Level of anxiety 7 Level of anxiety (observable entity) 8 Level of anxiety 9 C0564474
alternative label: level anxiety

Level of fever
type: Class
subclass of: Sensory function, Pain and Skin function (Body measurement)
comment: 1 M00153 2 Level of fever 3 None 4 Level of fever 5 386661006 6 Fever 7 Fever (finding) 8 Fever 9 C0015967

Level of mood
type: Class
subclass of: Nervous system and Mental function (Symptom)
comment: 1 M02275 2 Level of mood 3 Mood level 4 Level of mood 5 247774004 6 Level of mood 7 Level of mood (observable entity) 8 Level of mood 9 C0424113
alternative label: Mood level

Level of stress
type: Class
subclass of: Nervous system and Mental function (Body measurement)
comment: 1 M02799 2 Level of stress 3 levels stress, stress level 4 Level of stress 5 405052004 6 Stress level 7 Level of stress (observable entity) 8 Level of stress 9 C1319127
alternative label: level stress
alternative label: stress level
alternative label: levels stress

Lifestyle
type: Class
comment: 1 MD00724 2 lifestyle 3 None 4 lifestyle 5 134436002 6 Lifestyle 7 Lifestyle (finding) 8 Life Style 9 C0023676

Lifetime abstainer from drink
type: Class
subclass of: Individual Related Factors
comment: 1 M02615 2 Lifetime abstainer from drink 3 None 4 Lifetime abstainer from drink 5 783261004 6 Lifetime abstainer from drink 7 Lifetime non-drinker of alcohol (finding) 8 Lifetime non-drinker 9 C0556295

Lifetime non-drinker
type: Class
subclass of: Sub-Cultural Level
comment: 1 M00018 2 Lifetime non-drinker 3 None 4 Lifetime non-drinker 5 783261004 6 Lifetime non-drinker of alcohol 7 Lifetime non-drinker of alcohol (finding) 8 Lifetime non-drinker 9 C0556295

Lifetime teetotaller
type: Class
subclass of: Classification of Patient
comment: 1 M02616 2 Lifetime teetotaller 3 None 4 Lifetime teetotaller 5 783261004 6 Lifetime teetotaller 7 Lifetime non-drinker of alcohol (finding) 8 Lifetime non-drinker 9 C0556295

Lift
type: Class
subclass of: Health Related Factors
comment: 1 M01799 2 Lift 3 lifting, Lifted 4 Lift 5 360304005 6 Lift 7 Lift (physical object) 8 Lift 9 C0181620
alternative label: lifting
alternative label: Lifted

Lift or carry the following weight
type: Class
subclass of: Questionnaire
comment: 1 MD05070 2 Lift or carry the following weight 3 None 4 Lift or carry the following weight 5 844005 6 Behavior finding 7 Behavior finding (finding) 8 Behavior 9 C0004927

Lifting and carrying objects
type: Class
subclass of: Health Related Factors
comment: 1 MD06301 2 Lifting and carrying objects 3 None 4 Lifting and carrying objects 5 260787004 6 objects 7 Physical object (physical object) 8 Lifting and carrying objects 9 C2371396

Ligaments and fasciae of ankle and foot
type: Class
subclass of: Musculoskeletal function (Body region)
comment: 1 MD07077 2 Ligaments and fasciae of ankle and foot 3 None 4 Ligaments and fasciae of ankle and foot 5 304570002 6 Ligament of ankle and foot 7 Structure of ligament of ankle and/or foot (body structure) 8 Ligaments and fasciae of ankle and foot 9 C2371892

Ligaments and fasciae of forearm
type: Class
subclass of: Musculoskeletal function (Body region)
comment: 1 MD07039 2 Ligaments and fasciae of forearm 3 None 4 Ligaments and fasciae of forearm 5 280148004 6 Fascia of forearm 7 Structure of fascia of forearm (body structure) 8 Ligaments and fasciae of forearm 9 C2371071

Ligaments and fasciae of hand
type: Class
subclass of: Musculoskeletal function (Body region)
comment: 1 MD07046 2 Ligaments and fasciae of hand 3 None 4 Ligaments and fasciae of hand 5 123858009 6 Ligament of hand 7 Structure of ligament of hand (body structure) 8 Ligaments and fasciae of hand 9 C2371074
comment: 1 MD07046 2 Ligaments and fasciae of hand 3 None 4 Ligaments and fasciae of hand 5 181780001 6 Fascia of hand 7 Structure of fascia of hand (body structure) 8 Ligaments and fasciae of hand 9 C2371074

Ligaments and fasciae of head and neck region
type: Class
subclass of: Musculoskeletal function (Body region)
comment: 1 MD07017 2 Ligaments and fasciae of head and neck region 3 None 4 Ligaments and fasciae of head and neck region 5 244580001 6 Ligament of head and neck 7 Structure of ligament of head and neck (body structure) 8 Ligaments and fasciae of head and neck region 9 C2371060

Ligaments and fasciae of lower leg
type: Class
subclass of: Musculoskeletal function (Body region)
comment: 1 MD07070 2 Ligaments and fasciae of lower leg 3 None 4 Ligaments and fasciae of lower leg 5 410773000 6 Structure of fascia of lower leg 7 Structure of fascia of lower leg (body structure) 8 Ligaments and fasciae of lower leg 9 C2371887

Ligaments and fasciae of pelvic region
type: Class
subclass of: Musculoskeletal function (Body region)
comment: 1 MD07055 2 Ligaments and fasciae of pelvic region 3 None 4 Ligaments and fasciae of pelvic region 5 9262003 6 Pelvic fascia 7 Pelvic fascia structure (body structure) 8 Ligaments and fasciae of pelvic region 9 C2371081

Ligaments and fasciae of shoulder region
type: Class
subclass of: Musculoskeletal function (Body region)
comment: Body region Musculoskeletal function None 1 MD07024 2 Ligaments and fasciae of shoulder region 3 None 4 Ligaments and fasciae of shoulder region 5 102288007 6 Ligament of shoulder joint 7 Structure of skeletal muscle of shoulder (body structure) 8 Ligaments and fasciae of shoulder region 9 C2371065

Ligaments and fasciae of thigh
type: Class
subclass of: Musculoskeletal function (Body region)
comment: 1 MD07063 2 Ligaments and fasciae of thigh 3 None 4 Ligaments and fasciae of thigh 5 181782009 6 Fascia of thigh 7 Structure of fascia of thigh (body structure) 8 Ligaments and fasciae of thigh 9 C2371883

Ligaments and fasciae of trunk
type: Class
subclass of: Musculoskeletal function (Body region)
comment: 1 MD07091 2 Ligaments and fasciae of trunk 3 None 4 Ligaments and fasciae of trunk 5 68230005 6 Ligament of trunk 7 Skeletal muscle structure of trunk (body structure) 8 Ligaments and fasciae of trunk 9 C2371896

Ligaments and fasciae of upper arm
type: Class
subclass of: Musculoskeletal function (Body region)
comment: 1 MD07032 2 Ligaments and fasciae of upper arm 3 None 4 Ligaments and fasciae of upper arm 5 181777002 6 Fascia of upper arm 7 Structure of fascia of upper arm (body structure) 8 Ligaments and fasciae of upper arm 9 C2371069

Light
type: Class
subclass of: Individual Related Factors
comment: 1 MD01825 2 Light 3 None 4 Light 5 56242006 6 Light 7 Light, electromagnetic radiation (physical force) 8 Light 9 C0023693
comment: 1 MD01825-1 2 Light 3 None 4 Light 5 56242006 6 Light 7 Light, electromagnetic radiation (physical force) 8 Light (qualifier) 9 C1881376
comment: 1 MD01825-2 2 Light 3 None 4 Light 5 371268001 6 Light 7 Light color (qualifier value) 8 Light 9 C0023693
comment: 1 MD01825-3 2 Light 3 None 4 Light 5 371268001 6 Light 7 Light color (qualifier value) 8 Light (qualifier) 9 C1881376

Light Touch
type: Class
subclass of: Sensory function, Pain and Skin function (Body measurement)
comment: 1 MD04075 2 Light Touch 3 None 4 Light Touch 5 247311004 6 Light touch 7 Light touch, function (observable entity) 8 Light touch 9 C0423553

Light cigarette smoker
type: Class
subclass of: Sub-Cultural Level
comment: 1 M00107 2 Light cigarette smoker 3 None 4 Light cigarette smoker 5 230060001 6 Light cigarette smoker 7 Light cigarette smoker (finding) 8 Light cigarette smoker 9 C0459845

Light drinker
type: Class
subclass of: Sub-Cultural Level
comment: 1 M00011 2 Light drinker 3 None 4 Light drinker 5 228277002 6 Light drinker 7 Light drinker (finding) 8 Light drinker 9 C0556299

Light intensity
type: Class
subclass of: Physical/Chemical Environment
comment: 1 MD06661 2 Light intensity 3 None 4 Light intensity 5 371268001 6 Light 7 Light color (qualifier value) 8 Light intensity 9 C0596836

Light quality
type: Class
subclass of: Physical/Chemical Environment
comment: 1 MD06662 2 Light quality 3 None 4 Light quality 5 371268001 6 Light 7 Light color (qualifier value) 8 Light quality 9 C2371699

Light sensitivity
type: Class
subclass of: Sensory function, Pain and Skin function (Body measurement)
comment: 1 MD05740 2 Light sensitivity 3 None 4 Light sensitivity 5 246622003 6 eyes sensitive to light 7 Eyes sensitive to light (finding) 8 Light sensitivity 9 C0085636

Limb
type: Class
subclass of: Musculoskeletal function (Body region)
comment: 1 M00760 2 Limb 3 Limb structure, Limbs 4 Limb 5 66019005 6 Limb 7 Limb structure (body structure) 8 Limb 9 C0015385
alternative label: Limb structure
alternative label: Limbs

Limb wearing abandoned or use of cosmetic limb only.
type: Class
subclass of: Questionnaire
comment: 1 MD04772 2 Limb wearing abandoned or use of cosmetic limb only. 3 None 4 Limb wearing abandoned or use of cosmetic limb only. 5 273389003 6 Daily activities questionnaire 7 Daily activities questionnaire (assessment scale) 8 Daily activities questionnaire 9 C0451094

Linked in
type: Class
subclass of: Units
comment: 1 M05751 2 Linked in 3 None 4 Linked in 5 413568008 6 Application - unit of product usage (qualifier value) 7 Application - unit of product usage (qualifier value) 8 Application dose 9 C1533134

Lip exercises
type: Class
subclass of: Active exercise
comment: 1 M00270 2 Lip exercises 3 None 4 Lip exercises 5 311713001 6 Lip exercises 7 Lip exercises (regime/therapy) 8 Lip exercises 9 C0589310

Listening
type: Class
subclass of: Health Related Factors
comment: 1 MD06116 2 Listening 3 None 4 Listening 5 37931006 6 Listening 7 Auscultation (procedure) 8 Listening 9 C0004339
comment: 1 MD06116-1 2 Listening 3 None 4 Listening 5 37931006 6 Listening 7 Auscultation (procedure) 8 Listening 9 C2584303

Listening skills promotion therapy
type: Class
subclass of: Sensory function, Pain and Skin function (Therapy)
comment: 1 M00582 2 Listening skills promotion therapy 3 None 4 Listening skills promotion therapy 5 311603003 6 Listening skills promotion therapy 7 Listening skills promotion therapy (regime/therapy) 8 Listening skills promotion therapy 9 C0589201

Liter per Hour
type: Class
subclass of: Units
comment: 1 M05447 2 Liter per Hour 3 L/h litre/hour liter/hour l h h l 4 Liter per Hour 5 258856007 6 Liter/hour 7 Liter/hour (qualifier value) 8 Liter/hour 9 C2346686
alternative label: litre/hour
alternative label: liter/hour
alternative label: L/h
alternative label: l h
alternative label: h l

Liter per Kilogram per Day
type: Class
subclass of: Units
comment: 1 M05530 2 Liter per Kilogram per Day 3 L/kg/day L/kg/d 4 Liter per Kilogram per Day 5 419805009 6 Milliliter/gram 7 Milliliter/gram (qualifier value) 8 Milliliter per gram 9 C1637390
alternative label: L/kg/d
alternative label: L/kg/day

Liter per Minute
type: Class
subclass of: Units
comment: 1 M04133 2 Liter per Minute 3 L/min litre/minute Liters per Minute liter/minute 4 Liter per Minute 5 258994006 6 Liter/minute 7 Liter/minute (qualifier value) 8 Liter/minute 9 C0439393
alternative label: Liters per Minute
alternative label: L/min
alternative label: liter/minute
alternative label: litre/minute

Liter per Second
type: Class
subclass of: Units
comment: 1 M04140 2 Liter per Second 3 L/s litre/second liter/second L/sec l s l's s l 4 Liter per Second 5 258995007 6 Litre/second 7 Liter/second (qualifier value) 8 Litre/second 9 C0439394
alternative label: L/sec
alternative label: s l
alternative label: liter/second
alternative label: L/s
alternative label: litre/second
alternative label: l's
alternative label: l s

Liter per kilogram
type: Class
subclass of: Units
comment: 1 M05183 2 Liter per kilogram 3 L/kg Litre per kilogram Liter/Kilogram 4 Liter per kilogram 5 419805009 6 Liter per kilogram 7 Milliliter/gram (qualifier value) 8 Liter per kilogram 9 C1637390
alternative label: Litre per kilogram
alternative label: L/kg

Little Finger
type: Class
subclass of: Musculoskeletal function (Body region)
comment: 1 MD04052 2 Little Finger 3 None 4 Little Finger 5 12406000 6 Little finger 7 Little finger structure (body structure) 8 Little finger 9 C0230403

Liver transplant
type: Class
subclass of: Digestive function (Therapy)
comment: 1 MD00260 2 Liver transplant 3 None 4 Liver transplant 5 3860006 6 transplanted liver 7 Structure of transplanted liver (body structure) 8 Transplantation of liver 9 C0023911

Load included
type: Class
subclass of: Questionnaire
comment: 1 MD05049 2 Load included 3 None 4 Load included 5 55919000 6 Including 7 Including (qualifier value) 8 Including (qualifier) 9 C0332257

Load not included
type: Class
subclass of: Questionnaire
comment: 1 MD05050 2 Load not included 3 None 4 Load not included 5 77765009 6 exclude 7 Exclude (qualifier value) 8 exclude 9 C0332196

Localization of sound source
type: Class
subclass of: Sensory function, Pain and Skin function (Body measurement)
comment: 1 MD05760 2 Localization of sound source 3 None 4 Localization of sound source 5 247297002 6 Localization of sound source 7 Localization of sound source (observable entity) 8 Localization of sound source 9 C0474363

Locking the door
type: Class
subclass of: Health Related Factors
comment: 1 MD05305 2 Locking the door 3 None 4 Locking the door 5 844005 6 Behavior finding 7 Behavior finding (finding) 8 Behavior 9 C0004927

Log international units per milliliter
type: Class
subclass of: Units
comment: 1 M05131 2 Log international units per milliliter 3 LogIU/mL Log international units per millilitre 4 Log international units per milliliter 5 418229004 6 Log international units per milliliter 7 Log international units per milliliter (qualifier value) 8 Log international units per milliliter 9 C1627341
alternative label: Log international units per millilitre
alternative label: LogIU/mL

Long-term Care Hospital
type: Class
subclass of: Classification of Hospital
comment: 1 MD00130 2 Long-term Care Hospital 3 None 4 Long-term Care Hospital 5 32074000 6 Long term care hospital 7 Long term care hospital (environment) 8 Long-term Care Hospital 9 C3845101
comment: 1 MD00158 2 Long-term Care Hospital 3 None 4 Long-term Care Hospital 5 32074000 6 Long term care hospital 7 Long term care hospital (environment) 8 Long-term care hospital (LTC 9 C3845101

Long-term Care Hospital flat rate
type: Class
subclass of: Hospital Administration
comment: 1 MD00157 2 Long-term Care Hospital flat rate 3 None 4 Long-term Care Hospital flat rate 5 32074000 6 Long term care hospital 7 Long term care hospital (environment) 8 Long-term care hospital (LTC 9 C3845101

Long-term exploratory psychotherapy
type: Class
subclass of: Nervous system and Mental function (Therapy)
comment: 1 M00612 2 Long-term exploratory psychotherapy 3 None 4 Long-term exploratory psychotherapy 5 302236003 6 Long-term exploratory psychotherapy 7 Long-term exploratory psychotherapy (regime/therapy) 8 Long-term exploratory psychotherapy 9 C0579053

Long-term memory
type: Class
subclass of: Nervous system and Mental function (Body measurement)
comment: 1 MD05655 2 Long-term memory 3 None 4 Long-term memory 5 247586003 6 Long-term memory 7 Long-term memory performance (observable entity) 8 Long-term memory 9 C0423909

Long Sleeper Syndromes
type: Class
subclass of: Nervous system and Mental function (Symptom)
comment: 1 M02710 2 Long Sleeper Syndromes 3 Long sleeper syndrome 4 Long Sleeper Syndromes 5 443664006 6 Long sleeper syndrome 7 Long sleeper syndrome (disorder) 8 Long Sleeper Syndrome 9 C0751508
alternative label: Long sleeper syndrome

Loose bowel motions
type: Class
subclass of: Digestive function (Symptom)
comment: 1 M00863 2 Loose bowel motions 3 loose bowel motion Loose bowel movement bowel loose movements bowels loose movement 4 Loose bowel motions 5 398032003 6 Loose bowel motions 7 Loose stool (finding) 8 Loose stool 9 C2129214
alternative label: bowels loose movement
alternative label: Loose bowel movement
alternative label: bowel loose movements
alternative label: loose bowel motion

Loose motion
type: Class
subclass of: Digestive function (Symptom)
comment: 1 M00867 2 Loose motion 3 None 4 Loose motion 5 398032003 6 Loose motion 7 Loose stool (finding) 8 Loose stool 9 C2129214

Loose stool
type: Class
subclass of: Digestive function (Symptom)
comment: 1 M00868 2 Loose stool 3 Loose faeces Loose feces 4 Loose stool 5 398032003 6 Loose stool 7 Loose stool (finding) 8 Loose stool 9 C2129214
alternative label: Loose faeces
alternative label: Loose feces

Looxcie
type: Class
subclass of: Units
comment: 1 M05752 2 Looxcie 3 None 4 Looxcie 5 413568008 6 Application - unit of product usage (qualifier value) 7 Application - unit of product usage (qualifier value) 8 Application dose 9 C1533134

Loss
type: Class
subclass of: Units
comment: 1 MD02475 2 Loss 3 None 4 Loss 5 282507001 6 Runs down hill 7 Does run down hill (finding) 8 Does walk down hill 9 C0580818

Loss of appetite
type: Class
subclass of: Hospital information, examination/diagnosis/treatment data
comment: 1 M00504 2 Loss of appetite 3 lost appetite loss of appetite appetite loss 4 Loss of appetite 5 79890006 6 Loss of appetite 7 Loss of appetite (finding) 8 Loss of appetite 9 C1971624

Loss of body fat - finding
type: Class
subclass of: Functions of Blood System, Metabolic system and Endocrine system (Symptom)
comment: 1 M02368 2 Loss of body fat - finding 3 None 4 Loss of body fat - finding 5 248314009 6 Loss of body fat - finding 7 Finding of loss of body fat (finding) 8 Loss of body fat - finding 9 C0424630

Loss of color
type: Class
subclass of: Sensory function, Pain and Skin function (Symptom)
comment: 1 M01265 2 Loss of color 3 loss of colour, color loss, colour loss 4 Loss of color 5 398912001 6 Loss of color 7 Loss of color (finding) 8 Loss of color 9 C1275397
alternative label: loss of colour
alternative label: color loss
alternative label: colour loss

Loss of energy
type: Class
subclass of: Nutritional status
comment: 1 M00995 2 Loss of energy 3 energy loss 4 Loss of energy 5 248274002 6 Lack of energy 7 Lack of energy (finding) 8 Fatigue 9 C0015672
alternative label: energy loss

Loss of hair
type: Class
subclass of: Sensory function, Pain and Skin function (Symptom)
comment: 1 M00667 2 Loss of hair 3 Hair loss, Hair loss disorder 4 Loss of hair 5 278040002 6 Loss of hair 7 Loss of hair (finding) 8 Loss of hair 9 C0002170
alternative label: Hair loss disorder
alternative label: Hair loss

Loss of weight
type: Class
subclass of: Hospital information, examination/diagnosis/treatment data
comment: 1 M01617 2 Loss of weight 3 Weight Losses wt loss Weight loss finding Weight decreasing lose weight loses weight Losing weight loss weight lost weight Weight loss finding loss wt WEIGHTLOSS Weight loss 4 Loss of weight 5 816160009 6 Weight loss 7 Measured weight loss (observable entity) 8 Lose weight 9 C4724568
alternative label: Weight loss
alternative label: WEIGHTLOSS
alternative label: loss weight
alternative label: Weight loss finding
alternative label: loss wt
alternative label: lose weight
alternative label: wt loss
alternative label: Losing weight
alternative label: Weight Losses
alternative label: lost weight
alternative label: loses weight

Low Power Field
type: Class
subclass of: Units
comment: 1 M05100 2 Low Power Field 3 None 4 Low Power Field 5 767525000 6 unit 7 Unit (qualifier value) 8 Unit 9 C0439169

Low blood pressure
type: Class
subclass of: Cardiovascular system function (Symptom)
comment: 1 M00506 2 Low blood pressure 3 blood lowered pressure, blood lowers pressure, blood lowing pressure, blood pressure drop, BLOOD PRESSURE LOW blood pressure lower, drop in blood pressure, dropped blood pressure lower blood pressure, low bp, bp lower 4 Low blood pressure 5 45007003 6 Low blood pressure 7 Low blood pressure (disorder) 8 Low blood pressure 9 C0020649
alternative label: blood pressure lower
alternative label: BLOOD PRESSURE LOW
alternative label: low bp
alternative label: lower blood pressure
alternative label: blood lowered pressure
alternative label: blood lowing pressure
alternative label: blood lowers pressure
alternative label: bp lower

Low density lipoprotein
type: Class
subclass of: Functions of Blood System, Metabolic system and Endocrine system (Body measurement)
comment: 1 MD00030 2 Low density lipoprotein 3 None 4 Low density lipoprotein 5 22644003 6 Low density lipoprotein measurement (procedure) 7 Low density lipoprotein measurement (procedure) 8 Low-Density Lipoproteins 9 C0023823
comment: 1 MD00030-1 2 Low density lipoprotein 3 None 4 Low density lipoprotein 5 22244007 6 LDL 7 Low density lipoprotein (substance) 8 Low-Density Lipoproteins 9 C0023823

Low humidity
type: Class
subclass of: Physical/Chemical Environment
comment: 1 M00251 2 Low humidity 3 Low humidity - physical agent 4 Low humidity 5 44974002 6 Low humidity 7 Low humidity (physical force) 8 Low humidity 9 C0337008
alternative label: Low humidity - physical agent

Low level of physical functioning
type: Class
subclass of: Questionnaire
comment: 1 MD04735 2 Low level of physical functioning 3 None 4 Low level of physical functioning 5 258395000 6 Levels 7 Levels (qualifier value) 8 level of functioning 9 C0935587

Lower Hypopharyngeal Region
type: Class
subclass of: Digestive function (Body region)
comment: 1 M00768 2 Lower Hypopharyngeal Region 3 None 4 Lower Hypopharyngeal Region 5 81502006 6 Hypopharyngeal structure 7 Hypopharyngeal structure (body structure) 8 Pharyngeal area structure 9 C3686743

Lower extremity function
type: Class
subclass of: Musculoskeletal function (Body measurement)
comment: 1 MD04395 2 Lower extremity function 3 None 4 Lower extremity function 5 718860004 6 Lower Extremity Functional Scale score 7 Lower Extremity Functional Scale score (observable entity) 8 Lower Extremity Functional Scale score 9 C4305124

Lower extremity function evaluation
type: Class
subclass of: Tool
comment: 1 MD04394 2 Lower extremity function evaluation 3 None 4 Lower extremity function evaluation 5 443351003 6 Functional capacity evaluation 7 Functional capacity evaluation (assessment scale) 8 Functional capacity evaluation 9 C2732531

Lower limb exercises
type: Class
subclass of: Active exercise
comment: 1 M00288 2 Lower limb exercises 3 Leg exercises, exercise legs, exercises leg, exercises legs, leg exercise 4 Lower limb exercises 5 229152003 6 Lower limb exercises 7 Lower limb exercises (regime/therapy) 8 Lower limb exercises 9 C0454361
alternative label: exercise legs
alternative label: leg exercise
alternative label: Leg exercises
alternative label: exercises legs
alternative label: exercises leg

Lower third of esophagus
type: Class
subclass of: Digestive function (Body region)
comment: 1 M01796 2 Lower third of esophagus 3 Lower Third of the Esophagus, Lower third of oesophagus 4 Lower third of esophagus 5 67173009 6 Lower third of esophagus 7 Structure of lower third of esophagus (body structure) 8 Lower third of esophagus 9 C0227191
alternative label: Lower Third of the Esophagus
alternative label: Lower third of oesophagus

Lowest-Highest
type: Class
subclass of: Units
comment: 1 MD01910 2 Lowest-Highest 3 None 4 Lowest-Highest 5 75540009 6 High 7 High (qualifier value) 8 Highest 9 C1522410
comment: 1 MD01910-1 2 Lowest-Highest 3 None 4 Lowest-Highest 5 62482003 6 Low 7 Low (qualifier value) 8 Lowest 9 C1708760

Lozenge
type: Class
subclass of: Units
comment: 1 M03469 2 Lozenge 3 Lozenge Dosing Unit Lozenge - unit of product usage LOZ 4 Lozenge 5 385087003 6 Lozenge 7 Lozenge (basic dose form) 8 Oral Lozenge 9 C0991564
comment: 1 M03469-1 2 Lozenge 3 Lozenge Dosing Unit Lozenge - unit of product usage LOZ 4 Lozenge 5 385087003 6 Lozenge 7 Lozenge (basic dose form) 8 Lozenge Dosing Unit 9 C1705993
comment: 1 M03469-2 2 Lozenge 3 Lozenge Dosing Unit Lozenge - unit of product usage LOZ 4 Lozenge 5 385087003 6 Lozenge 7 Lozenge (basic dose form) 8 Lozenge (unit of presentation) 9 C4319836
comment: 1 M03469-3 2 Lozenge 3 Lozenge Dosing Unit Lozenge - unit of product usage LOZ 4 Lozenge 5 429587008 6 Lozenge 7 Lozenge - unit of product usage (qualifier value) 8 Oral Lozenge 9 C0991564
comment: 1 M03469-4 2 Lozenge 3 Lozenge Dosing Unit Lozenge - unit of product usage LOZ 4 Lozenge 5 429587008 6 Lozenge 7 Lozenge - unit of product usage (qualifier value) 8 Lozenge Dosing Unit 9 C1705993
comment: 1 M03469-5 2 Lozenge 3 Lozenge Dosing Unit Lozenge - unit of product usage LOZ 4 Lozenge 5 429587008 6 Lozenge 7 Lozenge - unit of product usage (qualifier value) 8 Lozenge (unit of presentation) 9 C4319836
comment: 1 M03469-6 2 Lozenge 3 Lozenge Dosing Unit Lozenge - unit of product usage LOZ 4 Lozenge 5 733000006 6 Lozenge 7 Lozenge (unit of presentation) 8 Oral Lozenge 9 C0991564
comment: 1 M03469-7 2 Lozenge 3 Lozenge Dosing Unit Lozenge - unit of product usage LOZ 4 Lozenge 5 733000006 6 Lozenge 7 Lozenge (unit of presentation) 8 Lozenge Dosing Unit 9 C1705993
comment: 1 M03469-8 2 Lozenge 3 Lozenge Dosing Unit Lozenge - unit of product usage LOZ 4 Lozenge 5 733000006 6 Lozenge 7 Lozenge (unit of presentation) 8 Lozenge (unit of presentation) 9 C4319836
alternative label: Lozenge - unit of product usage
alternative label: Lozenge Dosing Unit
alternative label: LOZ

Lumbar Regions
type: Class
subclass of: Musculoskeletal function (Body region)
comment: 1 M01809 2 umbar 3 Lumbar vertebral column, Lumbar Region, Lumbar region back structure, Lumbar part of back 4 Lumbar Regions 5 1017208001 6 Abdominal lumbar region 7 Structure of abdominal lumbar region (body structure) 8 Lumbar Region 9 C0024090

Lumbar isometric flexion exercises
type: Class
subclass of: Limb
comment: 1 M00354 2 Lumbar isometric flexion exercises 3 None 4 Lumbar isometric flexion exercises 5 229141009 6 Lumbar isometric flexion exercises 7 Lumbar isometric flexion exercises (regime/therapy) 8 Lumbar isometric flexion exercises 9 C0454351

Lumbosacral Region
type: Class
subclass of: Musculoskeletal function (Body region)
comment: 1 M00781 2 Lumbosacral Region 3 Lumbosacral spinal cord, Lumbosacral Regions, Lumbosacral region structure 4 Lumbosacral Region 5 21492008 6 Lumbosacral region 7 Structure of lumbar and/or sacral region of back (body structure) 8 Lumbosacral region 9 C0024094
alternative label: Lumbosacral Regions
alternative label: Lumbosacral region structure
alternative label: lumbosacral spinal cord

Lumbrical exercises
type: Class
subclass of: Limb
comment: 1 M00355 2 Lumbrical exercises 3 None 4 Lumbrical exercises 5 229162005 6 Lumbrical exercises 7 Lumbrical exercises (regime/therapy) 8 Lumbrical exercises 9 C0454371

Lumen
type: Class
subclass of: Units
comment: 1 M05094 2 Lumen 3Im Units Of Measure - lumen 4 Lumen 5 113342003 6 Lumen 7 Structure of lumen of body system (body structure) 8 Lumen 9 C0524461
comment: 1 M05094-1 2 Lumen 3 lm Units Of Measure - lumen 4 Lumen 5 113342003 6 Lumen 7 Structure of lumen of body system (body structure) 8 Lumen 9 C1301906
comment: 1 M05094-2 2 Lumen 3 lm Units Of Measure - lumen 4 Lumen 5 398252006 6 Lumen 7 Lumen (qualifier value) 8 Lumen 9 C0524461
comment: 1 M05094-3 2 Lumen 3 lm Units Of Measure - lumen 4 Lumen 5 398252006 6 Lumen 7 Lumen (qualifier value) 8 Lumen 9 C1301906
alternative label: Units Of Measure - lumen

Lunar cycles
type: Class
subclass of: Frequency
comment: 1 MD06667 2 Lunar cycles 3 None 4 Lunar cycles 5 259025008 6 cycles/s 7 Hertz (qualifier value) 8 Lunar cycles 9 C0079709

Lungs
type: Class
subclass of: Respiratory function (Body region)
comment: 1 MD06943 2 Lungs 3 lung 4 Lungs 5 39607008 6 lung 7 Lung structure (body structure) 8 Lungs 9 C0024109
alternative label: lung

Lying down
type: Class
subclass of: Health Related Factors
comment: 1 MD06276 2 Lying down 3 None 4 Lying down 5 282927009 6 Lies down 7 Does lie down (finding) 8 Lying down 9 C2584317
alternative label: Conversation and use of communication devices and techniques, other

Lymphadenopathy
type: Class
subclass of: Immune system function (Symptom)
comment: 1 M02524 2 Lymphadenopathy 3 lymphadenopathies 4 Lymphadenopathy 5 30746006 6 Lymphadenopathy 7 Lymphadenopathy (disorder) 8 Lymphadenopathy 9 C0497156
alternative label: lymphadenopathies

Lymphatic Disorders
type: Class
subclass of: Immune system function (Symptom)
comment: 1 M02525 2 Lymphatic Disorders 3 None 4 Lymphatic Disorders 5 3305006 6 Disorder of lymphatics 7 Disorder of lymphatic vessel (disorder) 8 Lymphatic Diseases 9 C0024228

Lymphatic nodes
type: Class
subclass of: Immune system function (Body region)
comment: 1 MD06935 2 Lymphatic nodes 3 None 4 Lymphatic nodes 5 314733003 6 lymphatics of lymph node 7 Structure of lymphatic vessel of lymph node (body structure) 8 Lymphatic nodes 9 C2371027

Lymphatic vessels
type: Class
subclass of: Immune system function (Body region)
comment: 1 MD06934 2 Lymphatic vessels 3 None 4 Lymphatic vessels 5 83555006 6 lymphatic vessle 7 Structure of lymphatic vessel (body structure) 8 Lymphatic vessels 9 C0229889

MCP
type: Class
subclass of: Musculoskeletal function (Body region)
comment: 1 MD04026 2 MCP 3 None 4 MCP 5 36455000 6 Metacarpal bone 7 Metacarpal bone structure (body structure) 8 Metacarpal bone 9 C0025526

MCP Flexion
type: Class
subclass of: Musculoskeletal function (Body measurement)
comment: 1 MD04025 2 MCP Flexion 3 None 4 MCP Flexion 5 299063008 6 Range of finger flexion 7 Range of finger flexion (observable entity) 8 Range of finger flexion 9 C0575831

MHz
type: Class
subclass of: Units
comment: 1 M03131 2 Megahertz 3 Megaherz 4 MHz 5 229764000 6 MHz 7 Megahertz (qualifier value) 8 MHz 9 C0556962

MIU
type: Class
subclass of: Units
comment: 1 M05389 2 MIU 3 None 4 MIU 5 258999001 6 mIU 7 milliinternational unit (qualifier value) 8 mIU 9 C0439455

MMT
type: Class
subclass of: Tool
comment: 1 MD03501 2 MMT 3 None 4 MMT 5 273677009 6 MMT - Manual muscle test 7 Oxford grading scale for muscle strength (assessment scale) 8 Manual muscle testing 9 C0699782
comment: 1 MD03616 2 MMT 3 None 4 MMT 5 273677009 6 MMT - Manual muscle test 7 Oxford grading scale for muscle strength (assessment scale) 8 Manual testing of muscle function 9 C0204051

MNA-SF
type: Class
subclass of: Tool
comment: 1 MD03257 2 MNA-SF 3 None 4 MNA-SF 5 895537006 6 MNA - Mini Nutritional Assessment 7 Mini Nutritional Assessment (assessment scale) 8 Mini Nutritional Assessment 9 C3850124
alternative label: Osteoporotic fracture probability assessment tool

MOCA-K
type: Class
subclass of: Tool
comment: 1 MD03259 2 MOCA-K 3 None 4 MOCA-K 5 443597000 6 MoCA - Model of creative ability 7 Model of creative ability assessment scale (assessment scale) 8 Montreal cognitive assessment score 9 C4721272

MOOD ALTERED
type: Class
subclass of: Nervous system and Mental function (Symptom)
comment: 1 M01673 2 MOOD ALTERED 3 ALTERED MOOD, altered moods 4 MOOD ALTERED 5 48079002 6 Mood alteration 7 Disturbance in mood (finding) 8 Mood swings 9 C0085633
alternative label: ALTERED MOOD
alternative label: altered moods

MOOD VARIABLE
type: Class
subclass of: Nervous system and Mental function (Symptom)
comment: 1 M01678 2 MOOD VARIABLE 3 Variable mood 4 MOOD VARIABLE 5 18963009 6 Variable mood 7 Mood swings (finding) 8 Variable mood 9 C0085633
alternative label: Variable mood

MP
type: Class
subclass of: Musculoskeletal function (Body region)
comment: 1 MD04039 2 MP 3 None 4 MP 5 70420003 6 Metacarpophalangeal joint 7 Metacarpophalangeal joint structure (body structure) 8 Metacarpophalangeal joint structure 9 C0025525

MP flexion
type: Class
subclass of: Musculoskeletal function (Body measurement)
comment: 1 MD04038 2 MP flexion 3 None 4 MP flexion 5 299063008 6 Range of finger flexion 7 Range of finger flexion (observable entity) 8 Range of finger flexion 9 C0575831

MRC grade
type: Class
subclass of: Tool
comment: 1 MD04693 2 MRC grade 3 None 4 MRC grade 5 249956007 6 MRC grade-muscle power 7 Medical Research Council grade - muscle power (observable entity) 8 MRC grade-muscle power 9 C0427079

MRI diagnosis
type: Class
subclass of: Hospital information, examination/diagnosis/treatment data
comment: 1 MD00209 2 MRI diagnosis 3 None 4 MRI diagnosis 5 4251000179103 6 Magnetic resonance imaging report 7 Magnetic resonance imaging report (record artifact) 8 Magnetic resonance imaging report 9 C4274375

MUSCLE DISCOMFORT
type: Class
subclass of: Musculoskeletal function (Symptom)
comment: 1 M01826 2 MUSCLE DISCOMFORT 3 None 4 MUSCLE DISCOMFORT 5 68962001 6 Muscle pain 7 Muscle pain (finding) 8 Myalgia 9 C0231528

Macular degeneration
type: Class
subclass of: Hospital information, examination/diagnosis/treatment data
comment: 1 MD00464 2 Macular degeneration 3 None 4 Macular degeneration 5 267718000 6 Senile macular degeneration 7 Age-related macular degeneration (disorder) 8 Macular degeneration 9 C0024437

Magnetic Resonance Imaging
type: Class
subclass of: Hospital information, examination/diagnosis/treatment data
comment: 1 MD03033 2 Magnetic Resonance Imaging 3 None 4 Magnetic Resonance Imaging 5 113091000 6 Magnetic resonance imaging 7 Magnetic resonance imaging (procedure) 8 Magnetic resonance imaging 9 C0024485
comment: 1 MD03033-1 2 Magnetic Resonance Imaging 3 None 4 Magnetic Resonance Imaging 5 312250003 6 Magnetic resonance imaging 7 Magnetic resonance imaging - action (qualifier value) 8 Magnetic resonance imaging 9 C0024485

Maintaining a job
type: Class
subclass of: Individual Related Factors
comment: 1 MD06521 2 Maintaining a job 3 None 4 Maintaining a job 5 385630006 6 Maintained 7 Maintained (qualifier value) 8 Maintaining a job 9 C2371584

Maintaining a kneeling position
type: Class
subclass of: Health Related Factors
comment: 1 MD06289 2 Maintaining a kneeling position 3 None 4 Maintaining a kneeling position 5 714867006 6 Ability to maintain kneeling position 7 Ability to maintain kneeling position (observable entity) 8 Maintaining a kneeling position 9 C2371386

Maintaining a lying position
type: Class
subclass of: Health Related Factors
comment: 1 MD06287 2 Maintaining a lying position 3 None 4 Maintaining a lying position 5 102538003 6 Lying position 7 Recumbent body position (finding) 8 Maintaining a lying position 9 C2371384

Maintaining a safe environment and responding to emergency situations
type: Class
subclass of: Health Related Factors
comment: 1 MD05518 2 Maintaining a safe environment and responding to emergency situations 3 None 4 Maintaining a safe environment and responding to emergency situations 5 406201004 6 Safety behavior 7 Safety behavior (observable entity) 8 Safety behavior 9 C1321226

Maintaining a sitting position
type: Class
subclass of: Health Related Factors
comment: 1 MD06290 2 Maintaining a sitting position 3 None 4 Maintaining a sitting position 5 282861007 6 Maintains a sitting position 7 does maintain a sitting position (finding) 8 Maintaining a sitting position 9 C2584316

Maintaining a squatting position
type: Class
subclass of: Health Related Factors
comment: 1 MD06288 2 Maintaining a squatting position 3 None 4 Maintaining a squatting position 5 714877008 6 Does maintain a squatting position 7 Does maintain a squatting position (finding) 8 Maintaining a squatting position 9 C2371385

Maintaining a standing position
type: Class
subclass of: Health Related Factors
comment: 1 MD06291 2 Maintaining a standing position 3 None 4 Maintaining a standing position 5 282855009 6 Maintains a standing position 7 Does maintain a standing position (finding) 8 Maintaining a standing position 9 C2584315

Maintaining and managing the home environment
type: Class
subclass of: Health Related Factors
comment: 1 MD05523 2 Maintaining and managing the home environment 3 None 4 Maintaining and managing the home environment 5 264362003 6 Home 7 Home (environment) 8 Home environment 9 C0442519

Maintaining assistive devices
type: Class
subclass of: Health Related Factors
comment: 1 MD06443 2 Maintaining assistive devices 3 None 4 Maintaining assistive devices 5 49062001 6 Device 7 Device (physical object) 8 Maintaining assistive devices 9 C2371513

Maintaining body position
type: Class
subclass of: Health Related Factors
comment: 1 MD06286 2 Maintaining body position 3 None 4 Maintaining body position 5 397155001 6 Body position 7 Body position (observable entity) 8 Maintaining a body position 9 C2371383

Maintaining domestic appliances
type: Class
subclass of: Health Related Factors
comment: 1 MD06441 2 Maintaining domestic appliances 3 None 4 Maintaining domestic appliances 5 285970003 6 Ability to control domestic appliances 7 Ability to control domestic appliances (observable entity) 8 Maintaining domestic appliances 9 C2371511

Maintaining dwelling and furnishings
type: Class
subclass of: Health Related Factors
comment: 1 MD06440 2 Maintaining dwelling and furnishings 3 None 4 Maintaining dwelling and furnishings 5 705390009 6 Home and premises assistive furnishing/adaptation 7 Home and premises assistive furnishing/adaptation (physical object) 8 Maintaining dwelling and furnishings 9 C2371510

Maintaining head position
type: Class
subclass of: Health Related Factors
comment: 1 MD06292 2 Maintaining head position 3 None 4 Maintaining head position 5 304631003 6 Head position 7 Head position finding (finding) 8 Maintaining head position 9 C2372045

Maintaining social space
type: Class
subclass of: Individual Related Factors
comment: 1 MD06476 2 Maintaining social space 3 None 4 Maintaining social space 5 385630006 6 Maintained (qualifier value) 7 Maintained (qualifier value) 8 Maintaining social space 9 C2371546

Maintaining vehicles
type: Class
subclass of: Health Related Factors
comment: 1 MD06442 2 Maintaining vehicles 3 None 4 Maintaining vehicles 5 261324000 6 Vehicle 7 Vehicle (physical object) 8 Maintaining vehicles 9 C2371512

Maintenance of blood pressure
type: Class
subclass of: Cardiovascular system function (Body measurement)
comment: 1 MD05849 2 Maintenance of blood pressure 3 None 4 Maintenance of blood pressure 5 385846000 6 manage blood pressure 7 Blood pressure taking management (procedure) 8 Maintenance of blood pressure 9 C2371017

Maintenance of body temperature
type: Class
subclass of: Functions of Blood System, Metabolic system and Endocrine system (Body measurement)
comment: 1 MD05966 2 Maintenance of body temperature 3 None 4 Maintenance of body temperature 5 386726008 6 Thermoregulation, function 7 Thermoregulation, function (observable entity) 8 Maintenance of body temperature 9 C2371151

Maintenance of sleep
type: Class
subclass of: Individual Related Factors
comment: 1 MD05640 2 Maintenance of sleep 3 None 4 Maintenance of sleep 5 401175000 6 Sleep pattern finding 7 Sleep pattern finding (finding) 8 Maintenance of sleep 9 C2370870

Maintenance of water balance
type: Class
subclass of: Functions of Blood System, Metabolic system and Endocrine system (Body measurement)
comment: 1 MD05958 2 Maintenance of water balance 3 None 4 Maintenance of water balance 5 386746003 6 Maintenance - action 7 Maintenance - action (qualifier value) 8 Maintenance of water balance 9 C2371145

Major hand
type: Class
subclass of: Musculoskeletal function (Body measurement)
comment: 1 MD03988 2 Major hand 3 None 4 Major hand 5 263557007 6 Dominant hand 7 Dominant hand (attribute) 8 Dominant hand 9 C0449722

Making a range of sounds
type: Class
subclass of: Voice and Speaking (Body measurement)
comment: 1 MD05828 2 Making a range of sounds 3 None 4 Making a range of sounds 5 278288005 6 vocalization 7 Vocalization (finding) 8 Making a range of sounds 9 C2370988

Making and repairing clothes
type: Class
subclass of: Health Related Factors
comment: 1 MD06439 2 Making and repairing clothes 3 None 4 Making and repairing clothes 5 272180002 6 Clothes 7 Garment (physical object) 8 Making and repairing clothes 9 C2371509

Making decisions
type: Class
subclass of: Health Related Factors
comment: 1 MD06192 2 Making decisions 3 None 4 Making decisions 5 844005 6 Behavior finding 7 Behavior finding (finding) 8 Making decisions 9 C0011109

Making kimchi stew
type: Class
subclass of: Health Related Factors
comment: 1 MD05376 2 Making kimchi stew 3 None 4 Making kimchi stew 5 424226004 6 Cooks food 7 Using device (attribute) 8 Does cook food 9 C0564354

Making sandwich
type: Class
subclass of: Health Related Factors
comment: 1 MD05373 2 Making sandwich 3 None 4 Making sandwich 5 844005 6 Behavior finding 7 Behavior finding (finding) 8 Behavior 9 C0004927

Male
type: Class
subclass of: Units
comment: 1 MD00984 2 Male 3 None 4 Male 5 10052007 6 Male 7 Male structure (body structure) 8 Males 9 C0086582
comment: 1 MD00984-1 2 Male 3 None 4 Male 5 248153007 6 Male 7 Male (finding) 8 Males 9 C0086582

Malformation
type: Class
subclass of: Hospital information, examination/diagnosis/treatment data
comment: 1 MD00371 2 Malformation 3 None 4 Malformation 5 6081001 6 Deformity 7 Deformity (morphologic abnormality) 8 Deformity 9 C0302142

Malnutrition
type: Class
subclass of: Nutritional status
comment: 1 M00467 2 Malnutrition 3 Malnourished, nutrition poor, NUTRITIONAL DEFIC, Nutritional deficiencies, Nutritional Deficiency, POOR NUTRITION, Nutritional deficiency disorder, deficiencies disorders nutritional, deficiency disorders nutritional 4 Malnutrition 5 47563007 6 Nutritional deficiency 7 Nutritional deficiency (finding) 8 Nutritional deficiency 9 C4761312
comment: 1 M00467-1 2 Malnutrition 3 Malnourished, nutrition poor, NUTRITIONAL DEFIC, Nutritional deficiencies, Nutritional Deficiency, POOR NUTRITION, Nutritional deficiency, Nutritional deficiency disorder, deficiencies disorders nutritional, deficiency disorders nutritional 4 Malnutrition 5 2492009 6 Malnutrition 7 Nutritional disorder (disorder) 8 Malnutrition 9 C0162429
alternative label: Malnourished
alternative label: deficiencies disorders nutritional
alternative label: POOR NUTRITION
alternative label: nutrition poor
alternative label: Nutritional Deficiency
alternative label: deficiency disorders nutritional
alternative label: Nutritional deficiency disorder
alternative label: NUTRITIONAL DEFIC
alternative label: Nutritional deficiencies

Manage your belongings
type: Class
subclass of: Health Related Factors
comment: 1 MD05297 2 Manage your belongings 3 None 4 Manage your belongings 5 129271007 6 Managemet 7 Management - action (qualifier value) 8 Caring for personal belongings 9 C4534406

Managing daily routine
type: Class
subclass of: Health Related Factors
comment: 1 MD06211 2 Managing daily routine 3 None 4 Managing daily routine 5 844005 6 Behavior finding 7 Behavior finding (finding) 8 Managing daily routine 9 C2371321

Managing diet and fitness
type: Class
subclass of: Health Related Factors
comment: 1 MD06405 2 Managing diet and fitness 3 None 4 Managing diet and fitness 5 41829006 6 Diet 7 Dietary finding (finding) 8 Managing diet and fitness 9 C2371474

Managing my salary
type: Class
subclass of: Health Related Factors
comment: 1 MD05423 2 Managing my salary 3 None 4 Managing my salary 5 129010006 6 Managing money 7 Managing money (observable entity) 8 Managing money 9 C1290957

Mandibulofacial dysostosis
type: Class
subclass of: Musculoskeletal function (Symptom)
comment: 1 MD00440 2 Mandibulofacial dysostosis 3 None 4 Mandibulofacial dysostosis 5 82203000 6 Mandibulofacial dysostosis 7 Treacher Collins syndrome (disorder) 8 Mandibulofacial dysostosis 9 C0242387

Manipulation
type: Class
subclass of: Health Related Factors
comment: 1 MD04113 2 Manipulation 3 Manipulating 4 Manipulation 5 19207007 6 Manipulation 7 Manipulation (procedure) 8 Manipulation 9 C0947647
alternative label: Manipulating

Manipulation of food in the mouth
type: Class
subclass of: Digestive function (Body measurement)
comment: 1 MD05911 2 Manipulation of food in the mouth 3 None 4 Manipulation of food in the mouth 5 44678002 6 Mouth manipulation 7 Manipulation of mouth (procedure) 8 Manipulation of food in the mouth 9 C2371115

Manual
type: Class
subclass of: Units
comment: 1 MD02473 2 Manual 3 None 4 Manual 5 87982008 6 Manual 7 Manual (qualifier value) 8 Manual 9 C0175674

Manual Muscle Test
type: Class
subclass of: Questionnaire
comment: 1 MD04053 2 Manual muscle test 3 Manual Muscle Test 4 Manual Muscle Test 5 273677009 6 Manual muscle test 7 Oxford grading scale for muscle strength (assessment scale) 8 Manual muscle test 9 C0451362

Manual muscle test
type: Class
subclass of: Tool
comment: 1 MD03090 2 Manual muscle test 3 Manual Muscle Test 4 Manual muscle test 5 273677009 6 Manual muscle test 7 Oxford grading scale for muscle strength (assessment scale) 8 Manual testing of muscle function 9 C0204051

Manufactured Baseball
type: Class
subclass of: Sport
comment: 1 M00697 2 Manufactured Baseball 3 None 4 Manufactured Baseball 5 21471008 6 Baseball 7 Baseball (qualifier value) 8 Manufactured Baseball 9 C0004796

Manufactured basketball
type: Class
subclass of: Device
comment: 1 M02126 2 Manufactured basketball 3 None 4 Manufactured basketball 5 46440007 6 basketball 7 Basketball, device (physical object) 8 Manufactured basketball 9 C0336987

Map
type: Class
subclass of: Units
comment: 1 MD02472 2 Map 3 None 4 Map 5 86967005 6 Tool 7 Tool, device (physical object) 8 Unit 9 C0439148

MapMyFitness
type: Class
subclass of: Units
comment: 1 M05753 2 MapMyFitness 3 None 4 MapMyFitness 5 413568008 6 Application - unit of product usage (qualifier value) 7 Application - unit of product usage (qualifier value) 8 Application dose 9 C1533134

Marantic atrophy
type: Class
subclass of: Nervous system and Mental function (Symptom)
comment: 1 M01683 2 Marantic atrophy 3 None 4 Marantic atrophy 5 29740003 6 Marantic atrophy 7 Nutritional marasmus (disorder) 8 Marantic atrophy 9 C0086588

Marasmus
type: Class
subclass of: Disorder of nutrition
comment: 1 M05889 2 Marasmus 3 None 4 Marasmus 5 29740003 6 Marasmus infantilis 7 Nutritional marasmus (disorder) 8 Marasmus 9 C0086588

Marasmus infantilis
type: Class
subclass of: Nervous system and Mental function (Symptom)
comment: 1 M01685 2 Marasmus infantilis 3 None 4 Marasmus infantilis 5 29740003 6 Marasmus infantilis 7 Nutritional marasmus (disorder) 8 Marasmus infantilis 9 C0086588

Marasmus lactantium
type: Class
subclass of: Nervous system and Mental function (Symptom)
comment: 1 M01686 2 Marasmus lactantium 3 None 4 Marasmus lactantium 5 29740003 6 Marasmus lactantium 7 Nutritional marasmus (disorder) 8 Marasmus lactantium 9 C0086588

Marcor
type: Class
subclass of: Nervous system and Mental function (Symptom)
comment: 1 M01687 2 Marcor 3 None 4 Marcor 5 29740003 6 Marcor 7 Nutritional marasmus (disorder) 8 Marcor 9 C0086588

Marfan syndrome
type: Class
subclass of: Hospital information, examination/diagnosis/treatment data
comment: 1 MD00449 2 Marfan syndrome 3 None 4 Marfan syndrome 5 19346006 6 Marfan syndrome 7 Marfan's syndrome (disorder) 8 Marfan Syndrome 9 C0024796

Marital status
type: Class
subclass of: Units
comment: 1 MD03290 2 Marital status 3 None 4 Marital status 5 125680007 6 Marital status 7 Marital status (observable entity) 8 Marital status 9 C0024819

Marriage Age
type: Class
subclass of: Units
comment: 1 MD00790 2 Marriage Age 3 None 4 Marriage Age 5 160787000 6 Marriage 7 Marriage, life event (finding) 8 Marriage age 9 C0024842

Mass Percentage
type: Class
subclass of: Units
comment: 1 M05339 2 Mass Percentage 3 Percent by Mass 4 Mass Percentage 5 767525000 6 unit 7 Unit (qualifier value) 8 Unit 9 C0439184
alternative label: Percent by Mass

Mass per unit area
type: Class
subclass of: Units
comment: 1 M03324 2 Mass per unit area 3 None 4 Mass per unit area 5 396176002 6 Mass per unit area 7 Mass per unit area (qualifier value) 8 Mass per unit area 9 C1300570

Mass per unit mass
type: Class
subclass of: Units
comment: 1 M03162 2 Mass per unit mass 3 None 4 Mass per unit mass 5 282264007 6 Mass per unit mass 7 Mass per unit mass (qualifier value) 8 Mass per unit mass 9 C0560151

Mass per unit molar quantity
type: Class
subclass of: Units
comment: 1 M03284 2 Mass per unit molar quantity 3 None 4 Mass per unit molar quantity 5 289943001 6 Mass per unit molar quantity 7 Mass per unit molar quantity (qualifier value) 8 Mass per unit molar quantity 9 C0567348

Massage therapy
type: Class
subclass of: Musculoskeletal function (Therapy)
comment: 1 M00583 2 Massage therapy 3 "therapy massage massage therapies Massage physiotherapy" 4 Massage therapy 5 387854002 6 Massage therapy 7 Massage physiotherapy (regime/therapy) 8 Massage therapy 9 C3536731
alternative label: massage therapies
alternative label: therapy massage
alternative label: Massage physiotherapy

Mastication
type: Class
subclass of: Health Related Factors
comment: 1 M01230 2 Mastication 3 None 4 Mastication 5 1202003 6 Mastication 7 Mastication (observable entity) 8 Chewing 9 C1549534

Masticatory exercises
type: Class
subclass of: Active exercise
comment: 1 M00271 2 Masticatory exercises 3 None 4 Masticatory exercises 5 183285004 6 Masticatory exercises 7 Masticatory exercises (regime/therapy) 8 Masticatory exercises 9 C0419105

Max Rep Tot Work
type: Class
subclass of: Units
comment: 1 MD03125 2 Max Rep Tot Work 3 None 4 Max Rep Tot Work 5 767524001 6 Unit of measure 7 Unit of measure (qualifier value) 8 Unit 9 C0439148

MeV
type: Class
subclass of: Units
comment: 1 M03126 2 MeV 3 None 4 MeV 5 229036003 6 MeV 7 mega electronvolt (qualifier value) 8 mega electronvolt 9 C0556642

Meal preparation
type: Class
subclass of: Health Related Factors
comment: 1 MD05348 2 Meal preparation 3 None 4 Meal preparation 5 286491009 6 Prepares meal 7 Does prepare meal (finding) 8 meal preparation: prepare meal 9 C3468944

Mealsnap
type: Class
subclass of: Units
comment: 1 M05754 2 Mealsnap 3 None 4 Mealsnap 5 413568008 6 Application - unit of product usage (qualifier value) 7 Application - unit of product usage (qualifier value) 8 Application dose 9 C1533134

Measles-mumps-rubella
type: Class
subclass of: Hospital information, examination/diagnosis/treatment data
comment: 1 MD00978 2 Measles-mumps-rubella 3 None 4 Measles-mumps-rubella 5 14189004 6 Measles 7 Measles (disorder) 8 Measles 9 C0025007
comment: 1 MD00978-1 2 Measles-mumps-rubella 3 None 4 Measles-mumps-rubella 5 36989005 6 Mumps 7 Mumps (disorder) 8 Mumps 9 C0026780
comment: 1 MD00978-2 2 Measles-mumps-rubella 3 None 4 Measles-mumps-rubella 5 36653000 6 rubella 7 Rubella (disorder) 8 rubella 9 C0035920

Measure the distance between the thumb and the rest of the fingertips
type: Class
subclass of: Musculoskeletal function (Body measurement)
comment: 1 MD04130 2 Measure the distance between the thumb and the rest of the fingertips 3 None 4 Measure the distance between the thumb and the rest of the fingertips 5 248326004 6 Body measure 7 Body measure (observable entity) 8 Body measure procedure 9 C0203910

Measure the forward and lateral girders with a goniometer.
type: Class
subclass of: Questionnaire
comment: 1 MD04827 2 Measure the forward and lateral girders with a goniometer. 3 None 4 Measure the forward and lateral girders with a goniometer. 5 246445000 6 Measure 7 Measure (attribute) 8 Measures 9 C0079809

Meat
type: Class
subclass of: Nutritional management
comment: 1 MD00854 2 Meat 3 None 4 Meat 5 28647000 6 Meat 7 Meat (substance) 8 Meat 9 C0025017

Media policies
type: Class
subclass of: Public Policy Factors
comment: 1 MD06773 2 Media policies 3 None 4 Media policies 5 276339004 6 environment 7 Environment (environment) 8 Media policies 9 C2371799

Media services
type: Class
subclass of: Public Policy Factors
comment: 1 MD06771 2 Media services 3 None 4 Media services 5 224930009 6 services 7 Services (qualifier value) 8 Media services 9 C2371797

Media systems
type: Class
subclass of: Public Policy Factors
comment: 1 MD06772 2 Media systems 3 None 4 Media systems 5 246333005 6 system 7 System (attribute) 8 Media systems 9 C2371798

Mediastinum
type: Class
subclass of: Musculoskeletal function (Body region)
comment: 1 M00791 2 Mediastinum 3 Mediastinal, Mediastinal structure, Mediastinal part of chest 4 Mediastinum 5 72410000 6 Mediastinum 7 Mediastinal structure (body structure) 8 Mediastinum 9 C0025066
alternative label: Mediastinal
alternative label: Mediastinal structure
alternative label: Mediastinal part of chest

Medical Expert Assessment
type: Class
subclass of: Hospital information, examination/diagnosis/treatment data
comment: 1 MD03080 2 Medical Expert Assessment 3 None 4 Medical Expert Assessment 5 225886003 6 Medical assessment 7 Medical assessment (procedure) 8 Medical Examination 9 C0582103

Medical care benefits
type: Class
subclass of: Hospital Administration
comment: 1 MD00164 2 Medical care benefits 3 None 4 Medical care benefits 5 781087000 6 Medical care 7 Medical care (regime/therapy) 8 Health Benefits 9 C0086387

Medical expert opinion
type: Class
subclass of: Hospital information, examination/diagnosis/treatment data
comment: 1 MD03963 2 Medical expert opinion 3 medical expert opinions 4 Medical expert opinion 5 371545006 6 Confirmatory consultation report 7 Confirmatory consultation report (record artifact) 8 Expert Opinion 9 C0600219
alternative label: medical expert opinions

Medication management
type: Class
subclass of: Health Related Factors
comment: 1 MD05444 2 Medication management 3 None 4 Medication management 5 182832007 6 Medication management 7 Procedure related to management of drug administration (procedure) 8 Medication management 9 C0150270

Medicine Institutions
type: Class
subclass of: Classification of Hospital
comment: 1 MD00123 2 Medicine_Institutions 3 None 4 Medicine_Institutions 5 385437003 6 Institution 7 Institution (social concept) 8 Institution (social concept) 9 C1272753

Medisana
type: Class
subclass of: Units
comment: 1 M05755 2 Medisana 3 None 4 Medisana 5 413568008 6 Application - unit of product usage (qualifier value) 7 Application - unit of product usage (qualifier value) 8 Application dose 9 C1533134

Medium
type: Class
subclass of: Units
subclass of: Urogenital function (Body measurement)
comment: Body measurement Urogenital function None 1 MD01730 2 Medium 3 None 4 Medium 5 255508009 6 Medium 7 Medium (qualifier value) 8 Medium 9 C0439536
comment: Units None None 1 MD01883 2 Medium 3 None 4 Medium 5 255508009 6 Medium 7 Medium (qualifier value) 8 Medium 9 C0439536

Medulla oblongata
type: Class
subclass of: Nervous system and Mental function (Body region)
comment: 1 MD06833 2 Medulla oblongata 3 None 4 Medulla oblongata 5 26519002 6 Medulla oblongata 7 Medulla oblongata structure (body structure) 8 Medulla oblongata 9 C0025148

Mega-International Unit
type: Class
subclass of: Units
comment: 1 M05392 2 Mega International Unit 3 Megainternational Unit 4 Mega-International Unit 5 408165006 6 Megainternational unit 7 Megainternational unit (qualifier value) 8 Megainternational unit 9 C1881842

Mega International Unit
type: Class
subclass of: Units
comment: 1 M05394 2 Mega International Unit 3 Mega-International Unit Megainternational Unit 4 Mega International Unit 5 408165008 6 Megainternational unit 7 Megainternational unit (qualifier value) 8 Megainternational unit 9 C1881844
alternative label: Megainternational Unit

Megabecquerel
type: Class
subclass of: Units
comment: 1 M04496 2 Megabecquerel 3 MBq 4 Megabecquerel 5 229034000 6 Megabecquerel 7 Megabecquerel (qualifier value) 8 Megabecquerel 9 C0556640
alternative label: MBq

Megabecquerel per Gram
type: Class
subclass of: Units
comment: 1 M05467 2 Megabecquerel per Gram 3 MBq/g 4 Megabecquerel per Gram 5 767525000 6 unit 7 Unit (qualifier value) 8 Unit 9 C0439190
alternative label: MBq/g

Megabecquerel per Kilogram
type: Class
subclass of: Units
comment: 1 M05477 2 Megabecquerel per Kilogram 3 MBq/kg 4 Megabecquerel per Kilogram 5 229034000 6 Megabecquerel 7 Megabecquerel (qualifier value) 8 MBq 9 C0556640
alternative label: MBq/kg

Megabecquerel per Liter
type: Class
subclass of: Units
comment: 1 M05212 2 Megabecquerel per Liter 3 MBq/L 4 Megabecquerel per Liter 5 767525000 6 unit 7 Unit (qualifier value) 8 Unit 9 C0439176
alternative label: MBq/L

Megabecquerel per Microgram
type: Class
subclass of: Units
comment: 1 M05663 2 Megabecquerel per Microgram 3 MBq/ug MBq/mcg 4 Megabecquerel per Microgram 5 229034000 6 Megabecquerel 7 Megabecquerel (qualifier value) 8 MBq 9 C0556640
alternative label: MBq/ug
alternative label: MBq/mcg

Megabecquerel per Microliter
type: Class
subclass of: Units
comment: 1 M05222 2 Megabecquerel per Microliter 3 MBq/uL 4 Megabecquerel per Microliter 5 767525000 6 unit 7 Unit (qualifier value) 8 Unit 9 C0439178
alternative label: MBq/uL

Megabecquerel per Milligram
type: Class
subclass of: Units
comment: 1 M05651 2 Megabecquerel per Milligram 3 MBq/mg 4 Megabecquerel per Milligram 5 229034000 6 Megabecquerel 7 Megabecquerel (qualifier value) 8 MBq 9 C0556640
alternative label: MBq/mg

Megabecquerel per milliliter
type: Class
subclass of: Units
comment: 1 M05190 2 Megabecquerel per milliliter 3 MBq/mL Megabecquerel/milliliter Megabecquerel per millilitre 4 Megabecquerel per milliliter 5 418948007 6 Megabecquerel per milliliter 7 Megabecquerel/milliliter (qualifier value) 8 Megabecquerel per milliliter 9 C1639216
alternative label: MBq/mL
alternative label: Megabecquerel per millilitre
alternative label: Megabecquerel/milliliter

Megabecquerel per nanogram
type: Class
subclass of: Units
comment: 1 M05658 2 Megabecquerel per nanogram 3 MBq/ng 4 Megabecquerel per nanogram 5 229034000 6 Megabecquerel 7 Megabecquerel (qualifier value) 8 MBq 9 C0556640
alternative label: MBq/ng

Megaherz
type: Class
subclass of: Units
comment: 1 M04505 2 Megahertz 3 MHz 4 Megaherz 5 229764000 6 megahertz 7 Megahertz (qualifier value) 8 megahertz 9 C0556962

Melkersson-Rosenthal Syndrome
type: Class
subclass of: Nervous system and Mental function (Symptom)
comment: 1 MD00411 2 Melkersson-Rosenthal Syndrome 3 None 4 Melkersson-Rosenthal Syndrome 5 37770007 6 Melkersson-Rosenthal syndrome 7 Melkersson's syndrome (disorder) 8 Melkersson-Rosenthal Syndrome 9 C0025235

Melody of speech
type: Class
subclass of: Voice and Speaking (Body measurement)
comment: 1 MD05823 2 Melody of speech 3 None 4 Melody of speech 5 106132005 6 speech finding 7 Speech finding (finding) 8 Melody of speech 9 C2370983

Membrum inferius
type: Class
subclass of: Musculoskeletal function (Body region)
comment: 1 M02364 2 Membrum inferius 3 None 4 Membrum inferius 5 61685007 6 Lower limb 7 Lower limb structure (body structure) 8 Lower Extremity 9 C0023216

Membrum superius
type: Class
subclass of: Musculoskeletal function (Body region)
comment: 1 M02425 2 Membrum superius 3 None 4 Membrum superius 5 53120007 6 Upper extremity 7 Upper limb structure (body structure) 8 Upper Extremity 9 C1140618

Memory functions
type: Class
subclass of: Nervous system and Mental function (Body measurement)
comment: 1 MD05653 2 Memory functions 3 None 4 Memory functions 5 303116000 6 Memory function 7 Memory function (observable entity) 8 Memory functions 9 C0025260

Menstrual care
type: Class
subclass of: Hospital information, examination/diagnosis/treatment data
comment: 1 MD06390 2 Menstrual care 3 None 4 Menstrual care 5 248957007 6 Menstruation 7 Menstruation, function (observable entity) 8 Menstrual care 9 C2371466

Mental Illness Patient
type: Class
subclass of: Classification of Patient
comment: 1 MD00396 2 mental illness patient 3 None 4 Mental Illness Patient 5 74732009 6 Mental illness 7 Mental disorder (disorder) 8 Mental illness (specialty) 9 C1273856

Mental function of sequencing complex movements
type: Class
subclass of: Nervous system and Mental function (Body measurement)
comment: 1 MD05720 2 Mental function of sequencing complex movements 3 None 4 Mental function of sequencing complex movements 5 285231000 6 Mental function 7 Mental function (observable entity) 8 Mental function of sequencing complex movements 9 C2370912

Mental functions of language
type: Class
subclass of: Nervous system and Mental function (Body measurement)
comment: 1 MD05697 2 Mental functions of language 3 None 4 Mental functions of language 5 285231000 6 Mental function 7 Mental function (observable entity) 8 Mental functions of language 9 C2370908

Meridian
type: Class
subclass of: Units
comment: 1 M00843 2 Meridian 3 Meridians 4 Meridian 5 468355003 6 Diagnostic body meridian system 7 Diagnostic body meridian system (physical object) 8 Meridians 9 C0085282
alternative label: Meridians

Metabolic Equivalent of Task
type: Class
subclass of: Questionnaire
comment: 1 MD01108 2 Metabolic Equivalent of Task 3 Met 4 Metabolic Equivalent of Task 5 698834005 6 Metabolic equivalent of task 7 Metabolic equivalent of task (observable entity) 8 Metabolic equivalent of task 9 C2983100
alternative label: Met

Metabolic Equivalent of Task values
type: Class
subclass of: Questionnaire
comment: 1 MD01107 2 Metabolic Equivalent of Task values 3 MET values 4 Metabolic Equivalent of Task values 5 698834005 6 Metabolic equivalent of task 7 Metabolic equivalent of task (observable entity) 8 Metabolic equivalent of task 9 C2983100
alternative label: MET values

Metabolic disorders
type: Class
subclass of: Functions of Blood System, Metabolic system and Endocrine system (Symptom)
comment: 1 MD00321 2 metabolic disorder 3 None 4 Metabolic disorders 5 75934005 6 Metabolic disease 7 Metabolic disease (disorder) 8 Metabolic Diseases 9 C0025517

Metabolite-carrying functions of the blood
type: Class
subclass of: Functions of Blood System, Metabolic system and Endocrine system (Body measurement)
comment: 1 MD05856 2 Metabolite-carrying functions of the blood 3 None 4 Metabolite-carrying functions of the blood 5 86084001 6 haematologic function 7 Hematologic function (observable entity) 8 Metabolite-carrying functions of the blood 9 C2371086

Meter
type: Class
subclass of: Units
comment: 1 M04477 2 Meter 3 meters m metre 4 Meter 5 258669008 6 meter 7 meter (qualifier value) 8 meter 9 C0475209
alternative label: meters
alternative label: metre

Meter per Second
type: Class
subclass of: Units
comment: 1 M04345 2 Meter per Second 3 m/s metre/second m/sec meter/second 4 Meter per Second 5 272090007 6 Meter/second 7 Meter/second (qualifier value) 8 Meter/second 9 C0439493
alternative label: metre/second
alternative label: m/s
alternative label: meter/second
alternative label: m/sec

Method of calculation in the Screening of instrumental Activities of daily living
type: Class
subclass of: Questionnaire
comment: 1 MD05338 2 Method of calculation in the Screening of instrumental Activities of daily living 3 None 4 Method of calculation in the Screening of instrumental Activities of daily living 5 260686004 6 Method 7 Method (attribute) 8 Methods 9 C0025663

Metric Drop
type: Class
subclass of: Units
comment: 1 M04842 2 Metric Drop 3 None 4 Metric Drop 5 767525000 6 unit 7 Unit (qualifier value) 8 Unit 9 C0439157

Micro-operation
type: Class
subclass of: Health Related Factors
comment: 1 MD04468 2 Micro-operation 3 None 4 Micro-operation 5 844005 6 Behavior finding 7 Behavior finding (finding) 8 Behavior 9 C0004927

Microcurie
type: Class
subclass of: Units
comment: 1 M04538 2 Microcurie 3 mcCi 4 Microcurie 5 282111001 6 microcurie 7 Microcurie (qualifier value) 8 microcurie 9 C0560006
alternative label: mcCi

Microcurie per Gram
type: Class
subclass of: Units
comment: 1 M04930 2 Microcurie per Gram 3 uCi/g 4 Microcurie per Gram 5 767525000 6 unit 7 Unit (qualifier value) 8 Unit 9 C0439157
alternative label: uCi/g

Microcurie per Milliliter
type: Class
subclass of: Units
comment: 1 M05508 2 Microcurie per Milliliter 3 uCi/mL 4 Microcurie per Milliliter 5 282111001 6 Microcurie 7 Microcurie (qualifier value) 8 Millicurie per Liter 9 C2347131
alternative label: uCi/mL

Microequivalent
type: Class
subclass of: Units
comment: 1 M03657 2 Microequivalent 3 uEq 4 Microequivalent 5 258728009 6 microequivalent 7 microequivalent (qualifier value) 8 microequivalent 9 C0439153
alternative label: uEq

Microgram
type: Class
subclass of: Units
comment: 1 M03747 2 Microgram 3 ug micrograms mcg UGM 4 Microgram 5 258685003 6 microgram 7 microgram (qualifier value) 8 microgram 9 C0439211
alternative label: micrograms
alternative label: ug
alternative label: mcg
alternative label: UGM

Microgram equivalents per milliliter
type: Class
subclass of: Units
comment: 1 M05196 2 Microgram equivalents per milliliter 3 mcg Eq/mL Microgram equivalents per millilitre 4 Microgram equivalents per milliliter 5 418729000 6 Microgram equivalents per milliliter 7 Microgram equivalents per milliliter (qualifier value) 8 Microgram equivalents per milliliter 9 C1641242
alternative label: Microgram equivalents per millilitre
alternative label: mcg Eq/mL

Microgram per 24 Hours
type: Class
subclass of: Units
comment: 1 M04228 2 Microgram per 24 Hours 3 mcg/24h 4 Microgram per 24 Hours 5 258839004 6 Microgram/day 7 Microgram/day (qualifier value) 8 Microgram/day 9 C0439426
alternative label: mcg/24h

Microgram per Cubic Decimeter
type: Class
subclass of: Units
comment: 1 M03893 2 Microgram per Cubic Decimeter 3 ug/dm3 mcg/dm3 4 Microgram per Cubic Decimeter 5 767525000 6 Unit 7 Unit (qualifier value) 8 Unit 9 C0439148
alternative label: mcg/dm3
alternative label: ug/dm3

Microgram per Cubic Meter
type: Class
subclass of: Units
comment: 1 M04004 2 Microgram per Cubic Meter 3 ug/m3 mcg/m3 4 Microgram per Cubic Meter 5 767525000 6 Unit 7 Unit (qualifier value) 8 Unit 9 C0439148
alternative label: mcg/m3
alternative label: ug/m3

Microgram per Day
type: Class
subclass of: Units
comment: 1 M04227 2 Microgram per Day 3 ug/d ug/day microgram/day mcg/day mcg/d 4 Microgram per Day 5 258839004 6 Microgram/day 7 Microgram/day (qualifier value) 8 Microgram/day 9 C0439426
alternative label: microgram/day
alternative label: ug/d
alternative label: mcg/day
alternative label: ug/day
alternative label: mcg/d

Microgram per Deciliter
type: Class
subclass of: Units
comment: 1 M03855 2 Microgram per Deciliter 3 ug/dL mcg/dL 4 Microgram per Deciliter 5 258797006 6 Milligram/deciliter 7 Milligram/deciliter (qualifier value) 8 Milligram/deciliter 9 C0439269
alternative label: mcg/dL
alternative label: ug/dL

Microgram per Gram
type: Class
subclass of: Units
comment: 1 M03870 2 Microgram per Gram 3 ug/g microgram/g microg/gram microg/g mcg/g 4 Microgram per Gram 5 258802000 6 microgram/g 7 Microgram/gram (qualifier value) 8 microgram/g 9 C0439272
alternative label: ug/g
alternative label: microgram/g
alternative label: mcg/g
alternative label: microg/g
alternative label: microg/gram

Microgram per Gram per Day
type: Class
subclass of: Units
comment: 1 M05703 2 Microgram per Gram per Day 3 ug/g/d Microgram/Gram/Day mcg/g/d 4 Microgram per Gram per Day 5 258802000 6 Microgram/gram 7 Microgram/gram (qualifier value) 8 Microgram per Gram per Day 9 C2698210
alternative label: Microgram/Gram/Day
alternative label: ug/g/d
alternative label: mcg/g/d

Microgram per Gram per Hour
type: Class
subclass of: Units
comment: 1 M05706 2 Microgram per Gram per Hour 3 ug/g/h Microgram/Gram/Hour mcg/g/h 4 Microgram per Gram per Hour 5 258802000 6 Microgram/gram 7 Microgram/gram (qualifier value) 8 Microgram per Gram per Hour 9 C2698211
alternative label: mcg/g/h
alternative label: Microgram/Gram/Hour
alternative label: ug/g/h

Microgram per Gram per Minute
type: Class
subclass of: Units
comment: 1 M05709 2 Microgram per Gram per Minute 3 Microgram/Gram/Minute mcg/g/min ug/g/min 4 Microgram per Gram per Minute 5 258802000 6 Microgram/gram 7 Microgram/gram (qualifier value) 8 Microgram per Gram per Minute 9 C2698212
alternative label: ug/g/min
alternative label: Microgram/Gram/Minute
alternative label: mcg/g/min

Microgram per Hour
type: Class
subclass of: Units
comment: 1 M04222 2 Microgram per Hour 3 mcg/hr mcg/h Micrograms per Hour microgram/hour ug/hr ug/h 4 Microgram per Hour 5 258838007 6 mcg/hr 7 Microgram/hour (qualifier value) 8 mcg/hr 9 C0439425
alternative label: mcg/h
alternative label: ug/h
alternative label: microgram/hour
alternative label: ug/hr
alternative label: Micrograms per Hour

Microgram per Kilogram
type: Class
subclass of: Units
comment: 1 M05148 2 Microgram per Kilogram 3 ug/kg microgram/kilogram mcg/kg microg/kg 4 Microgram per Kilogram 5 258803006 6 Microgram/kilogram 7 Microgram/kilogram (qualifier value) 8 Microgram/kilogram 9 C1627893
alternative label: microgram/kilogram
alternative label: mcg/kg
alternative label: ug/kg
alternative label: microg/kg

Microgram per Kilogram per Day
type: Class
subclass of: Units
comment: 1 M04907 2 Microgram per Kilogram per Day 3 mcg/kg/d ug/kg/d Microgram/kilogram/day mcg/kg/day ug/kg/24.h 4 mcg/kg/day 5 414717000 6 mcg/kg/day 7 Microgram/kilogram/day (qualifier value) 8 mcg/kg/day 9 C1532561

Microgram per Kilogram per Hour
type: Class
subclass of: Units
comment: 1 M05492 2 Microgram per Kilogram per Hour 3 mcg/kg/hr ug/kg/h Microgram/Kilogram/Hour mcg/kg/h 4 Microgram per Kilogram per Hour 5 405664006 6 Microgram/kilogram/hour 7 Microgram/kilogram/hour (qualifier value) 8 Microgram/kilogram/hour (qualifier value) 9 C1320752
alternative label: Microgram/Kilogram/Hour
alternative label: mcg/kg/hr
alternative label: mcg/kg/h
alternative label: ug/kg/h

Microgram per Kilogram per Minute
type: Class
subclass of: Units
comment: 1 M04781 2 Microgram per Kilogram per Minute 3 ug/kg/min Microgram/Kilogram/Minute mcg/kg/min 4 Microgram per Kilogram per Minute 5 396171008 6 Microgram/kilogram/minute 7 Microgram/kilogram/minute (qualifier value) 8 Microgram/kilogram/minute 9 C1300568
alternative label: mcg/kg/min
alternative label: ug/kg/min
alternative label: Microgram/Kilogram/Minute

Microgram per Liter
type: Class
subclass of: Units
comment: 1 M03892 2 Microgram per Liter 3 ug/L microgram/litre microgram/liter mcg/L 4 Microgram per Liter 5 258799009 6 ug/L 7 Microgram/liter (qualifier value) 8 Microgram/liter 9 C0439275
alternative label: ug/L
alternative label: mcg/L
alternative label: microgram/litre
alternative label: microgram/liter

Microgram per Microgram
type: Class
subclass of: Units
comment: 1 M04819 2 Microgram per Microgram 3 ug/ug mcg/mcg 4 Microgram per Microgram 5 767525000 6 unit 7 Unit (qualifier value) 8 Unit 9 C0439157
alternative label: ug/ug
alternative label: mcg/mcg

Microgram per Microgram per Day
type: Class
subclass of: Units
comment: 1 M05670 2 Microgram per Microgram per Day 3 ug/ug/d mcg/mcg/d 4 Microgram per Microgram per Day 5 258685003 6 microgram 7 microgram (qualifier value) 8 microgram 9 C0439211
alternative label: mcg/mcg/d
alternative label: ug/ug/d

Microgram per Microliter
type: Class
subclass of: Units
comment: 1 M03979 2 Microgram per Microliter 3 Micrograms per microliter Micrograms per microlitre mcg/mcL ug/uL 4 Microgram per Microliter 5 258794004 6 Micrograms per microliter 7 Gram/liter (qualifier value) 8 Micrograms per microliter 9 C0439294
alternative label: Micrograms per microlitre
alternative label: Micrograms per microliter
alternative label: ug/uL
alternative label: mcg/mcL

Microgram per Milligram per Day
type: Class
subclass of: Units
comment: 1 M04896 2 Microgram per Milligram per Day 3 ug/mg/d mcg/mg/d 4 Microgram per Milligram per Day 5 767525000 6 unit 7 Unit (qualifier value) 8 Unit 9 C0439157
alternative label: ug/mg/d
alternative label: mcg/mg/d

Microgram per Milliliter
type: Class
subclass of: Units
comment: 1 M03840 2 Microgram per Milliliter 3 ug/mL microgram/mL microgram/millilitre microgram/milliliter mcg/mL 4 Microgram per Milliliter 5 258801007 6 Microgram/milliliter 7 Microgram/milliliter (qualifier value) 8 Microgram/milliliter 9 C0439268
alternative label: microgram/milliliter
alternative label: ug/mL
alternative label: mcg/mL
alternative label: microgram/millilitre
alternative label: microgram/mL

Microgram per Milliliter per Hour
type: Class
subclass of: Units
comment: 1 M05712 2 Microgram per Milliliter per Hour 3 ug/mL/h Microgram/Milliliter/Hour mcg/mL/h 4 Microgram per Milliliter per Hour 5 258801007 6 Microgram/millilite 7 Microgram/milliliter (qualifier value) 8 Microgram per Milliliter per Hour 9 C2698213
alternative label: mcg/mL/h
alternative label: Microgram/Milliliter/Hour
alternative label: ug/mL/h

Microgram per Minute
type: Class
subclass of: Units
comment: 1 M04217 2 Microgram per Minute 3 microgram/minute mcg/min Micrograms per Minute ug/min 4 Microgram per Minute 5 258837002 6 mcg/min 7 Microgram/minute (qualifier value) 8 mcg/min 9 C0439424
alternative label: microgram/minute
alternative label: Micrograms per Minute
alternative label: ug/min
alternative label: mcg/min

Microgram per Nanoliter
type: Class
subclass of: Units
comment: 1 M04768 2 Microgram per Nanoliter 3 ug/nL 4 Microgram per Nanoliter 5 767525000 6 unit 7 Unit (qualifier value) 8 Unit 9 C0439156
alternative label: ug/nL

Microgram per Square Meter
type: Class
subclass of: Units
comment: 1 M04807 2 Microgram per Square Meter 3 ug/m2 Microgram/Square Meter microgram/ metre squared microgram/ meter squared Microgram per Meter Squared mcg/m2 ug/sq.m 4 Microgram per Square Meter 5 404217008 6 Microgram/square meter 7 Microgram/square meter (qualifier value) 8 Microgram/square meter 9 C1319267
alternative label: ug/m2
alternative label: Microgram/Square Meter
alternative label: mcg/m2
alternative label: microgram/ meter squared
alternative label: Microgram per Meter Squared
alternative label: microgram/ metre squared
alternative label: ug/sq.m

Microgram per Square Meter per Day
type: Class
subclass of: Units
comment: 1 M05494 2 Microgram per Square Meter per Day 3 ug/m2/d mcg/m2/d 4 Microgram per Square Meter per Day 5 258961008 6 Microgram/day/square meter 7 Microgram/day/square meter (qualifier value) 8 Microgram per Square Meter per Day 9 C2347119
alternative label: ug/m2/d
alternative label: mcg/m2/d

Microgram per Square Meter per Hour
type: Class
subclass of: Units
comment: 1 M05497 2 Microgram per Square Meter per Hour 3 ug/m2/h Microgram/Square Meter/Hour mcg/m2/h 4 Microgram per Square Meter per Hour 5 404217008 6 Microgram/square meter 7 Microgram/square meter (qualifier value) 8 Microgram per Square Meter per Hour 9 C2347120
alternative label: mcg/m2/h
alternative label: Microgram/Square Meter/Hour
alternative label: ug/m2/h

Microgram per Square Meter per Minute
type: Class
subclass of: Units
comment: 1 M05500 2 Microgram per Square Meter per Minute 3 ug/m2/min Microgram/Square Meter/Minute mcg/m2/min 4 Microgram per Square Meter per Minute 5 404217008 6 Microgram/square meter 7 Microgram/square meter (qualifier value) 8 Microgram per Square Meter per Minute 9 C2347121
alternative label: ug/m2/min
alternative label: mcg/m2/min
alternative label: Microgram/Square Meter/Minute

Microgram per milligram
type: Class
subclass of: Units
comment: 1 M04752 2 Microgram per milligram 3 ug/mg Microgram/milligram mcg/mg 4 Microgram per milligram 5 414718005 6 Microgram per milligram 7 Microgram/milligram (qualifier value) 8 Microgram per milligram 9 C1300563
alternative label: mcg/mg
alternative label: ug/mg
alternative label: Microgram/milligram

Micrograms per gram hemoglobin
type: Class
subclass of: Units
comment: 1 M05132 2 Micrograms per gram hemoglobin 3 mcg/g Hb Micrograms per gram haemoglobin mcg/gm Hb 4 Micrograms per gram hemoglobin 5 419350000 6 Micrograms per gram hemoglobin 7 Micrograms per gram hemoglobin (qualifier value) 8 Micrograms per gram hemoglobin 9 C1627884
alternative label: mcg/g Hb
alternative label: mcg/gm Hb
alternative label: Micrograms per gram haemoglobin

Microinternational Unit per Microliter
type: Class
subclass of: Units
comment: 1 M04283 2 Microinternational Unit per Microliter 3 uIU/uL 4 Microinternational Unit per Microliter 5 767525000 6 Unit 7 Unit (qualifier value) 8 Unit 9 C0439148
alternative label: uIU/uL

Microinternational Unit per Milliliter
type: Class
subclass of: Units
comment: 1 M04303 2 Microinternational Unit per Milliliter 3 uIU/mL mcIU/mL microIU/mL microinternational unit/milliliter 6 Microinternational Unit per Milliliter 5 259006005 6 microIU/mL 7 Microinternational unit/milliliter (qualifier value) 8 microIU/mL 9 C0439462

Microkatal
type: Class
subclass of: Units
comment: 1 M03815 2 Microkatal 3 ukat mckat microkat 4 Microkatal 5 258779003 6 Microkatal 7 Microkatal (qualifier value) 8 Microkatal 9 C0439250
alternative label: ukat
alternative label: microkat
alternative label: mckat

Microkatal per Liter
type: Class
subclass of: Units
comment: 1 M05383 2 Microkatal per Liter 3Microkatal/Liter ukat/L mckat/L 4 Microkatal per Liter 5 767525000 6 unit 7 Unit (qualifier value) 8 Microkatal per Liter 9 C1881822
alternative label: mckat/L
alternative label: Microkatal/Liter
alternative label: ukat/L

Microliter
type: Class
subclass of: Units
comment: 1 M03805 2 Microliter 3 uL microlitre microliters mcL 4 Microliter 5 258774008 6 Microliter 7 Microliter (qualifier value) 8 Microliter 9 C0439243
alternative label: uL
alternative label: microlitre
alternative label: microliters
alternative label: mcL

Microliter per Milliliter
type: Class
subclass of: Units
comment: 1 M05167 2 Microliter per Milliliter 3 Microliter/milliliter Microlitre/mL Microlitre per millilitre Microliter/mL mcL/mL uL/mL 4 Microliter per Milliliter 5 418342002 6 Microliter per milliliter 7 Microliter/milliliter (qualifier value) 8 Microliter per milliliter 9 C1635169
alternative label: Microlitre/mL
alternative label: uL/mL
alternative label: Microliter/milliliter
alternative label: Microlitre per millilitre
alternative label: Microliter/mL

Micromole per Cubic Meter
type: Class
subclass of: Units
comment: 1 M03912 2 Micromole per Cubic Meter 3 umol/m3 4 Micromole per Cubic Meter 5 767525000 6 Unit 7 Unit (qualifier value) 8 Unit 9 C0439148
alternative label: umol/m3

Micromole per Day
type: Class
subclass of: Units
comment: 1 M04245 2 Micromole per Day 3 umol/day umol/24h umol/24.h micromole/day micromole/24 hours Micromole per 24 Hours mcmol/day Micromoles per Day umol/d 4 Micromole per Day 5 258850001 6 Micromole/24 hours 7 Micromole/24 hours (qualifier value) 8 Micromole/24 hours 9 C0439436
alternative label: umol/24h
alternative label: micromole/24 hours
alternative label: Micromole per 24 Hours
alternative label: micromole/day
alternative label: mcmol/day
alternative label: umol/24.h
alternative label: Micromoles per Day
alternative label: umol/day
alternative label: umol/d

Micromole per Gram
type: Class
subclass of: Units
comment: 1 M03966 2 Micromole per Gram 3 micromole/gram umol/g micromol/g 4 Micromole per Gram 5 258816005 6 Micromole/gram 7 Micromole/gram (qualifier value) 8 Micromole/gram 9 C0439291
alternative label: umol/g
alternative label: micromol/g
alternative label: micromole/gram

Micromole per Liter
type: Class
subclass of: Units
comment: 1 M04024 2 Micromole per Liter 3 micromole per liter (um/L) umol/L micromole/litre micromole/liter mcmol/L UMOLAR um 4 Micromole per Liter 5 258814008 6 Micromole/liter 7 Micromole/liter (qualifier value) 8 Micromole/liter 9 C0439300
alternative label: micromole/liter
alternative label: micromole per liter (um/L)
alternative label: micromole/litre
alternative label: mcmol/L
alternative label: umol/L
alternative label: UMOLAR

Micromole per Microgram
type: Class
subclass of: Units
comment: 1 M05555 2 Micromole per Microgram 3 umol/ug 4 Micromole per Microgram 5 258719008 6 micromole 7 micromole (qualifier value) 8 Micromole 9 C0439194
alternative label: umol/ug

Micromole per Milligram
type: Class
subclass of: Units
comment: 1 M05574 2 Micromole per Milligram 3 umol/mg 4 Micromole per Milligram 5 258719008 6 micromole 7 micromole (qualifier value) 8 Micromole 9 C0439194
alternative label: umol/mg

Micromole per Milligram per Minute
type: Class
subclass of: Units
comment: 1 M05503 2 Micromole per Milligram per Minute 3 umol/mg/min Micromole/Milligram/Minute 4 Micromole per Milligram per Minute 5 258719008 6 micromole 7 micromole (qualifier value) 8 Micromole per Milligram per Minute 9 C2347123
alternative label: Micromole/Milligram/Minute
alternative label: umol/mg/min

Micromole per Nanogram
type: Class
subclass of: Units
comment: 1 M05591 2 Micromole per Nanogram 3 umol/ng 4 Micromole per Nanogram 5 258718000 6 millimole 7 millimole (qualifier value) 8 millimole 9 C0439190
alternative label: umol/ng

Micromole per Nanoliter
type: Class
subclass of: Units
comment: 1 M05607 2 Micromole per Nanoliter 3 umol/nL 4 Micromole per Nanoliter 5 258719008 6 micromole 7 micromole (qualifier value) 8 Micromole 9 C0439194
alternative label: umol/nL

Micromole per milliliter
type: Class
subclass of: Units
comment: 1 M04917 2 Micromole per milliliter 3 Micromole per millilitre Micromole/milliliter Micromole/millilitre umol/mL mcmol/mL 4 Micromole per milliliter 5 414719002 6 Micromole per milliliter 7 Micromole/milliliter (qualifier value) 8 Micromole per milliliter 9 C1532563
alternative label: mcmol/mL
alternative label: Micromole/millilitre
alternative label: Micromole/milliliter
alternative label: umol/mL
alternative label: Micromole per millilitre

Micromole per mole
type: Class
subclass of: Units
comment: 1 M04920 2 Micromole per mole 3 Micromole/mole mcmol/mol umol/mol 4 Micromole per mole 5 414720008 6 Micromole per mole 7 Micromole/mole (qualifier value) 8 Micromole per mole 9 C1532564
alternative label: umol/mol
alternative label: mcmol/mol
alternative label: Micromole/mole

Micromoles per gram per year
type: Class
subclass of: Units
comment: 1 M05197 2 Micromoles per gram per year 3 mcmol/gm/yr 4 Micromoles per gram per year 5 419041008 6 Micromoles per gram per year 7 Micromoles per gram per year (qualifier value) 8 Micromoles per gram per year 9 C1641251
alternative label: mcmol/gm/yr
alternative label: umol/gm/yr

Micron
type: Class
subclass of: Units
comment: 1 M03722 2 Micron 3 microns 4 Micron 5 258674000 6 micron 7 Micrometer (qualifier value) 8 micron 9 C0439201
alternative label: microns

Microosmole
type: Class
subclass of: Units
comment: 1 M05504 2 Microosmole 3 uOsM 4 Microosmole 5 258719008 6 micromole 7 micromole (qualifier value) 8 Microosmole 9 C2347125
alternative label: uOsM

Microscopic
type: Class
subclass of: Hospital information, examination/diagnosis/treatment data
comment: 1 MD00529 2 Microscopic 3 None 4 Microscopic 5 84496004 6 Microscopic 7 Microscopic (qualifier value) 8 Microscopic (qualifier value) 9 C0205288

Microsoft HealthVault
type: Class
subclass of: Units
comment: 1 M05756 2 Microsoft HealthVault 3 None 4 Microsoft HealthVault 5 413568008 6 Application - unit of product usage (qualifier value) 7 Application - unit of product usage (qualifier value) 8 Application dose 9 C1533134

Microunit
type: Class
subclass of: Units
comment: 1 M04922 2 Microunit 3 uU mcunit mcU 4 Microunit 5 414721007 6 Microunit 7 Microunit (qualifier value) 8 Microunit 9 C1532565
alternative label: mcunit
alternative label: mcU
alternative label: uU

Microunit per Microliter
type: Class
subclass of: Units
comment: 1 M04039 2 Microunit per Microliter 3 uU/uL 4 Microunit per Microliter 5 767525000 6 Unit 7 Unit (qualifier value) 8 Unit 9 C0439148
alternative label: uU/uL

Microvolt
type: Class
subclass of: Units
comment: 1 M05427 2 Microvolt 3 McV uV 4 Microvolt 5 426342006 6 Microvolt 7 Microvolt (qualifier value) 8 Microvolt 9 C1961129
alternative label: uV
alternative label: McV

Microwave
type: Class
subclass of: Equipment
comment: 1 MD05360 2 Microwave 3 None 4 Microwave 5 64285002 6 Microwave 7 Electromagnetic radiation in the microwave region (physical force) 8 Microwave 9 C0026051

Middle Finger
type: Class
subclass of: Musculoskeletal function (Body region)
comment: 1 MD04050 2 Middle Finger 3 None 4 Middle Finger 5 65531009 6 Middle finger 7 Middle finger structure (body structure) 8 Middle finger 9 C0230393

Middle Third of the Esophagus
type: Class
subclass of: Digestive function (Body region)
comment: 1 M00844 2 Middle Third of the Esophagus 3 Middle third of esophagus, Middle third of oesophagus 4 Middle Third of the Esophagus 5 32849002 6 Esophagus 7 Esophageal structure (body structure) 8 Middle third of esophagus 9 C0227189
alternative label: Middle third of esophagus
alternative label: Middle third of oesophagus

Midwifery clinic
type: Class
subclass of: Classification of Hospital
comment: 1 MD00135 2 Midwifery clinic 3 None 4 Midwifery clinic 5 714088003 6 Midwifery service 7 Midwifery service (qualifier value) 8 Midwifery service 9 C4075527

Mild deficit
type: Class
subclass of: Units
comment: 1 MD04488 2 Mild deficit 3 None 4 Mild deficit 5 386805003 6 Mild cognitive disorder 7 Mild cognitive disorder (disorder) 8 Deficit 9 C2987487

Mile
type: Class
subclass of: Units
comment: 1 M03625 2 Mile 3 miles miling 4 Mile 5 258678002 6 Mile 7 Mile (qualifier value) 8 Miles 9 C0439148
alternative label: miles
alternative label: miling

Miles per hour
type: Class
subclass of: Units
comment: 1 M04351 2 Miles per hour 3 mph 4 Miles per hour 5 272092004 6 miles per hour 7 Miles per hour (qualifier value) 8 Miles per hour 9 C0439495
alternative label: mph

Millicurie
type: Class
subclass of: Units
comment: 1 M04537 2 Millicurie 3 mCi 4 Millicurie 5 282110000 6 millicurie 7 Millicurie (qualifier value) 8 millicurie 9 C0560005
alternative label: mCi

Millicurie per Kilogram
type: Class
subclass of: Units
comment: 1 M04929 2 Millicurie per Kilogram 3 mCi/kg MilliCuries/kilogram MilliCuries per kilogram Millicurie/Kilogram 4 Millicurie per Kilogram 5 414726004 6 MilliCuries per kilogram 7 MilliCuries/kilogram (qualifier value) 8 MilliCuries per kilogram 9 C1532569
alternative label: MilliCuries per kilogram
alternative label: Millicurie/Kilogram
alternative label: mCi/kg
alternative label: MilliCuries/kilogram

Millicurie per Liter
type: Class
subclass of: Units
comment: 1 M05507 2 Millicurie per Liter 3 mCi/L Millicurie/Liter 4 Millicurie per Liter 5 282110000 6 Millicurie 7 Millicurie (qualifier value) 8 Millicurie per Liter 9 C2347131
alternative label: mCi/L
alternative label: Millicurie/Liter

Milliequivalent
type: Class
subclass of: Units
comment: 1 M03654 2 Milliequivalent 3 milliequivalents milliequivalent (meq) mEq 4 Milliequivalent 5 258727004 6 milliequivalent 7 milliequivalent (qualifier value) 8 milliequivalent 9 C0439152
alternative label: milliequivalent (meq)
alternative label: milliequivalents
alternative label: mEq

Milliequivalent per Deciliter
type: Class
subclass of: Units
comment: 1 M04935 2 Milliequivalent per Deciliter 3 mEq/dL Milliequivalents/deciliter Milliequivalents per decilitre Milliequivalents per deciliter Milliequivalent/Deciliter 4 Milliequivalent per Deciliter 5 414727008 6 Milliequivalents per deciliter 7 Milliequivalents/deciliter (qualifier value) 8 Milliequivalents per deciliter 9 C1532570
alternative label: Milliequivalents per deciliter
alternative label: Milliequivalents per decilitre
alternative label: mEq/dL
alternative label: Milliequivalents/deciliter
alternative label: Milliequivalent/Deciliter

Milliequivalent per Gram
type: Class
subclass of: Units
comment: 1 M05510 2 Milliequivalent per Gram 3 mEq/g Milliequivalent/Gram 4 Milliequivalent per Gram 5 258727004 6 milliequivalent 7 milliequivalent (qualifier value) 8 Milliequivalent per Gram 9 C2347132
alternative label: Milliequivalent/Gram
alternative label: mEq/g

Milliequivalent per Kilogram
type: Class
subclass of: Units
comment: 1 M04789 2 Milliequivalent per Kilogram 3 mEq/kg Milliequivalent/Kilogram 4 Milliequivalent per Kilogram 5 396178002 6 Milliequivalent/kilogram 7 Milliequivalent/kilogram (qualifier value) 8 Milliequivalent/kilogram 9 C1300573
alternative label: mEq/kg
alternative label: Milliequivalent/Kilogram

Milliequivalent per Liter
type: Class
subclass of: Units
comment: 1 M04093 2 Milliequivalent per Liter 3 mEq/L milliequivalent/litre milliequivalent/liter 4 Milliequivalent per Liter 5 258865000 6 Milliequivalent/liter 7 Milliequivalent/liter (qualifier value) 8 Milliequivalent/liter 9 C0439375
alternative label: milliequivalent/liter
alternative label: milliequivalent/litre
alternative label: mEq/L

Milliequivalent per Microgram
type: Class
subclass of: Units
comment: 1 M05512 2 Milliequivalent per Microgram 3 mEq/ug Milliequivalent/Microgram mEq/mcg 4 Milliequivalent per Microgram 5 258727004 6 milliequivalent 7 milliequivalent (qualifier value) 8 Milliequivalent per Microgram 9 C2347133
alternative label: Milliequivalent/Microgram
alternative label: mEq/mcg
alternative label: mEq/ug

Milliequivalent per Microliter
type: Class
subclass of: Units
comment: 1 M05515 2 Milliequivalent per Microliter 3 mEq/uL Milliequivalent/Microliter 4 Milliequivalent per Microliter 5 258727004 6 milliequivalent 7 milliequivalent (qualifier value) 8 Milliequivalent per Microliter 9 C2347134
alternative label: mEq/uL
alternative label: Milliequivalent/Microliter

Milliequivalent per Milliimole
type: Class
subclass of: Units
comment: 1 M05725 2 Milliequivalent per Milliimole 3 mEq/mmol 4 Milliequivalent per Milliimole 5 258727004 6 milliequivalent 7 milliequivalent (qualifier value) 8 Milliequivalent per Millimole 9 C2985214
alternative label: mEq/mmol

Milliequivalent per Milliliter
type: Class
subclass of: Units
comment: 1 M04952 2 Milliequivalent per Milliliter 3 mEq/mL Milliequivalents/milliliter Milliequivalents per millilitre Milliequivalents per milliliter Milliequivalent/Milliliter 4 Milliequivalent per Milliliter 5 414733002 6 Milliequivalents per milliliter 7 Milliequivalents/milliliter (qualifier value) 8 Milliequivalents per milliliter 9 C1532574
alternative label: mEq/mL
alternative label: Milliequivalents per millilitre
alternative label: Milliequivalents/milliliter
alternative label: Milliequivalent/Milliliter
alternative label: Milliequivalents per milliliter

Milliequivalents per Day
type: Class
subclass of: Units
comment: 1 M04256 2 Milliequivalents per Day 3 mEq/d milliequivalents per 24 hours milliequivalent/day Milliequivalent per 24 Hours mEq/day mEq/24h meq/24.h mEq/24 hr Milliequivalent/24 hours 4 Milliequivalents per Day 5 258863007 6 milliequivalent/day 7 Milliequivalent/24 hours (qualifier value) 8 milliequivalent/day 9 C0439448
alternative label: Milliequivalent per 24 Hours
alternative label: Milliequivalent/24 hours
alternative label: milliequivalents per 24 hours
alternative label: meq/24.h
alternative label: mEq/24 hr
alternative label: mEq/d
alternative label: milliequivalent/day
alternative label: mEq/day
alternative label: mEq/24h

Milliequivalents per kilogram per day
type: Class
subclass of: Units
comment: 1 M04937 2 Milliequivalents per kilogram per day 3 mEq/kg/day Milliequivalents/kilogram/day Milliequivalent/kilogram/day 4 Milliequivalents per kilogram per day 5 414729009 6 Milliequivalents per kilogram per day 7 Milliequivalents/kilogram/day (qualifier value) 8 Milliequivalents per kilogram per day 9 C1532570
alternative label: Milliequivalent/kilogram/day
alternative label: mEq/kg/day
alternative label: Milliequivalents/kilogram/day

Milliequivalents per kilogram per minute
type: Class
subclass of: Units
comment: 1 M04940 2 Milliequivalents per kilogram per minute 3 mEq/kg/min Milliequivalents/kilogram/minute Milliequivalent/kilogram/minute 4 Milliequivalents per kilogram per minute 5 414731000 6 Milliequivalents per kilogram per minute 7 Milliequivalents/kilogram/minute (qualifier value) 8 Milliequivalents per kilogram per minute 9 C1532572
alternative label: mEq/kg/min
alternative label: Milliequivalent/kilogram/minute
alternative label: Milliequivalents/kilogram/minute

Milliequivalents per square meter
type: Class
subclass of: Units
comment: 1 M04944 2 Milliequivalents per square meter 3 mEq/m2 Milliequivalents/meter2 Milliequivalents per square metre Milliequivalents per metre squared Milliequivalents per meter2 Milliequivalents per meter squared 4 Milliequivalents per square meter 5 414732007 6 Milliequivalents per square meter 7 Milliequivalents/meter2 (qualifier value) 8 Milliequivalents per square meter 9 C1532573
alternative label: Milliequivalents per meter squared
alternative label: Milliequivalents per meter2
alternative label: Milliequivalents per metre squared
alternative label: mEq/m2
alternative label: Milliequivalents/meter2

Milligram-meter per beat
type: Class
subclass of: Units
comment: 1 M04894 2 Milligram-meter per beat 3 mg-m/beat Milligram-meter/beat 4 Milligram-meter per beat 5 414694001 6 Milligram-meter per beat 7 Milligram-meter/beat (qualifier value) 8 Milligram-meter per beat 9 C1532500
alternative label: mg-m/beat
alternative label: Milligram-meter/beat

Milligram per Cubic Decimeter
type: Class
subclass of: Units
comment: 1 M03836 2 Milligram per Cubic Decimeter 3 mg/dm3 4 Milligram per Cubic Decimeter 5 767525000 6 Unit 7 Unit (qualifier value) 8 Unit 9 C0439148
alternative label: mg/dm3

Milligram per Cubic Meter
type: Class
subclass of: Units
comment: 1 M03889 2 Milligram per Cubic Meter 3 mg/m3 4 Milligram per Cubic Meter 5 767525000 6 Unit 7 Unit (qualifier value) 8 Unit 9 C0439148
alternative label: mg/m3

Milligram per Day
type: Class
subclass of: Units
comment: 1 M04210 2 Milligram per Day 3 mg/d milligrams/24 hours milligram/24 hours Milligram per 24 Hours mg/day mg/24h mg/24.h 4 Milligram per Day 5 258836006 6 Milligrams/24 hours 7 Milligrams/24 hours (qualifier value) 8 Milligrams/24 hours 9 C0439422
alternative label: milligram/24 hours
alternative label: Milligram per 24 Hours
alternative label: mg/day
alternative label: mg/d
alternative label: mg/24.h
alternative label: mg/24h
alternative label: milligrams/24 hours

Milligram per Deciliter
type: Class
subclass of: Units
comment: 1 M03850 2 Milligram per Deciliter 3 milligram/decilitre milligram/deciliter mg dl dl mg 4 Milligram per Deciliter 5 258797006 6 Milligram/deciliter 7 Milligram/deciliter (qualifier value) 8 Milligram/deciliter 9 C0439269
alternative label: milligram/decilitre
alternative label: dl mg
alternative label: mg dl

Milligram per Gram
type: Class
subclass of: Units
comment: 1 M04750 2 Milligram per Gram 3 mg/g 4 Milligram per Gram 5 408168009 6 mg/g 7 Milligram/gram (qualifier value) 8 mg/g 9 C1300563
alternative label: mg/g

Milligram per Gram per Hour
type: Class
subclass of: Units
comment: 1 M05517 2 Milligram per Gram per Hour 3 mg/g/h Milligram/Gram/Hour 4 Milligram per Gram per Hour 5 408168009 6 Milligram/gram 7 Milligram/gram (qualifier value) 8 Milligram per Gram per Hour 9 C2347139
alternative label: mg/g/h
alternative label: Milligram/Gram/Hour

Milligram per Gram per Minute
type: Class
subclass of: Units
comment: 1 M05519 2 Milligram per Gram per Minute 3 mg/g/min Milligram/Gram/Minute 4 Milligram per Gram per Minute 5 408168009 6 Milligram/gram 7 Milligram/gram (qualifier value) 8 Milligram per Gram per Minute 9 C2347140
alternative label: mg/g/min
alternative label: Milligram/Gram/Minute

Milligram per Hour
type: Class
subclass of: Units
comment: 1 M04205 2 Milligram per Hour 3 mg/h milligram/hour mg/hr 4 Milligram per Hour 5 258834009 6 mg/hr 7 Milligram/hour (qualifier value) 8 mg/hr 9 C0439421
alternative label: mg/h
alternative label: mg/hr
alternative label: milligram/hour

Milligram per Kilogram
type: Class
subclass of: Units
comment: 1 M03868 2 Milligram per Kilogram 3 mg/kg Milligram/Kilogram mg kg 4 Milligram per Kilogram 5 396163008 6 Milligram/kilogram 7 Milligram/kilogram (qualifier value) 8 Milligram/kilogram 9 C0439272
alternative label: mg kg
alternative label: mg/kg
alternative label: Milligram/Kilogram

Milligram per Kilogram per Day
type: Class
subclass of: Units
comment: 1 M04153 2 Milligram per Kilogram per Day 3 mg/kg/d Milligram/Kilogram/Day mg/kg/day 4 Milligram per Kilogram per Day 5 258969005 6 Milligram/day/kilogram 7 Milligram/day/kilogram (qualifier value) 8 Milligram/day/kilogram 9 C0439400
alternative label: Milligram/Kilogram/Day
alternative label: mg/kg/day
alternative label: mg/kg/d

Milligram per Kilogram per Hour
type: Class
subclass of: Units
comment: 1 M04829 2 Milligram per Kilogram per Hour 3 mg/kg/h Milligram/Kilogram/Hour mg/kg/hr 4 Milligram per Kilogram per Hour 5 405667004 6 Milligram/kilogram/hour 7 Milligram/kilogram/hour (qualifier value) 8 Milligram/kilogram/hour 9 C1320755
alternative label: mg/kg/h
alternative label: Milligram/Kilogram/Hour
alternative label: mg/kg/hr

Milligram per Liter
type: Class
subclass of: Units
comment: 1 M03835 2 Milligram per Liter 3 mg/L milligram/litre milligram/liter 4 Milligram per Liter 5 258796002 6 Milligram/liter 7 Milligram/liter (qualifier value) 8 Milligram/liter 9 C0439268
alternative label: mg/L
alternative label: milligram/liter
alternative label: milligram/litre

Milligram per Microliter
type: Class
subclass of: Units
comment: 1 M04767 2 Milligram per Microliter 3 mg/uL 4 Milligram per Microliter 5 767525000 6 unit 7 Unit (qualifier value) 8 Unit 9 C0439155
alternative label: mg/uL

Milligram per Milligram
type: Class
subclass of: Units
comment: 1 M04818 2 Milligram per Milligram 3 mg/mg 4 Milligram per Milligram 5 408169001 6 mg/mg 7 Milligram/milligram (qualifier value) 8 mg/mg 9 C1319635
alternative label: mg/mg

Milligram per Milligram per Day
type: Class
subclass of: Units
comment: 1 M05669 2 Milligram per Milligram per Day 3 mg/mg/d 4 Milligram per Milligram per Day 5 258835005 6 mg/day 7 Milligram/day (qualifier value) 8 milligram/day 9 C0439422
alternative label: mg/mg/d

Milligram per Milliliter
type: Class
subclass of: Units
comment: 1 M03976 2 Milligram per Milliliter 3 mg/mL milligram/millilitre milligram/milliliter mg ml 4 Milligram per Milliliter 5 258798001 6 Milligram/milliliter 7 Milligram/milliliter (qualifier value) 8 Milligram/milliliter 9 C0439294
alternative label: mg ml
alternative label: milligram/milliliter
alternative label: milligram/millilitre
alternative label: mg/mL

Milligram per Minute
type: Class
subclass of: Units
comment: 1 M04203 2 Milligram per Minute 3 mg/min milligram/minute 4 Milligram per Minute 5 258833003 6 Milligram/minute 7 Milligram/minute (qualifier value) 8 Milligram/minute 9 C0439420
alternative label: milligram/minute
alternative label: mg/min

Milligram per Square Meter
type: Class
subclass of: Units
comment: 1 M04800 2 Milligram per Square Meter 3 mg/m2 Milligram/Square Meter Milligram per Meter Squared 4 Milligram per Square Meter 5 404216004 6 Milligram/square meter 7 Milligram/square meter (qualifier value) 8 Milligram/square meter 9 C1319266
alternative label: mg/m2
alternative label: Milligram/Square Meter
alternative label: Milligram per Meter Squared

Milligram per Square Meter per Day
type: Class
subclass of: Units
comment: 1 M04955 2 Milligram per Square Meter per Day 3mg/m2/d Milligram/meter2/day Milligram per square metre per day Milligram per metre squared per day Milligram per meter2 per day Milligram per meter squared per day mg/m2/day mg/m2/24.h 4 Milligram per Square Meter per Day 5 414734008 6 Milligram per square meter per day 7 Milligram/meter2/day (qualifier value) 8 Milligram per square meter per day 9 C1532575
alternative label: Milligram per meter2 per day
alternative label: Milligram per square metre per day
alternative label: mg/m2/d
alternative label: mg/m2/24.h
alternative label: Milligram/meter2/day
alternative label: Milligram per meter squared per day
alternative label: mg/m2/day
alternative label: Milligram per metre squared per day

Milligram per Square Meter per Hour
type: Class
subclass of: Units
comment: 1 M04964 2 Milligram per Square Meter per Hour 3 mg/m2/h mg/sq.m Milligram/Square Meter/Hour Milligram/meter2/hour Milligram per square metre per hour Milligram per metre squared per hour Milligram per meter2 per hour Milligram per meter squared per hour mg/m2/hr 4 Milligram per Square Meter per Hour 5 414735009 6 Milligram per square meter per hour 7 Milligram/meter2/hour (qualifier value) 8 Milligram per square meter per hour 9 C1532576
alternative label: Milligram per metre squared per hour
alternative label: Milligram per meter squared per hour
alternative label: Milligram per meter2 per hour
alternative label: Milligram/meter2/hour
alternative label: mg/m2/hr
alternative label: Milligram per square metre per hour
alternative label: mg/sq.m
alternative label: mg/m2/h
alternative label: Milligram/Square Meter/Hour

Milligram per Square Meter per Minute
type: Class
subclass of: Units
comment: 1 M05521 2 Milligram per Square Meter per Minute 3 Milligram/Square Meter/Minute mg/m2/min 4 Milligram per Square Meter per Minute 5 404216004 6 Milligram/square meter 7 Milligram/square meter (qualifier value) 8 Milligram per Square Meter per Minute 9 C2347141
alternative label: Milligram/Square Meter/Minute
alternative label: mg/m2/min

Milligram per centimeter squared
type: Class
subclass of: Units
comment: 1 M05208 2 Milligram per centimeter squared 3 mg/cm2 Milligram/centimetre2 Milligram/centimeter2 Milligram per centimetre squared 4 Milligram per centimeter squared 5 418670008 6 Milligram per centimeter squared 7 Milligram/centimeter2 (qualifier value) 8 Milligram per centimeter squared 9 C1688650
alternative label: mg/cm2
alternative label: Milligram per centimetre squared
alternative label: Milligram/centimeter2
alternative label: Milligram/centimetre2

Milligram percent
type: Class
subclass of: Units
comment: 1 M05411 2 Milligram percent 3 mg % 4 Milligram percent 5 427264006 6 Milligram percent 7 Milligram percent (qualifier value) 8 Milligram percent 9 C1960952
alternative label: mg %

Milligrams hemoglobin per gram
type: Class
subclass of: Units
comment: 1 M05118 2 Milligrams hemoglobin per gram 3 mg Hb/g Milligrams haemoglobin per gram mg Hb/gm 4 Milligrams hemoglobin per gram 5 418482008 6 Milligrams hemoglobin per gram 7 Milligrams hemoglobin per gram (qualifier value) 8 Milligrams hemoglobin per gram 9 C1623723
alternative label: mg Hb/gm
alternative label: Milligrams haemoglobin per gram
alternative label: mg Hb/g

Milliinternational Unit per Liter
type: Class
subclass of: Units
comment: 1 M04300 2 Milliinternational Unit per Liter 3 mIU/L milliinternational unit/litre milliinternational unit/liter 4 Milliinternational Unit per Liter 5 259004008 6 mIU/L 7 milliinternational unit/liter (qualifier value) 8 Milliinternational Unit per Liter 9 C0439462
alternative label: mIU/L
alternative label: milliinternational unit/liter
alternative label: milliinternational unit/litre

Milliinternational Unit per Milliliter
type: Class
subclass of: Units
comment: 1 M04282 2 Milliinternational Unit per Milliliter 3 mIU/mL milliinternational unit/millilitre milliinternational unit/milliliter 4 Milliinternational Unit per Milliliter 5 259005009 6 milliinternational unit/milliliter 7 milliinternational unit/milliliter (qualifier value) 8 milliinternational unit/milliliter 9 C0439457
alternative label: milliinternational unit/milliliter
alternative label: milliinternational unit/millilitre
alternative label: mIU/mL

Milliinternational units per hour
type: Class
subclass of: Units
comment: 1 M04970 2 Milliinternational units per hour 3 mIU/hr Milliinternational units/hour 4 Milliinternational units per hour 5 414736005 6 Milliinternational units per hour 7 Milliinternational units/hour (qualifier value) 8 Milliinternational units per hour 9 C1532577
alternative label: Milliinternational units/hour
alternative label: mIU/hr

Millikatal
type: Class
subclass of: Units
comment: 1 M03811 2 Millikatal 3 mkat 4 Millikatal 5 258778006 6 Millikatal 7 Millikatal (qualifier value) 8 Millikatal 9 C0439246
alternative label: mkat

Milliliter per 100 Milliliters
type: Class
subclass of: Units
comment: 1 M04582 2 Milliliter per 100 Milliliters 3 mL/100 mL 4 Milliliter per 100 Milliliters 5 767525000 6 unit 7 Unit (qualifier value) 8 Unit 9 C0439155
alternative label: mL/100 mL

Milliliter per 24 Hours
type: Class
subclass of: Units
comment: 1 M04255 2 Milliliter per 24 Hours 3 mL/24h mL/24.h millilitre/24 hours milliliter/24 hours 4 Milliliter per 24 Hours 5 258861009 6 Milliliter/24 hours 7 Millilitre/24 hours (qualifier value) 8 Milliliter/24 hours 9 C0439446
alternative label: mL/24.h
alternative label: millilitre/24 hours
alternative label: mL/24h
alternative label: milliliter/24 hours

Milliliter per Breath
type: Class
subclass of: Units
comment: 1 M05523 2 Milliliter per Breath 3 Milliliter/Breath mL/breath 4 Milliliter per Breath 5 258773002 6 Milliliter 7 Milliliter (qualifier value) 8 Milliliter per Breath 9 C2347146
alternative label: mL/breath
alternative label: Milliliter/Breath

Milliliter per Gram
type: Class
subclass of: Units
comment: 1 M05180 2 Milliliter per Gram 3 Millilitre/gram Millilitre per gram mL/g Milliliter/gram 4 Milliliter per Gram 5 419805009 6 Milliliter per gram 7 Milliliter/gram (qualifier value) 8 Milliliter per gram 9 C1637390
alternative label: Milliliter/gram
alternative label: Millilitre/gram
alternative label: Millilitre per gram
alternative label: mL/g

Milliliter per Gram per Day
type: Class
subclass of: Units
comment: 1 M05529 2 Milliliter per Gram per Day 3 Milliliter/gram/day mL/g/day mL/g/d 4 Milliliter per Gram per Day 5 419805009 6 Milliliter/gram 7 Milliliter/gram (qualifier value) 8 Milliliter per Gram per Day 9 C2347150
alternative label: mL/g/day
alternative label: mL/g/d
alternative label: Milliliter/gram/day

Milliliter per Gram per Hour
type: Class
subclass of: Units
comment: 1 M05538 2 Milliliter per Gram per Hour 3 mL/g/h Milliliter/Gram/Hour 4 Milliliter per Gram per Hour 5 419805009 6 mL/g 7 Milliliter/gram (qualifier value) 8 Milliliter per Gram per Hour 9 C2347151
alternative label: mL/g/h
alternative label: Milliliter/Gram/Hour

Milliliter per Gram per Minute
type: Class
subclass of: Units
comment: 1 M04183 2 Milliliter per Gram per Minute 3 mL/g/min Milliliter/Gram/Minute 4 Milliliter per Gram per Minute 5 767525000 6 Unit 7 Unit (qualifier value) 8 Unit 9 C0439148
alternative label: mL/g/min
alternative label: Milliliter/Gram/Minute

Milliliter per Hour
type: Class
subclass of: Units
comment: 1 M04128 2 Milliliter per Hour 3 mL/h millilitre/hour Milliliters per Hour milliliter/hour mL/hour 4 Milliliter per Hour 5 258989006 6 Milliliter/hour 7 Milliliter/hour (qualifier value) 8 Milliliter/hour 9 C0439391
alternative label: mL/hour
alternative label: millilitre/hour
alternative label: mL/h
alternative label: milliliter/hour
alternative label: Milliliters per Hour

Milliliter per Kilogram
type: Class
subclass of: Units
comment: 1 M04791 2 Milliliter per Kilogram 3 mL/kg Milliliter/Kilogram 4 Milliliter per Kilogram 5 396180007 6 mL/kg 7 mL/kg (qualifier value) 8 mL/kg 9 C1300575
alternative label: Milliliter/Kilogram
alternative label: mL/kg

Milliliter per Kilogram per Day
type: Class
subclass of: Units
comment: 1 M04976 2 Milliliter per Kilogram per Day 3mL/kg/d mL/kg/day Milliliter/kilogram/day 4 Milliliter per Kilogram per Day 5 414738006 6 Milliliter per kilogram per day 7 Milliliter/kilogram/day (qualifier value) 8 Milliliter per kilogram per day 9 C1532579
alternative label: mL/kg/day
alternative label: mL/kg/d
alternative label: Milliliter/kilogram/day

Milliliter per Kilogram per Hour
type: Class
subclass of: Units
comment: 1 M04982 2 Milliliter per Kilogram per Hour 3 mL/kg/h mL/kg/hr Milliliter/kilogram/hour 4 Milliliter per Kilogram per Hour 5 414739003 6 Milliliter per kilogram per hour 7 Milliliter/kilogram/hour (qualifier value) 8 Milliliter per kilogram per hour 9 C1532580
alternative label: mL/kg/hr
alternative label: mL/kg/h
alternative label: Milliliter/kilogram/hour

Milliliter per Kilogram per Minute
type: Class
subclass of: Units
comment: 1 M04164 2 Milliliter per Kilogram per Minute 3 mL/kg/min Milliliter/Kilogram/Minute 4 Milliliter per Kilogram per Minute 5 423618006 6 Milliliter per kilogram per minute 7 Milliliter/kilogram/minute (qualifier value) 8 Milliliter per kilogram per minute 9 C0439402
alternative label: mL/kg/min
alternative label: Milliliter/Kilogram/Minute

Milliliter per Liter
type: Class
subclass of: Units
comment: 1 M05162 2 Milliliter per Liter 3 mL/L 4 Milliliter per Liter 5 767525000 6 unit 7 Unit (qualifier value) 8 Unit 9 C0439176
alternative label: mL/L

Milliliter per Minute
type: Class
subclass of: Units
comment: 1 M04251 2 Milliliter per Minute 3 mL/min millilitre/minute Milliliters per Minute milliliter/minute 4 Milliliter per Minute 5 258859000 6 Milliliter/minute 7 Milliliter/minute (qualifier value) 8 Milliliter/minute 9 C0439445
alternative label: milliliter/minute
alternative label: Milliliters per Minute
alternative label: millilitre/minute
alternative label: mL/min

Milliliter per Second
type: Class
subclass of: Units
comment: 1 M04120 2 Milliliter per Second 3 mL/s mL/sec millilitre/second milliliter/second 4 Milliliter per Second 5 258988003 6 Milliliter/second 7 Milliliter/second (qualifier value) 8 Milliliter/second 9 C0439390
alternative label: millilitre/second
alternative label: mL/s
alternative label: milliliter/second
alternative label: mL/sec

Milliliter per Square Meter
type: Class
subclass of: Units
comment: 1 M05022 2 Milliliter per Square Meter 3mL/m2 Milliliter/Square Meter Milliliter/meter2 Milliliter per square metre Milliliter per metre squared Milliliter per meter2 Milliliter per meter squared 4 Milliliter per Square Meter 5 414740001 6 Milliliter per square meter 7 Milliliter/meter2 (qualifier value) 8 Milliliter per square meter 9 C1532780
alternative label: Milliliter per meter squared
alternative label: mL/m2
alternative label: Milliliter per meter2
alternative label: Milliliter per square metre
alternative label: Milliliter/Square Meter
alternative label: Milliliter per metre squared
alternative label: Milliliter/meter2

Milliliter per Square Meter per Day
type: Class
subclass of: Units
comment: 1 M05431 2 Milliliter per Square Meter per Day 3 mL/m2/d Milliliter/meter2/day mL/m2/day Milliliter/square meter/day 4 Milliliter per Square Meter per Day 5 426529006 6 Milliliter/square meter/day 7 Milliliter/square meter/day (qualifier value) 8 Milliliter/square meter/day 9 C1961136
alternative label: Milliliter/meter2/day
alternative label: mL/m2/d
alternative label: Milliliter/square meter/day
alternative label: mL/m2/day

Milliliter per Square Meter per Hour
type: Class
subclass of: Units
comment: 1 M05414 2 Milliliter per Square Meter per Hour 3 mL/m2/h mL/m2/hr Milliliter/square meter/hour 4 Milliliter per Square Meter per Hour 5 425773003 6 Milliliter/square meter/hour 7 Milliliter/square meter/hour (qualifier value) 8 Milliliter/square meter/hour 9 C1960954
alternative label: mL/m2/h
alternative label: mL/m2/hr
alternative label: Milliliter/square meter/hour

Milliliter per Square Meter per Minute
type: Class
subclass of: Units
comment: 1 M04194 2 Milliliter per Square Meter per Minute 3 mL/m2/min Milliliter/Square Meter/Minute 4 Milliliter per Square Meter per Minute 5 258972003 6 milliliter/minute/meter squared 7 Milliliter/minute/square meter (qualifier value) 8 milliliter/minute/meter squared 9 C0439414
alternative label: mL/m2/min
alternative label: Milliliter/Square Meter/Minute

Milliliter per milliliter
type: Class
subclass of: Units
comment: 1 M05124 2 Milliliter per milliliter 3 mL/mL Millilitre/millilitre Millilitre per millilitre Milliliter/milliliter 4 Milliliter per milliliter 5 419346007 6 Milliliter per milliliter 7 Milliliter/milliliter (qualifier value) 8 Milliliter per milliliter 9 C1623737
alternative label: Millilitre/millilitre
alternative label: Millilitre per millilitre
alternative label: Milliliter/milliliter
alternative label: mL/mL

Millimeter
type: Class
subclass of: Units
comment: 1 M03719 2 Millimeter 3 mm millimetre millimeters 4 Millimeter 5 258673006 6 Millimeter 7 Millimeter (qualifier value) 8 Millimeter 9 C0439200
alternative label: millimeters
alternative label: millimetre
alternative label: mm

Millimeter Squared
type: Class
subclass of: Units
comment: 1 M04456 2 Millimeter Squared 3 mm2 sq. mm 4 Millimeter Squared 5 277472009 6 sq. mm 7 Square millimeter (qualifier value) 8 sq. mm 9 C0456786
alternative label: mm2
alternative label: sq. mm

Millimeter of Mercury
type: Class
subclass of: Units
comment: 1 M04323 2 Millimeter of Mercury 3 millimetre of mercury mmHg 4 Millimeter of Mercury 5 259018001 6 millimeter of mercury 7 Millimeter of mercury (qualifier value) 8 millimeter of mercury 9 C0439475
alternative label: millimetre of mercury
alternative label: mmHg

Millimeter per Hour
type: Class
subclass of: Units
comment: 1 M04410 2 Millimeter per Hour 3 mm/h millimetre/hour millimeter/hour 4 Millimeter per Hour 5 258992005 6 Millimeter/hour 7 Millimeter/hour (qualifier value) 8 Millimeter/hour 9 C0456680
alternative label: mm/h
alternative label: millimeter/hour
alternative label: millimetre/hour

Millimole
type: Class
subclass of: Units
comment: 1 M03703 2 Millimole 3 mmol mmols millimoles 4 Millimole 5 258718000 6 millimole 7 millimole (qualifier value) 8 millimole 9 C0439190
alternative label: millimoles
alternative label: mmol
alternative label: mmols

Millimole per Gram
type: Class
subclass of: Units
comment: 1 M05573 2 Millimole per Gram 3 mmol/g 4 Millimole per Gram 5 258718000 6 millimole 7 millimole (qualifier value) 8 millimole 9 C0439190
alternative label: mmol/g

Millimole per Kilogram
type: Class
subclass of: Units
comment: 1 M03964 2 Millimole per Kilogram 3 mmol/kg millimole/kilogram 4 Millimole per Kilogram 5 258826003 6 Millimole/kilogram 7 Millimole/kilogram (qualifier value) 8 Millimole/kilogram 9 C0439291
alternative label: millimole/kilogram
alternative label: mmol/kg

Millimole per Liter
type: Class
subclass of: Units
comment: 1 M04912 2 Millimole per Liter 3 mm mmol/L millimole/litre millimole/liter millimolar 4 Millimole per Liter 5 258813003 6 Millimole/liter 7 Millimole/liter (qualifier value) 8 Millimole/liter 9 C1532564
alternative label: millimolar
alternative label: millimole/litre
alternative label: millimole/liter
alternative label: mM
alternative label: mmol/L

Millimole per Microgram
type: Class
subclass of: Units
comment: 1 M05590 2 Millimole per Microgram 3 mmol/ug mmol/mcg 4 Millimole per Microgram 5 258718000 6 millimole 7 millimole (qualifier value) 8 millimole 9 C0439190
alternative label: mmol/mcg
alternative label: mmol/ug

Millimole per Microliter
type: Class
subclass of: Units
comment: 1 M05606 2 Millimole per Microliter 3 mmol/uL 4 Millimole per Microliter 5 258718000 6 millimole 7 millimole (qualifier value) 8 millimole 9 C0439190
alternative label: mmol/uL

Millimole per Milligram
type: Class
subclass of: Units
comment: 1 M05554 2 Millimole per Milligram 3 mmol/mg 4 Millimole per Milligram 5 258718000 6 millimole 7 millimole (qualifier value) 8 millimole 9 C0439190
alternative label: mmol/mg

Millimole per Milliliter
type: Class
subclass of: Units
comment: 1 M03651 2 Millimole per Milliliter 3 mmol/mL Millimoles/milliliter 4 Millimole per Milliliter 5 258812007 6 Millimole per Milliliter 7 Mole/liter (qualifier value) 8 Millimoles/milliliter 9 C0347982
alternative label: Millimoles/milliliter
alternative label: mmol/mL

Millimole per kilogram per day
type: Class
subclass of: Units
comment: 1 M05031 2 Millimole per kilogram per day 3 mmol/kg/day Millimole/kilogram/day 4 Millimole per kilogram per day 5 414741002 6 Millimole per kilogram per day 7 Millimole/kilogram/day (qualifier value) 8 Millimole per kilogram per day 9 C1532977
alternative label: mmol/kg/day
alternative label: Millimole/kilogram/day

Millimole per kilogram per hour
type: Class
subclass of: Units
comment: 1 M05033 2 Millimole per kilogram per hour 3 mmol/kg/hr Millimole/kilogram/hour 4 Millimole per kilogram per hour 5 414742009 6 Millimole per kilogram per hour 7 Millimole/kilogram/hour (qualifier value) 8 Millimole per kilogram per hour 9 C1532978
alternative label: Millimole/kilogram/hour
alternative label: mmol/kg/hr

Millimole per square meter
type: Class
subclass of: Units
comment: 1 M05039 2 Millimole per square meter 3 mmol/m2 Millimole/squarermetre Millimole/square meter Millimole/meter2 Millimole/meter squared Millimole per square metre Millimole per metre squared Millimole per meter squared 4 Millimole per square meter 5 414743004 6 Millimole per square meter 7 Millimole/square meter (qualifier value) 8 Millimole per square meter 9 C1532979
alternative label: Millimole/square meter
alternative label: Millimole per meter squared
alternative label: Millimole/meter squared
alternative label: mmol/m2
alternative label: Millimole per metre squared
alternative label: Millimole per square metre
alternative label: Millimole/meter2
alternative label: Millimole/square metre

Millimoles per kilogram per minute
type: Class
subclass of: Units
comment: 1 M05176 2 Millimoles per kilogram per minute 3 mmol/kg/min Millimoles/kilogram/minute 4 Millimoles per kilogram per minute 5 418599006 6 Millimole per kilogram per minute 7 Millimole per kilogram per minute (qualifier value) 8 mmol/kg/min 9 C1636669
alternative label: mmol/kg/min
alternative label: Millimoles/kilogram/minute

Million International Units
type: Class
subclass of: Units
comment: 1 M05391 2 Million International Units 3 million IU 4 Million International Units 5 258999003 6 mIU 7 milliinternational unit (qualifier value) 8 mIU 9 C0439457
alternative label: million IU

Million Unit
type: Class
subclass of: Units
comment: 1 M04797 2 Million Unit 3 million units 4 Million Unit 5 396186001 6 Million unit 7 Million unit (qualifier value) 8 Million unit 9 C1306898
alternative label: million units

Million per Cubic Millimeter
type: Class
subclass of: Units
comment: 1 M04384 2 Million per Cubic Millimeter 3 None 4 Million per Cubic Millimeter 5 767525000 6 Unit 7 Unit (qualifier value) 8 Unit 9 C0439148

Million per Liter
type: Class
subclass of: Units
comment: 1 M05397 2 Million per Liter 3 None 4 Million per Liter 5 767525000 6 unit 7 Unit (qualifier value) 8 Unit 9 C0439190

Million per Microliter
type: Class
subclass of: Units
comment: 1 M04383 2 Million per Microliter 3 Million/milliliter Million Cells per Microliter 4 Million per Microliter 5 420167005 6 Per microliter 7 Per microliter (qualifier value) 8 Million per Microliter 9 C0456614
alternative label: Million/milliliter
alternative label: Million Cells per Microliter

Million per Milliliter
type: Class
subclass of: Units
comment: 1 M04391 2 Million per Milliliter 3 Million/mL 4 Million per Milliliter 5 259035002 6 per milliliter 7 per milliliter (qualifier value) 8 Billion per Liter 9 C0456615
alternative label: Million/mL

Million units per square meter
type: Class
subclass of: Units
comment: 1 M05054 2 Million units per square meter 3 Million units/square metre Million units/square meter Million units/meter2 Million units/meter squared Million units per square metre Million units per metre squared Million units per meter2 Million units per meter squared MU/m2 4 Million units per square meter 5 414745006 6 Million units per square meter 7 Million units/meter squared (qualifier value) 8 Million units per square meter 9 C1532981
alternative label: Million units/meter2
alternative label: Million units per metre squared
alternative label: MU/m2
alternative label: Million units/meter squared
alternative label: Million units per square metre
alternative label: Million units per meter squared
alternative label: Million units/square metre
alternative label: Million units/square meter
alternative label: Million units per meter2

Milliosmole per Kilogram
type: Class
subclass of: Units
comment: 1 M04059 2 Milliosmole per Kilogram 3 milliosmole/kilogram mosmol/kg mOsm/kg 4 Milliosmole per Kilogram 5 258870007 6 Milliosmole/kilogram 7 Milliosmole/kilogram (qualifier value) 8 Milliosmole/kilogram 9 C0439353
alternative label: mOsm/kg
alternative label: milliosmole/kilogram
alternative label: mosmol/kg

Milliosmoles per kilogram H2O
type: Class
subclass of: Units
comment: 1 M05171 2 Milliosmoles per kilogram H2O 3 mosmol/kg H2O mOsm/kg H2O" 4 Milliosmoles per kilogram H2O 5 419541001 6 Milliosmoles per kilogram H2O 7 Milliosmoles per kilogram H2O (qualifier value) 8 Milliosmoles per kilogram H2O 9 C1635264
alternative label: mosmol/kg H2O
alternative label: mOsm/kg H2O

Milliosmoles per kilogram water
type: Class
subclass of: Units
comment: 1 M05170 2 Milliosmoles per kilogram water 3 None 4 Milliosmoles per kilogram water 5 419541001 6 Milliosmoles per kilogram water 7 Milliosmoles per kilogram H2O (qualifier value) 8 Milliosmoles per kilogram water 9 C1635264

Millipascal
type: Class
subclass of: Units
comment: 1 M05541 2 Millipascal 3 mPa 4 Millipascal 5 259016002 6 Pascal 7 Pascal (qualifier value) 8 Millipascal 9 C2347163
alternative label: mPa

Millisecond
type: Class
subclass of: Units
comment: 1 M03764 2 Millisecond 3 ms msec 4 Millisecond 5 258697002 6 Millisecond 7 Millisecond (qualifier value) 8 Millisecond 9 C0439223
alternative label: msec
alternative label: ms

Milliunit
type: Class
subclass of: Units
comment: 1 M04795 2 Milliunit 3 mU munit 4 Milliunit 5 414746007 6 Milliunit 7 Milliunit (qualifier value) 8 Milliunit 9 C1306898
alternative label: mU
alternative label: munit

Milliunit per Liter
type: Class
subclass of: Units
comment: 1 M04052 2 Milliunit per Liter 3 milliunit/litre milliunit/liter mU/L 4 Milliunit per Liter 5 258953003 6 Milliunit/liter 7 Milliunit/liter (qualifier value) 8 Milliunit/liter 9 C0439342
alternative label: milliunit/litre
alternative label: milliunit/liter
alternative label: mU/L

Milliunit per Milliliter
type: Class
subclass of: Units
comment: 1 M04038 2 Milliunit per Milliliter 3 milliunit/millilitre milliunit/milliliter mU/mL 4 Milliunit per Milliliter 5 258954009 6 Milliunit/milliliter 7 Milliunit/milliliter (qualifier value) 8 Milliunit/milliliter 9 C0439339
alternative label: mU/mL
alternative label: milliunit/millilitre
alternative label: milliunit/milliliter

Milliunit per gram
type: Class
subclass of: Units
comment: 1 M05060 2 Milliunit per gram 3 munit/gm Milliunit/gram mU/g 4 Milliunit per gram 5 414747003 6 Milliunit per gram 7 Milliunit/gram (qualifier value) 8 Milliunit per gram 9 C1532982
alternative label: Milliunit/gram
alternative label: munit/gm
alternative label: mU/g

Milliunit per hour
type: Class
subclass of: Units
comment: 1 M05356 2 Milliunit per hour 3munit/hr Milliunit/hour mU/hr 4 Milliunit per hour 5 425020006 6 Milliunit per hour 7 Milliunit/hour (qualifier value) 8 Milliunit per hour 9 C1827196
alternative label: Milliunit/hour
alternative label: mU/hr
alternative label: munit/hr

Milliunit per kilogram per day
type: Class
subclass of: Units
comment: 1 M05351 2 Milliunit per kilogram per day 3 munit/kg/day Milliunit/kilogram/day mU/kg/day 4 Milliunit per kilogram per day 5 424319001 6 Milliunit per kilogram per day 7 Milliunit/kilogram/day (qualifier value) 8 Milliunit per kilogram per day 9 C1827064
alternative label: munit/kg/day
alternative label: Milliunit/kilogram/day
alternative label: mU/kg/day

Milliunit per kilogram per hour
type: Class
subclass of: Units
comment: 1 M05359 2 Milliunit per kilogram per hour 3 munit/kg/hr Milliunit/kilogram/hour mU/kg/hr 4 Milliunit per kilogram per hour 5 425216001 6 Milliunit per kilogram per hour 7 Milliunit/kilogram/hour (qualifier value) 8 Milliunit per kilogram per hour 9 C1827679
alternative label: Milliunit/kilogram/hour
alternative label: mU/kg/hr
alternative label: munit/kg/hr

Milliunit per kilogram per minute
type: Class
subclass of: Units
comment: 1 M05362 2 Milliunit per kilogram per minute 3 munit/kg/min Milliunit/kilogram/minute mU/kg/min 4 Milliunit per kilogram per minute 5 425386009 6 Milliunit per kilogram per minute 7 Milliunit/kilogram/minute (qualifier value) 8 Milliunit per kilogram per minute 9 C1828077
alternative label: munit/kg/min
alternative label: Milliunit/kilogram/minute
alternative label: mU/kg/min

Milliunit per minute
type: Class
subclass of: Units
comment: 1 M05063 2 Milliunit per minute 3 munit/min Milliunit/minute mU/min 4 Milliunit per minute 5 414748008 6 Milliunit per minute 7 Milliunit/minute (qualifier value) 8 Milliunit per minute 9 C1532983
alternative label: Milliunit/minute
alternative label: mU/min
alternative label: munit/min

Milliunits per gram hemoglobin
type: Class
subclass of: Units
comment: 1 M05173 2 Milliunits per gram hemoglobin 3 munit/g Hb munit/gm HB Milliunits per gram haemoglobin 4 Milliunits per gram hemoglobin 5 419171003 6 Milliunits per gram hemoglobin 7 Milliunits per gram hemoglobin (qualifier value) 8 Milliunits per gram hemoglobin 9 C1636657
alternative label: Milliunits per gram haemoglobin
alternative label: munit/gm Hb
alternative label: munit/g Hb

Millivolt
type: Class
subclass of: Units
comment: 1 M04427 2 Millivolt 3 None 4 Millivolt 5 473017002 6 millivolt 7 millivolt (qualifier value) 8 millivolt 9 C0456691

Mineral balance
type: Class
subclass of: Functions of Blood System, Metabolic system and Endocrine system (Body measurement)
comment: 1 MD05961 2 Mineral balance 3 None 4 Mineral balance 5 282300003 6 does balance 7 Does balance (finding) 8 Mineral balance 9 C0814001

Minerals
type: Class
subclass of: Nutritional management
comment: 1 MD02974 2 minerals 3 None 4 Minerals 5 226352007 6 Mineral 7 Mineral (substance) 8 Minerals 9 C0026162

Mini-Mental Status Examination-
type: Class
subclass of: Tool
comment: 1 MD03688 2 Mini-Mental Status Examination- 3 Mini-Mental Status Examinination 4 Mini-Mental Status Examination- 5 273617000 6 Mini-mental state examination 7 Mini-mental state examination (assessment scale) 8 Mini-mental state examination 9 C0451306
alternative label: Mini-Mental Status Examinination

Minnesota Manual Dexterity Test
type: Class
subclass of: Tool
comment: 1 MD04172 2 Minnesota Manual Dexterity Test 3 None 4 Minnesota Manual Dexterity Test 5 272393004 6 Tests 7 Tests (qualifier value) 8 Tests (qualifier value) 9 C0392366
comment: 1 MD04173 2 Minnesota Manual Dexterity Test 3 None 4 Minnesota Manual Dexterity Test 5 272393004 6 Tests 7 Tests (qualifier value) 8 Tests (qualifier value) 9 C0392366

Minute
type: Class
subclass of: Time patterns
comment: 1 MD03632 2 minute 3 min minutes Minute of time 4 minute 5 1156209001 6 minute 7 minute (qualifier value) 8 Minute 9 C1282918
alternative label: min
alternative label: Minute of time
alternative label: minutes

Miosis
type: Class
subclass of: Sensory function, Pain and Skin function (Symptom)
comment: 1 M02695 2 Miosis 3 None 4 Miosis 5 301939004 6 Miosis 7 Constricted pupil (finding) 8 Constricted pupil 9 C0728710

Miotic pupil
type: Class
subclass of: Sensory function, Pain and Skin function (Symptom)
comment: 1 M02696 2 Miotic pupil 3 None 4 Miotic pupil 5 301939004 6 Miotic pupil 7 Constricted pupil (finding) 8 Constricted pupil 9 C0728710

Mist therapy
type: Class
subclass of: Digestive function (Therapy)
comment: 1 M02461 2 Mist therapy 3 "Mist inhalation therapy mist tent therapy" 4 Mist therapy 5 229303007 6 Mist inhalation therapy 7 Humidifying inhalation therapy (regime/therapy) 8 Mist inhalation therapy 9 C0454514
alternative label: Mist inhalation therapy
alternative label: mist tent therapy

Mixed martial arts
type: Class
subclass of: Sport
comment: 1 MD01034 2 Mixed martial arts 3 None 4 Mixed martial arts 5 6351001 6 Martial arts 7 Martial arts (qualifier value) 8 Sports 9 C0038039

Mobile capability evaluation
type: Class
subclass of: Questionnaire
comment: 1 MD04740 2 Mobile capability evaluation 3 None 4 Mobile capability evaluation 5 430481008 6 Assessment of mobility 7 Assessment of mobility (procedure) 8 equipment 9 C0014672

Mobility
type: Class
subclass of: Health Related Factors
comment: 1 MD04760 2 Mobility 3 None 4 Mobility 5 246197003 6 Mobility 7 Mobility (attribute) 8 Mobility 9 C0425245
comment: 1 MD04760-1 2 Mobility 3 None 4 Mobility 5 246197003 6 Mobility 7 Mobility (attribute) 8 Mobility 9 C0449580
comment: 1 MD04760-1 2 Mobility 3 None 4 Mobility 5 363803005 6 Mobility 7 Mobility (observable entity) 8 Mobility 9 C0425245
comment: 1 MD04760-3 2 Mobility 3 None 4 Mobility 5 363803005 6 Mobility 7 Mobility (observable entity) 8 Mobility 9 C0449580

Mobility of a single joint
type: Class
subclass of: Musculoskeletal function (Body measurement)
comment: 1 MD06025 2 Mobility of a single joint 3 None 4 Mobility of a single joint 5 364564000 6 Range of motion 7 Range of joint movement (observable entity) 8 Mobility of a single joint 9 C2371198

Mobility of bone functions
type: Class
subclass of: Musculoskeletal function (Body measurement)
comment: 1 MD06036 2 Mobility of bone functions 3 None 4 Mobility of bone functions 5 363803005 6 Mobility 7 Mobility (observable entity) 8 Mobility of bone functions 9 C2371208

Mobility of carpal bones
type: Class
subclass of: Musculoskeletal function (Body measurement)
comment: 1 MD06039 2 Mobility of carpal bones 3 None 4 Mobility of carpal bones 5 363803005 6 Mobility 7 Mobility (observable entity) 8 Mobility of carpal bones 9 C2371211

Mobility of joint functions
type: Class
subclass of: Musculoskeletal function (Body measurement)
comment: 1 MD06024 2 Mobility of joint functions 3 None 4 Mobility of joint functions 5 364564000 6 Range of motion 7 Range of joint movement (observable entity) 8 Mobility of joint functions 9 C2371202

Mobility of joints generalized
type: Class
subclass of: Musculoskeletal function (Body measurement)
comment: 1 MD06027 2 Mobility of joints generalized 3 None 4 Mobility of joints generalized 5 364564000 6 Range of motion 7 Range of joint movement (observable entity) 8 Mobility of joints generalized 9 C2371200

Mobility of pelvis
type: Class
subclass of: Musculoskeletal function (Body measurement)
comment: 1 MD06038 2 Mobility of pelvis 3 None 4 Mobility of pelvis 5 363803005 6 Mobility 7 Mobility (observable entity) 8 Mobility of pelvis 9 C2371210

Mobility of scapula
type: Class
subclass of: Musculoskeletal function (Body measurement)
comment: 1 MD06037 2 Mobility of scapula 3 None 4 Mobility of scapula 5 363803005 6 Mobility 7 Mobility (observable entity) 8 Mobility of scapula 9 C2371209

Mobility of several joints
type: Class
subclass of: Musculoskeletal function (Body measurement)
comment: 1 MD06026 2 Mobility of several joints 3 None 4 Mobility of several joints 5 364564000 6 Range of motion 7 Range of joint movement (observable entity) 8 Mobility of several joints 9 C2371199

Mobility of tarsal bones
type: Class
subclass of: Musculoskeletal function (Body measurement)
comment: 1 MD06040 2 Mobility of tarsal bones 3 None 4 Mobility of tarsal bones 5 363803005 6 Mobility 7 Mobility (observable entity) 8 Mobility of tarsal bones 9 C2371212

Moderate cigarette smoker
type: Class
subclass of: Sub-Cultural Level
comment: 1 M00108 2 Moderate cigarette smoker 3 None 4 Moderate cigarette smoker 5 230062009 6 Moderate cigarette smoker 7 Moderate cigarette smoker (finding) 8 Moderate cigarette smoker 9 C0459846

Moderate drinker
type: Class
subclass of: Sub-Cultural Level
comment: 1 M00012 2 Moderate drinker 3 None 4 Moderate drinker 5 43783005 6 Moderate drinker 7 Moderate drinker (finding) 8 Moderate drinker 9 C0337677

Moderate level of physical functioning
type: Class
subclass of: Questionnaire
comment: 1 MD04734 2 Moderate level of physical functioning 3 None 4 Moderate level of physical functioning 5 258395000 6 Levels 7 Levels (qualifier value) 8 level of functioning 9 C0935587

Modern
type: Class
subclass of: Sport
comment: 1 MD01216 2 Modern 3 None 4 Modern 5 256235009 6 exercise 7 Exercise (observable entity) 8 Modern Dance 9 C4046019

Modified Barthel index
type: Class
subclass of: Questionnaire
comment: 1 MD05215 2 MBI (Modified Bathel Index) 3 Modified barthel Index 4 Modified Barthel index 5 443364002 6 Modified Barthel index of activities of daily living 7 Modified Barthel index of activities of daily living (assessment scale) 8 Modified Barthel index of activities of daily living 9 C2732233

Modified barthel index
type: Class
subclass of: Tool
comment: 1 MD03106 2 MBI (Modified Bathel Index) 3 Modified Barthel index 4 Modified barthel index 5 273302005 6 Barthel index 7 Barthel index (assessment scale) 8 Barthel index 9 C0451019

Molar quantity per unit body weight
type: Class
subclass of: Units
comment: 1 M03265 2 Molar quantity per unit body weight 3 None 4 Molar quantity per unit body weight 5 282827005 6 Molar quantity per unit body weight 7 Molar quantity per unit body weight (qualifier value) 8 Molar quantity per unit body weight 9 C0560743

Mole
type: Class
subclass of: Units
comment: 1 M03697 2 Mole 3 mol 4 Mole 5 106925002 6 Mole 7 Family Talpidae (organism) 8 Mole 9 C0027962
comment: 1 M03697-1 2 Mole 3 mol 4 Mole 5 106925002 6 Mole 7 Family Talpidae (organism) 8 Mole 9 C0324740
comment: 1 M03697-2 2 Mole 3 mol 4 Mole 5 400096001 6 Mole 7 Melanocytic nevus (disorder) 8 Mole 9 C0027962
comment: 1 M03697-3 2 Mole 3 mol 4 Mole 5 400096001 6 Mole 7 Melanocytic nevus (disorder) 8 Mole 9 C0324740
alternative label: mol

Mole per Gram
type: Class
subclass of: Units
comment: 1 M05552 2 Mole per Gram 3 mol/g Mole/Gram 4 Mole per Gram 5 258717005 6 mole - unit 7 mole - unit (qualifier value) 8 Mole per Gram (mol/g) 9 C2347285
alternative label: mol/g
alternative label: Mole/Gram

Mole per Kilogram
type: Class
subclass of: Units
comment: 1 M05571 2 Mole per Kilogram 3 mol/kg Mole/Kilogram 4 Mole per Kilogram 5 258717005 6 mole - unit 7 mole - unit (qualifier value) 8 Mole per Kilogram 9 C2347286
alternative label: Mole/Kilogram
alternative label: mol/kg

Mole per Milligram
type: Class
subclass of: Units
comment: 1 M05587 2 Mole per Milligram 3 mol/mg Mole/Milligram 4 Mole per Milligram 5 258717005 6 mole - unit 7 mole - unit (qualifier value) 8 millimole 9 C0439190
alternative label: mol/mg
alternative label: Mole/Milligram

Mole per Milliliter
type: Class
subclass of: Units
comment: 1 M05604 2 Mole per Milliliter 3 mol/ml Mole/Milliliter 4 Mole per Milliliter 5 258717005 6 mole - unit 7 mole - unit (qualifier value) 8 Mole per Milliliter 9 C2347288
alternative label: mol/mL
alternative label: Mole/Milliliter

Mole per Mole
type: Class
subclass of: Units
comment: 1 M05613 2 Mole per Mole 3 mol/mol Mole/Mole 4 Mole per Mole 5 258717005 6 mole - unit 7 mole - unit (qualifier value) 8 Mole, unit of measurement 9 C0439189
alternative label: Mole/Mole
alternative label: mol/mol

Mole per liter
type: Class
subclass of: Units
comment: 1 M03647 2 Mole per liter 3 molar (mol/l) mol/L mole/litre mole/liter Molar 4 Mole per liter 5 258812007 6 mol/L 7 Mole/liter (qualifier value) 8 Mole per Liter 9 C0347982
alternative label: Molar
alternative label: mole/liter
alternative label: molar (mol/l)
alternative label: mol/L

Moles per unit area
type: Class
subclass of: Units
comment: 1 M03395 2 Moles per unit area 3 None 4 Moles per unit area 5 414756006 6 Moles per unit area 7 Moles per unit area (qualifier value) 8 Moles per unit area 9 C1532990

Moles per unit mole
type: Class
subclass of: Units
comment: 1 M03396 2 Moles per unit mole 3 None 4 Moles per unit mole 5 414758007 6 Moles per unit mole 7 Moles per unit mole (qualifier value) 8 Moles per unit mole 9 C1532991

Moles per unit time
type: Class
subclass of: Units
comment: 1 M03163 2 Moles per unit time 3 None 4 Moles per unit time 5 282269002 6 Moles per unit time 7 Moles per unit time (qualifier value) 8 Moles per unit time 9 C0560156

Moles per unit time per unit volume
type: Class
subclass of: Units
comment: 1 M03181 2 Moles per unit time per unit volume 3 None 4 Moles per unit time per unit volume 5 282394004 6 Moles per unit time per unit volume 7 Moles per unit time per unit volume (qualifier value) 8 Moles per unit time per unit volume 9 C0560279

Momentary
type: Class
subclass of: Units
comment: 1 MD01962 2 Momentary 3 None 4 Momentary 5 359535008 6 Brief 7 Brief (qualifier value) 8 Brief 9 C1879313

Momento
type: Class
subclass of: Units
comment: 1 M05757 2 Momento 3 None 4 Momento 5 413568008 6 Application - unit of product usage (qualifier value) 7 Application - unit of product usage (qualifier value) 8 Application dose 9 C1533134

Monocular acuity of distant vision
type: Class
subclass of: Sensory function, Pain and Skin function (Body measurement)
comment: 1 MD05733 2 Monocular acuity of distant vision 3 None 4 Monocular acuity of distant vision 5 54055001 6 monocular vision 7 Monocular vision, function (observable entity) 8 Monocular acuity of distant vision 9 C2370923

Monocular acuity of near vision
type: Class
subclass of: Sensory function, Pain and Skin function (Body measurement)
comment: 1 MD05735 2 Monocular acuity of near vision 3 None 4 Monocular acuity of near vision 5 54055001 6 monocular vision 7 Monocular vision, function (observable entity) 8 Monocular acuity of near vision 9 C2370925

Month
type: Class
subclass of: Time patterns
comment: 1 M03777 2 Month 3 months. mo 4 Month 5 258706009 6 month 7 month (qualifier value) 8 month 9 C0439231
alternative label: mo
alternative label: months

Montreal Cognition Assessment-korea MOCA-K
type: Class
subclass of: Tool
comment: 1 MD03685 2 Montreal Cognition Assessment-korea MOCA-K 3 None 4 Montreal Cognition Assessment-korea MOCA-K 5 1148423001 6 Montreal Cognitive Assessment version 8.1 7 Montreal Cognitive Assessment version 8.1 (assessment scale) 8 Montreal Cognitive Assessment 9 C3496286

Mood
type: Class
subclass of: Nervous system and Mental function (Symptom)
comment: 1 M00555 2 Mood 3 mood 4 Mood 5 1155968006 6 Mood 7 Mood (observable entity) 8 Mood 9 C0026516

Mood-congruent delusion
type: Class
subclass of: Nervous system and Mental function (Symptom)
comment: 1 M00562 2 Mood-congruent delusion 3 None 4 Mood-congruent delusion 5 3185000 6 Mood-congruent delusion 7 Mood-congruent delusion (finding) 8 Mood-congruent delusion 9 C0233675

Mood-congruent hallucination
type: Class
subclass of: Nervous system and Mental function (Symptom)
comment: 1 M00563 2 Mood-congruent hallucination 3 None 4 Mood-congruent hallucination 5 26433004 6 Mood-congruent hallucination 7 Mood-congruent hallucination (finding) 8 Mood-congruent hallucination 9 C0233775

Mood-incongruent delusion
type: Class
subclass of: Nervous system and Mental function (Symptom)
comment: 1 M00564 2 Mood-incongruent delusion 3 None 4 Mood-incongruent delusion 5 53138005 6 Mood-incongruent delusion 7 Mood-incongruent delusion (finding) 8 Mood-incongruent delusion 9 C0233676

Mood-incongruent hallucination
type: Class
subclass of: Nervous system and Mental function (Symptom)
comment: 1 M00565 2 Mood-incongruent hallucination 3 None 4 Mood-incongruent hallucination 5 57553009 6 Mood-incongruent hallucination 7 Mood-incongruent hallucination (finding) 8 Mood-incongruent hallucination 9 C0233776

MoodPanda
type: Class
subclass of: Units
comment: 1 M05758 2 MoodPanda 3 None 4 MoodPanda 5 413568008 6 Application - unit of product usage (qualifier value) 7 Application - unit of product usage (qualifier value) 8 Application dose 9 C1533134

Mood Congruent Hallucination
type: Class
subclass of: Nervous system and Mental function (Symptom)
comment: 1 M01963 2 Mood Congruent Hallucination 3 Mood Congruent Hallucinations 4 Mood Congruent Hallucination 5 26433004 6 Mood-congruent hallucination 7 Mood-congruent hallucination (finding) 8 Hallucinations, Mood Congruent 9 C0233775
alternative label: Mood Congruent Hallucinations

Mood Disorder Due to Specified Medical Condition
type: Class
subclass of: Nervous system and Mental function (Symptom)
comment: 1 M01987 2 Mood Disorder Due to Specified Medical Condition 3 None 4 Mood Disorder Due to Specified Medical Condition 5 46206005 6 mood disorder 7 Mood disorder (disorder) 8 mood disorder; medical condition 9 C1410011

Mood Incongruent Hallucination
type: Class
subclass of: Nervous system and Mental function (Symptom)
comment: 1 M01966 2 Mood Incongruent Hallucination 3 Mood Incongruent Hallucinations 4 Mood Incongruent Hallucination 5 57553009 6 Mood-incongruent hallucination 7 Mood-incongruent hallucination (finding) 8 Hallucinations, Mood Incongruent 9 C0233776
alternative label: Mood Incongruent Hallucinations

Mood anorexia
type: Class
subclass of: Nervous system and Mental function (Symptom)
comment: 1 M00557 2 Mood anorexia 3 None 4 Mood anorexia 5 46206005 6 Mood disorder 7 Mood disorder (disorder) 8 Mood anorexia 9 C0233502

Mood changes
type: Class
subclass of: Nervous system and Mental function (Symptom)
comment: 1 M01675 2 Mood changes 3 change of mood, Change in mood, Changeable mood, MOOD CHANGE 4 Mood changes 5 18963009 6 Changeable mood 7 Mood swings (finding) 8 Mood swings 9 C0085633
alternative label: Changeable mood
alternative label: change of mood
alternative label: Change in mood
alternative label: MOOD CHANGE

Mood disorder
type: Class
subclass of: Nervous system and Mental function (Symptom)
comment: 1 M00556 2 Mood disorder 3 disorder mood, Mood Disorders 4 Mood disorder 5 46206005 6 Mood disorder 7 Mood disorder (disorder) 8 Mood disorder 9 C0525045
alternative label: Mood Disorders
alternative label: disorder mood

Mood disorder due to a general medical condition
type: Class
subclass of: Nervous system and Mental function (Symptom)
comment: 1 M00558 2 Mood disorder due to a general medical condition 3 None 4 Mood disorder due to a general medical condition 5 37739004 6 Mood disorder due to a general medical condition 7 Mood disorder due to a general medical condition (disorder) 8 Mood disorder due to a general medical condition 9 C0236747

Mood disorder in full remission
type: Class
subclass of: Nervous system and Mental function (Symptom)
comment: 1 M00559 2 Mood disorder in full remission 3 None 4 Mood disorder in full remission 5 38547003 6 Mood disorder in full remission 7 Mood disorder in full remission (disorder) 8 Mood disorder in full remission 9 C0270418

Mood disorder in partial remission
type: Class
subclass of: Nervous system and Mental function (Symptom)
comment: 1 M00560 2 Mood disorder in partial remission 3 None 4 Mood disorder in partial remission 5 74266001 6 Mood disorder in partial remission 7 Mood disorder in partial remission (disorder) 8 Mood disorder in partial remission 9 C0270417

Mood finding
type: Class
subclass of: Nervous system and Mental function (Symptom)
comment: 1 M00566 2 Mood finding 3 None 4 Mood finding 5 106131003 6 Mood finding 7 Mood finding (finding) 8 Mood finding 9 C0424108

Mood hypersomnia
type: Class
subclass of: Nervous system and Mental function (Symptom)
comment: 1 M00561 2 Mood hypersomnia 3 None 4 Mood hypersomnia 5 46206005 6 Mood disorder 7 Mood disorder (disorder) 8 Mood hypersomnia 9 C0233509

Mood is constant
type: Class
subclass of: Nervous system and Mental function (Body measurement)
comment: 1 M02630 2 Mood is constant 3 None 4 Mood is constant 5 225658008 6 Mood is constant 7 Mood stable (finding) 8 Mood stable 9 C0558223

Mood observations
type: Class
subclass of: Nervous system and Mental function (Symptom)
comment: 1 M02273 2 Mood observations 3 None 4 Mood observations 5 106131003 6 Mood observations 7 Mood finding (finding) 8 Mood finding 9 C0424108

Mood raised
type: Class
subclass of: Nervous system and Mental function (Symptom)
comment: 1 M05826 2 Mood raised 3 None 4 Mood raised 5 81548002 6 Mood raised 7 Elevated mood (finding) 8 Mood raised 9 C0233479

Mood stable
type: Class
subclass of: Hospital information, examination/diagnosis/treatment data
comment: 1 M00567 2 Mood stable 3 None 4 Mood stable 5 225658008 6 Mood stable 7 Mood stable (finding) 8 Mood stable 9 C0558223

Mood swings
type: Class
subclass of: Nervous system and Mental function (Symptom)
comment: 1 M01676 2 Mood swing 3 mood swings 4 Mood swings 5 18963009 6 Mood swing 7 Mood swings (finding) 8 Mood swing 9 C0085633

Mortality
type: Class
subclass of: Hospital information, examination/diagnosis/treatment data
comment: 1 MD00442 2 Mortality 3 None 4 Mortality 5 409651001 6 Mortality rate 7 Mortality rate (observable entity) 8 Hospital Mortality 9 C0085556

Mother-child center
type: Class
subclass of: Classification of Hospital
comment: 1 MD00139 2 Mother-child center 3 None 4 Mother-child center 5 6827000 6 Local community health center 7 Local community health center (environment) 8 mother and child 9 C0260023

Motion Composites
type: Class
subclass of: Equipment
comment: 1 MD01933 2 Motion Composites 3 None 4 Motion Composites 5 49062001 6 Device 7 Device (physical object) 8 Devices 9 C0699733

Motion analysis
type: Class
subclass of: Questionnaire
comment: 1 MD04460 2 Motion analysis 3 None 4 Motion analysis 5 272389005 6 Analysis 7 Analysis (qualifier value) 8 Analysis 9 C0936012

Motion evaluation
type: Class
subclass of: Questionnaire
comment: 1 MD04453 2 Motion evaluation 3 None 4 Motion evaluation 5 129265001 6 Evaluation 7 Evaluation - action (qualifier value) 8 Evaluation 9 C0220825

Motivation
type: Class
subclass of: Nervous system and Mental function (Body measurement)
comment: 1 MD05631 2 Motivation 3 None 4 Motivation 5 363882003 6 Motivation 7 Motivation (observable entity) 8 Motivation 9 C0026605

Motor reflex functions
type: Class
subclass of: Nervous system and Mental function (Body measurement)
comment: 1 MD06070 2 Motor reflex functions 3 None 4 Motor reflex functions 5 106146005 6 Reflexes 7 Reflex finding (finding) 8 Motor reflex functions 9 C2371245

Mountain biking
type: Class
subclass of: Sport
comment: 1 MD00997 2 Mountain biking 3 mountain bike 4 Mountain biking 5 300648001 6 rides a bicycle 7 Does ride a bicycle (finding) 8 Does ride a bicycle 9 C0577368

Mountain climbing
type: Class
subclass of: Sport
comment: 1 M00332 2 Mountain climbing 3 mountain climber 4 Mountain climbing 5 111055000 6 Mountain climbing 7 Mountain climbing (qualifier value) 8 Mountain climbing 9 C0336963
alternative label: mountain climber

Mouth
type: Class
subclass of: Sensory function, Pain and Skin function (Body region)
comment: 1 M00231 2 Mouth 3 Mouthing 4 Mouth 5 123851003 6 Mouth 7 Mouth region structure (body structure) 8 Mouth 9 C0230028
alternative label: Mouthing

Movement of the frog
type: Class
subclass of: Conditioning exercise
comment: 1 MD02840 2 Movement of the frog 3 None 4 Movement of the frog 5 256235009 6 exercise 7 Exercise (observable entity) 8 Exercise 9 C0015259

Moving around
type: Class
subclass of: Health Related Factors
comment: 1 MD06340 2 Moving around 3 None 4 Moving around 5 302000008 6 move 7 Does move (finding) 8 Moving around 9 C2371425

Moving around in different locations
type: Class
subclass of: Health Related Factors
comment: 1 MD06346 2 Moving around in different locations 3 None 4 Moving around in different locations 5 302000008 6 move 7 Does move (finding) 8 Moving around in different locations 9 C2371428

Moving around outside the home and other buildings
type: Class
subclass of: Health Related Factors
comment: 1 MD06349 2 Moving around outside the home and other buildings 3 None 4 Moving around outside the home and other buildings 5 302000008 6 move 7 Does move (finding) 8 Moving around outside the home and other buildings 9 C2371431

Moving around using equipment
type: Class
subclass of: Health Related Factors
comment: 1 MD06352 2 Moving around using equipment 3 None 4 Moving around using equipment 5 302000008 6 move 7 Does move (finding) 8 Moving around using equipment 9 C2371434

Moving around within buildings other than home
type: Class
subclass of: Health Related Factors
comment: 1 MD06348 2 Moving around within buildings other than home 3 None 4 Moving around within buildings other than home 5 302000008 6 move 7 Does move (finding) 8 Moving around within buildings other than home 9 C2371430

Moving around within the home
type: Class
subclass of: Health Related Factors
comment: 1 MD06347 2 Moving around within the home 3 None 4 Moving around within the home 5 714998007 6 Ability to move around home 7 Ability to mobilize in home (observable entity) 8 Moving around within the home 9 C2371429

Moving objects with lower extremities
type: Class
subclass of: Health Related Factors
comment: 1 MD06310 2 Moving objects with lower extremities 3 None 4 Moving objects with lower extremities 5 272734009 6 Object 7 Object (attribute) 8 Moving objects with lower extremities 9 C2371404

Moyamoya disease
type: Class
subclass of: Cardiovascular system function (Symptom)
comment: 1 MD00336 2 Moyamoya disease 3 None 4 Moyamoya disease 5 69116000 6 Moyamoya disease 7 Moyamoya disease (disorder) 8 Moyamoya Disease 9 C0026654

Much
type: Class
subclass of: Urogenital function (Body measurement)
comment: 1 MD01731 2 Much 3 None 4 Much 5 260396001 6 Numerous 7 Numerous (qualifier value) 8 Numerous 9 C0439064

Multi-worker collaboration and continuous interaction
type: Class
subclass of: Questionnaire
comment: 1 MD05126 2 Multi-worker collaboration and continuous interaction 3 None 4 Multi-worker collaboration and continuous interaction 5 273389003 6 Daily activities questionnaire 7 Daily activities questionnaire (assessment scale) 8 questionnaire 9 C0034394

Multidimensional fracture of the lower extremities
type: Class
subclass of: Hospital information, examination/diagnosis/treatment data
comment: 1 MD04317 2 Multidimensional fracture of the lower extremities 3 None 4 Multidimensional fracture of the lower extremities 5 125605004 6 Fracture 7 Fracture of bone (disorder) 8 Fracture 9 C0016658

Multifunctional Reach Test
type: Class
subclass of: Tool
comment: 1 MD03105 2 Multifunctional Reach Test 3 None 4 Multifunctional Reach Test 5 428963006 6 Functional reach test 7 Functional reach test (procedure) 8 Functional reach test 9 C1998271

Multiple Sclerosis
type: Class
subclass of: Cardiovascular system function (Symptom)
comment: 1 MD00268 2 Multiple Sclerosis 3 None 4 Multiple Sclerosis 5 24700007 6 Multiple sclerosis 7 Multiple sclerosis (disorder) 8 Multiple Sclerosis 9 C0026769

Multiple congenital exostoses
type: Class
subclass of: Musculoskeletal function (Symptom)
comment: 1 MD00534 2 Multiple congenital exostoses 3 None 4 Multiple congenital exostoses 5 254044004 6 Multiple congenital exostosis 7 Multiple congenital exostosis (disorder) 8 Congenital exostosis 9 C0345400

Muscle ache
type: Class
subclass of: Sensory function, Pain and Skin function (Symptom)
comment: 1 M01825 2 Muscle ache 3 Muscle aches, ache muscle, ache muscles, aches muscle, aches muscles, Aching muscles 4 Muscle ache 5 68962001 6 Muscle ache 7 Muscle pain (finding) 8 Muscle ache 9 C0231528
alternative label: ache muscles
alternative label: Aching muscles
alternative label: ache muscle
alternative label: Muscle aches
alternative label: aches muscle

Muscle bulk
type: Class
subclass of: Musculoskeletal function (Body measurement)
comment: 1 M02002 2 Muscle bulk 3 None 4 Muscle bulk 5 71616004 6 muscle 7 Skeletal and/or smooth muscle structure (body structure) 8 Muscle (organ) 9 C4083049

Muscle endurance functions
type: Class
subclass of: Musculoskeletal function (Body measurement)
comment: 1 MD06063 2 Muscle endurance functions 3 None 4 Muscle endurance functions 5 406203001 6 Endurance 7 Endurance (observable entity) 8 Muscle endurance functions 9 C2371239

Muscle force
type: Class
subclass of: Health Related Factors
comment: 1 MD02710 2 Muscle force 3 None 4 Muscle force 5 271708004 6 muscle power 7 Finding of power of skeletal muscle (finding) 8 Muscle Strength 9 C0517349

Muscle power functions
type: Class
subclass of: Musculoskeletal function (Body measurement)
comment: 1 MD06043 2 Muscle power functions 3 None 4 Muscle power functions 5 271708004 6 Muscle power 7 Finding of power of skeletal muscle (finding) 8 Muscle power functions 9 C2371225

Muscle strength
type: Class
subclass of: Musculoskeletal function (Body measurement)
comment: 1 MD04275 2 Muscle strength 3 None 4 Muscle strength 5 44432004 6 Muscle tensile strength, function 7 Muscle tensile strength, function (observable entity) 8 muscle strength 9 C0517349
comment: 1 MD04275-1 2 Muscle strength 3 None 4 Muscle strength 5 271708004 6 Muscle power 7 Finding of power of skeletal muscle (finding) 8 O/E - muscle power 9 C0437311
comment: 1 MD04275-2 2 Muscle strength 3 None 4 Muscle strength 5 271708004 6 Muscle power 7 Finding of power of skeletal muscle (finding) 8 Muscle Strength 9 C0517349

Muscle strength exercise
type: Class
subclass of: Sport
comment: 1 MD01205 2 Muscle strength exercise 3 None 4 Muscle strength exercise 5 266741004 6 Muscle strength exercise 7 Muscle strength exercise (regime/therapy) 8 Muscle strength exercise 9 C0419118

Muscle strength measurement
type: Class
subclass of: Tool
comment: 1 MD04274 2 Muscle strength measurement 3 None 4 Muscle strength measurement 5 1234855004 6 Measurement of muscle tone 7 Measurement of muscle tone (procedure) 8 examination of muscle tone 9 C2243075

Muscle tone functions
type: Class
subclass of: Musculoskeletal function (Body measurement)
comment: 1 MD06053 2 Muscle tone functions 3 None 4 Muscle tone functions 5 366725004 6 Muscle tone - finding 7 Finding of muscle tone (finding) 8 Muscle tone functions 9 C2371234

Muscle twitch
type: Class
subclass of: Musculoskeletal function (Symptom)
comment: 1 M01850 2 Muscle twitch 3 muscle twitching 4 Muscle twitch 5 60238002 6 Muscle twitch 7 Muscle twitch (finding) 8 Muscle twitch 9 C0231530
alternative label: muscle twitching

Muscles Involved
type: Class
subclass of: Muscle Strengthening Exercise
comment: 1 MD02025 2 Muscles Involved 3 None 4 Muscles Involved 5 71616004 6 Muscle 7 Skeletal and/or smooth muscle structure (body structure) 8 Muscle involved 9 C0449621

Muscles of ankle and foot
type: Class
subclass of: Musculoskeletal function (Body region)
comment: 1 MD07076 2 Muscles of ankle and foot 3 None 4 Muscles of ankle and foot 5 67240005 6 Muscle of foot 7 Muscle structure of foot (body structure) 8 Muscles of ankle and foot 9 C2371891

Muscles of forearm
type: Class
subclass of: Musculoskeletal function (Body region)
comment: 1 MD07038 2 Muscles of forearm 3 None 4 Muscles of forearm 5 181631004 6 Entire muscle of forearm 7 Entire muscle of forearm (body structure) 8 Muscles of forearm 9 C1760774

Muscles of hand
type: Class
subclass of: Musculoskeletal function (Body region)
comment: 1 MD07045 2 Muscles of hand 3 None 4 Muscles of hand 5 110540008 6 Muscle of hand 7 Muscle structure of hand (body structure) 8 Muscles of hand 9 C0581668

Muscles of head and neck region
type: Class
subclass of: Musculoskeletal function (Body region)
comment: 1 MD07016 2 Muscles of head and neck region 3 None 4 Muscles of head and neck region 5 16982005 6 Skeletal muscle structure of head and/or neck 7 Shoulder region structure (body structure) 8 Muscles of head and neck region 9 C2371059

Muscles of lower leg
type: Class
subclass of: Musculoskeletal function (Body region)
comment: 1 MD07069 2 Muscles of lower leg 3 None 4 Muscles of lower leg 5 265806001 6 Entire muscle of lower leg 7 Entire skeletal muscle of lower leg (body structure) 8 Muscles of lower leg 9 C2371886

Muscles of pelvic region
type: Class
subclass of: Musculoskeletal function (Body region)
comment: 1 MD07054 2 Muscles of pelvic region 3 None 4 Muscles of pelvic region 5 102290008 6 Pelvic muscle 7 Skeletal muscle structure of pelvis (body structure) 8 Muscles of pelvic region 9 C2371080

Muscles of respiration
type: Class
subclass of: Respiratory function (Body region)
comment: 1 MD06949 2 Muscles of respiration 3 None 4 Muscles of respiration 5 71616004 6 muscle 7 Skeletal and/or smooth muscle structure (body structure) 8 Muscles of respiration 9 C0035231

Muscles of shoulder region
type: Class
subclass of: Musculoskeletal function (Body region)
comment: 1 MD07023 2 Muscles of shoulder region 3 None 4 Muscles of shoulder region 5 102288007 6 Muscle of shoulder 7 Structure of skeletal muscle of shoulder (body structure) 8 Muscles of shoulder region 9 C2371064

Muscles of thigh
type: Class
subclass of: Musculoskeletal function (Body region)
comment: 1 MD07062 2 Muscles of thigh 3 None 4 Muscles of thigh 5 50092008 6 Muscle of thigh 7 Skeletal muscle structure of thigh (body structure) 8 Muscles of thigh 9 C0224416

Muscles of trunk
type: Class
subclass of: Musculoskeletal function (Body region)
comment: 1 MD07090 2 Muscles of trunk 3 None 4 Muscles of trunk 5 68230005 6 Muscle of trunk 7 Skeletal muscle structure of trunk (body structure) 8 Muscles of trunk 9 C0581755

Muscles of upper arm
type: Class
subclass of: Musculoskeletal function (Body region)
comment: 1 MD07031 2 Muscles of upper arm 3 None 4 Muscles of upper arm 5 244979005 6 Entire muscle of upper arm 7 Entire muscle of upper arm (body structure) 8 Muscles of upper arm 9 C2371068

Muscular endurance development exercise
type: Class
subclass of: Muscle Strengthening Exercise
comment: 1 M00351 2 Muscular endurance development exercise 3 None 4 Muscular endurance development exercise 5 88965008 6 Muscular endurance development exercise 7 Muscular endurance development exercise (regime/therapy) 8 Muscular endurance development exercise 9 C0419120

Muscular strength development exercise
type: Class
subclass of: Muscle Strengthening Exercise
comment: 1 M00356 2 Muscular strength development exercise 3 None 4 Muscular strength development exercise 5 6397004 6 Muscular strength development exercise 7 Muscular strength development exercise (regime/therapy) 8 Muscular strength development exercise 9 C0452260

Music therapy
type: Class
subclass of: Voice and Speaking (Therapy)
comment: 1 M00584 2 Music therapy 3 None 4 Music therapy 5 21065008 6 Music therapy 7 Music therapy (regime/therapy) 8 Music therapy 9 C0026868

MyFitnessPal
type: Class
subclass of: Units
comment: 1 M05760 2 MyFitnessPal 3 None 4 MyFitnessPal 5 413568008 6 Application - unit of product usage (qualifier value) 7 Application - unit of product usage (qualifier value) 8 Application dose 9 C1533134

Myalgia unspecified
type: Class
subclass of: Musculoskeletal function (Symptom)
comment: 1 M01836 2 Myalgia unspecified 3 None 4 Myalgia unspecified 5 68962001 6 Myalgia 7 Muscle pain (finding) 8 Myalgia 9 C0231528

Myasthenia gravis
type: Class
subclass of: Hospital information, examination/diagnosis/treatment data
comment: 1 MD00258 2 Myasthenia gravis 3 None 4 Myasthenia gravis 5 91637004 6 Myasthenia gravis 7 Myasthenia gravis (disorder) 8 Myasthenia gravis 9 C0026896

Mydriatic pupil
type: Class
subclass of: Sensory function, Pain and Skin function (Symptom)
comment: 1 M01238 2 Mydriatic pupil 3 Mydriasis 4 Mydriatic pupil 5 37125009 6 Mydriatic pupil 7 Dilated pupil (finding) 8 Mydriasis 9 C0026961
alternative label: Mydriasis

Myocardial disease
type: Class
subclass of: Cardiovascular system function (Symptom)
comment: 1 MD00335 2 Myocardial disease 3 None 4 Myocardial disease 5 57809008 6 Myocardial disease 7 Myocardial disease (disorder) 8 Cardiomyopathies 9 C0878544

http://www.semanticweb.org/user/ontologies/2023/10/untitled-ontology-5#N
type: Class
subclass of: Units
comment: 1 M03098 2 N 3 None 4 N 5 257970008 6 N 7 Upper case Roman letter N (qualifier value) 8 Upper case Roman letter N 9 C0347979
comment: 1 M03098-1 2 N 3 None 4 N 5 257970008 6 N 7 Upper case Roman letter N (qualifier value) 8 Lower case Roman letter n 9 C0439138
comment: 1 M03098-2 2 N 3 None 4 N 5 257992007 6 n 7 Lower case Roman letter n (qualifier value) 8 Upper case Roman letter N 9 C0347979
comment: 1 M03098-3 2 N 3 None 4 N 5 257992007 6 n 7 Lower case Roman letter n (qualifier value) 8 Lower case Roman letter n 9 C0439138

NAUSEA VOMITING AND DIARRHEA
type: Class
subclass of: Digestive function (Symptom)
comment: 1 M01713 2 NAUSEA VOMITING AND DIARRHEA 3 None 4 NAUSEA VOMITING AND DIARRHEA 5 2919008 6 Nausea, vomiting and diarrhea 7 Nausea, vomiting and diarrhea (disorder) 8 Nausea and vomiting 9 C0027498

NECK RIGID
type: Class
subclass of: Musculoskeletal function (Symptom)
comment: 1 M01706 2 NECK RIGID 3 NECK RIGIDITY NECK STIFF Neck stiffness NS - Neck stiffness RIGIDITY NECK 4 NECK RIGID 5 161882006 6 Neck stiffness 7 Stiff neck (finding) 8 Neck stiffness 9 C0151315
alternative label: RIGIDITY NECK
alternative label: NECK RIGIDITY
alternative label: NS - Neck stiffness
alternative label: NECK STIFF
alternative label: Neck stiffness

N of Performance
type: Class
subclass of: Units
comment: 1 MD03181 2 N of Performance 3 None 4 N of Performance 5 398166005 6 Performed 7 Performed (qualifier value) 8 Performance 9 C0597198

Nanocurie
type: Class
subclass of: Units
comment: 1 M04540 2 Nanocurie 3 nCi 4 Nanocurie 5 282112008 6 nanocurie 7 Nanocurie (qualifier value) 8 Nanocurie 9 C0560007
alternative label: nCi

Nanogram
type: Class
subclass of: Units
comment: 1 M03751 2 Nanogram 3 ng NGM nanograms 4 Nanogram 5 258686002 6 nanogram 7 nanogram (qualifier value) 8 nanogram 9 C0439212
alternative label: nanograms
alternative label: NGM
alternative label: ng

Nanogram per Cubic Decimeter
type: Class
subclass of: Units
comment: 1 M04003 2 Nanogram per Cubic Decimeter 3 ng/dm3 4 Nanogram per Cubic Decimeter 5 767525000 6 Unit 7 Unit (qualifier value) 8 Unit 9 C0439148
alternative label: ng/dm3

Nanogram per Deciliter
type: Class
subclass of: Units
comment: 1 M03881 2 Nanogram per Deciliter 3 ng/dL nanogram/decilitre nanogram/deciliter 4 Nanogram per Deciliter 5 258805003 6 Nanogram/deciliter 7 Nanogram/deciliter (qualifier value) 8 Nanogram/deciliter 9 C0439274
alternative label: ng/dL
alternative label: nanogram/decilitre
alternative label: nanogram/deciliter

Nanogram per Liter
type: Class
subclass of: Units
comment: 1 M04002 2 Nanogram per Liter 3 ng/L nanogram/litre nanogram/liter" 4 Nanogram per Liter 5 767525000 6 Unit 7 Unit (qualifier value) 8 Unit 9 C0439148
alternative label: nanogram/litre
alternative label: ng/L
alternative label: nanogram/liter

Nanogram per Microliter
type: Class
subclass of: Units
comment: 1 M03832 2 Nanogram per Microliter 3 ng/uL ng/microL nanogram/microlitre nanogram/microliter 4 Nanogram per Microliter 5 272082007 6 Nanogram/microliter 7 Nanogram/microliter (qualifier value) 8 Nanogram/microliter 9 C0439268
alternative label: nanogram/microlitre
alternative label: ng/microL
alternative label: ng/uL
alternative label: nanogram/microliter

Nanogram per Milligram
type: Class
subclass of: Units
comment: 1 M03866 2 Nanogram per Milligram 3 ng/mg 4 Nanogram per Milligram 5 767525000 6 Unit 7 Unit (qualifier value) 8 Unit 9 C0439148
alternative label: ng/mg

Nanogram per Milligram of Creatinine
type: Class
subclass of: Units
comment: 1 M05716 2 Nanogram per Milligram of Creatinine 3 ng/mg of Creatinine 4 Nanogram per Milligram of Creatinine 5 258976000 6 Nanomole per hour per milligram of creatinine 7 Nanomole per hour per milligram of creatinine (qualifier value) 8 Nanogram per Milligram of Creatinine 9 C2827905
alternative label: ng/mg of Creatinine

Nanogram per Milliliter
type: Class
subclass of: Units
comment: 1 M03888 2 Nanogram per Milliliter 3 ng/mL nanogram/millilitre nanogram/milliliter 4 Nanogram per Milliliter 5 258806002 6 Nanogram/milliliter 7 Nanogram/milliliter (qualifier value) 8 Nanogram/milliliter 9 C0439275
alternative label: nanogram/millilitre
alternative label: nanogram/milliliter
alternative label: ng/mL

Nanogram per Milliliter per Hour
type: Class
subclass of: Units
comment: 1 M05071 2 Nanogram per Milliliter per Hour 3 ng/mL/h ng/mL/hr Nanograms/milliliter/hour Nanograms per millilitre per hour Nanograms per milliliter per hour Nanogram/Milliliter/Hour 4 Nanogram per Milliliter per Hour 5 414800004 6 Nanograms per milliliter per hour 7 Nanograms/milliliter/hour (qualifier value) 8 Nanograms per milliliter per hour 9 C1533074
alternative label: Nanograms per milliliter per hour
alternative label: ng/mL/hr
alternative label: ng/mL/h
alternative label: Nanogram/Milliliter/Hour
alternative label: Nanograms per millilitre per hour
alternative label: Nanograms/milliliter/hour

Nanogram per gram
type: Class
subclass of: Units
comment: 1 M05146 2 Nanogram per gram 3 ng/gm ng/g Nanogram/gram 4 Nanogram per gram 5 418967006 6 Nanogram per gram 7 Nanogram per gram (qualifier value) 8 Nanogram per gram 9 C1627892
alternative label: ng/g
alternative label: ng/gm
alternative label: Nanogram/gram

Nanogram per kilogram per day
type: Class
subclass of: Units
comment: 1 M05353 2 Nanogram per kilogram per day 3 ng/kg/day Nanogram/kilogram/day 4 Nanogram per kilogram per day 5 423702009 6 Nanogram per kilogram per day 7 Nanogram/kilogram/day (qualifier value) 8 Nanogram per kilogram per day 9 C1827144
alternative label: ng/kg/day
alternative label: Nanogram/kilogram/day

Nanogram per kilogram per hour
type: Class
subclass of: Units
comment: 1 M04827 2 Nanogram per kilogram per hour 3 ng/kg/hr Nanogram/kilogram/hour 4 Nanogram per kilogram per hour 5 405666008 6 Nanogram per kilogram per hour 7 Nanogram/kilogram/hour (qualifier value) 8 Nanogram per kilogram per hour 9 C1320754
alternative label: ng/kg/hr
alternative label: Nanogram/kilogram/hour

Nanointernational Unit per Microliter
type: Class
subclass of: Units
comment: 1 M04299 2 Nanointernational Unit per Microliter 3 None 4 Nanointernational Unit per Microliter 5 767525000 6 Unit 7 Unit (qualifier value) 8 times/day 9 C0439511

Nanokatal
type: Class
subclass of: Units
comment: 1 M03812 2 Nanokatal 3 nkat 4 Nanokatal 5 258780000 6 Nanokatal 7 Nanokatal (qualifier value) 8 Nanokatal 9 C0439247
alternative label: nkat

Nanokatal per Liter
type: Class
subclass of: Units
comment: 1 M05615 2 Nanokatal per Liter 3 nkat/L Nanokatal/Liter 4 Nanokatal per Liter 5 258780000 6 Nanokatal 7 Nanokatal (qualifier value) 8 Nanokatal per Liter 9 C2347326
alternative label: nkat/L
alternative label: Nanokatal/Liter

Nanokatal per Milliliter
type: Class
subclass of: Units
comment: 1 M05381 2 Nanokatal per Milliliter 3 nkat/mL 4 Nanokatal per Milliliter 5 767525000 6 unit 7 Unit (qualifier value) 8 Unit 9 C0439194
alternative label: nkat/mL

Nanoliter
type: Class
subclass of: Units
comment: 1 M04543 2 Nanoliter 3 nL nls nanolitre 4 Nanoliter 5 282113003 6 Nanoliter 7 Nanoliter (qualifier value) 8 Nanoliter 9 C0560008
alternative label: nL
alternative label: nanolitre
alternative label: nls

Nanometer
type: Class
subclass of: Units
comment: 1 M03728 2 Nanometer 3 nm nanometer (nm) nanometer of light 4 Nanometer 5 258675004 6 Nanometer 7 Nanometer (qualifier value) 8 Nanometer 9 C0439202
alternative label: nanometer (nm)
alternative label: nanometer of light
alternative label: nm

Nanomole
type: Class
subclass of: Units
comment: 1 M03705 2 Nanomole 3 nmol NMOLE 4 Nanomole 5 258720002 6 nanomole 7 nanomole (qualifier value) 8 nanomole 9 C0439191
alternative label: nmol
alternative label: NMOLE

Nanomole per Cubic Meter
type: Class
subclass of: Units
comment: 1 M03928 2 Nanomole per Cubic Meter 3 nmol/m3 4 Nanomole per Cubic Meter 5 767525000 6 Unit 7 Unit (qualifier value) 8 Unit 9 C0439148
alternative label: nmol/m3

Nanomole per Liter
type: Class
subclass of: Units
comment: 1 M03910 2 Nanomole per Liter 3 nanomole per liter (nmol/L) nm nmol/L nanomole/litre nanomole/liter nanomolar 4 Nanomole per Liter 5 258817001 6 Nanomole/liter 7 Nanomole/liter (qualifier value) 8 Nanomole/liter 9 C0439282
alternative label: nanomole/liter
alternative label: nanomole/litre
alternative label: nanomole per liter (nmol/L)
alternative label: nanomolar

Nanomole per Microgram
type: Class
subclass of: Units
comment: 1 M05569 2 Nanomole per Microgram 3 nmol/ug nmol/mcg 4 Nanomole per Microgram 5 258720002 6 nmol 7 nanomole (qualifier value) 8 Nanomole 9 C0439191
alternative label: nmol/ug
alternative label: nmol/mcg

Nanomole per Milligram
type: Class
subclass of: Units
comment: 1 M03962 2 Nanomole per Milligram 3 nmol/mg 4 Nanomole per Milligram 5 767525000 6 Unit 7 Unit (qualifier value) 8 Unit 9 C0439148
alternative label: nmol/mg

Nanomole per Milliliter
type: Class
subclass of: Units
comment: 1 M04020 2 Nanomole per Milliliter 3 nmol/mL nM/mL Nanomoles/milliliter Nanomoles per millilitre Nanomoles per milliliter 4 Nanomole per Milliliter 5 414803000 6 Nanomole per milliliter 7 Nanomole/milliliter (qualifier value) 8 Nanomole per milliliter 9 C0439300
alternative label: Nanomoles/milliliter
alternative label: nmol/mL
alternative label: Nanomoles per millilitre
alternative label: Nanomoles per milliliter
alternative label: nM/mL

Nanomole per Milliliter per Hour
type: Class
subclass of: Units
comment: 1 M05811 2 Nanomole per Milliliter per Hour 3 nmol/mL/h 4 Nanomole per Milliliter per Hour 5 258851002 6 Nanomole/hour 7 Nanomole/hour (qualifier value) 8 umol/h/L 9 C0439396
alternative label: nmol/mL/h

Nanomole per Minute per Milliliter
type: Class
subclass of: Units
comment: 1 M04178 2 Nanomole per Minute per Milliliter 3 nmol/min/mL nanomole/minute/millitre nanomole/minute/milliter nanomole/minute/millilitre nanomole/minute/milliliter 4 Nanomole per Minute per Milliliter 5 258981009 6 Nanomole/minute/milliliter 7 Nanomole/minute/milliliter (qualifier value) 8 Nanomole/minute/milliliter 9 C0439409
alternative label: nanomole/minute/millilitre
alternative label: nanomole/minute/milliliter
alternative label: nmol/min/mL

Nanomole per Nanogram
type: Class
subclass of: Units
comment: 1 M05550 2 Nanomole per Nanogram 3 nmol/ng 4 Nanomole per Nanogram 5 258827007 6 Nanomole/gram 7 Nanomole/gram (qualifier value) 8 nmol/g 9 C0439292
alternative label: nmol/ng

Nanomole per Picogram
type: Class
subclass of: Units
comment: 1 M05585 2 Nanomole per Picogram 3 nmol/pg 4 Nanomole per Picogram 5 258720002 6 nanomole 7 nanomole (qualifier value) 8 Nanomole 9 C0439191
alternative label: nmol/pg

Nanomole per Picoliter
type: Class
subclass of: Units
comment: 1 M05602 2 Nanomole per Picoliter 3 nmol/pL 4 Nanomole per Picoliter 5 258720002 6 nanomole 7 nanomole (qualifier value) 8 Nanomole 9 C0439191
alternative label: nmol/pL

Nanomole per hour per milligram of creatinine
type: Class
subclass of: Units
comment: 1 M04196 2 Nanomole per hour per milligram of creatinine 3 nmol/h/mg creat nanomole/hour/milligram creatinine 4 Nanomole per hour per milligram of creatinine 5 258976000 6 Nanomole per hour per milligram of creatinine 7 Nanomole per hour per milligram of creatinine (qualifier value) 8 Nanomole per hour per milligram of creatinine 9 C0439415
alternative label: nanomole/hour/milligram creatinine
alternative label: nmol/h/mg creat

Nanosecond
type: Class
subclass of: Units
comment: 1 M03767 2 Nanosecond 3 nsec ns 4 Nanosecond 5 258699004 6 Nanosecond 7 Nanosecond (qualifier value) 8 Nanosecond 9 C0439225
alternative label: ns
alternative label: nsec

Nanounit per Microliter
type: Class
subclass of: Units
comment: 1 M04049 2 Nanounit per Microliter 3 nU/uL 4 Nanounit per Microliter 5 767525000 6 Unit 7 Unit (qualifier value) 8 Unit 9 C0439148
alternative label: nU/uL

Narcolepsy
type: Class
subclass of: Nervous system and Mental function (Symptom)
comment: 1 MD00522 2 Narcolepsy 3 None 4 Narcolepsy 5 60380001 6 Narcolepsy 7 Narcolepsy (disorder) 8 Narcolepsy 9 C0027404

Nasal pharynx
type: Class
subclass of: Respiratory function (Body region)
comment: 1 MD06912 2 Nasal pharynx 3 None 4 Nasal pharynx 5 54066008 6 pharynx 7 Pharyngeal structure (body structure) 8 Nasal pharynx 9 C2371882

National
type: Class
subclass of: Hospital Administration
comment: 1 MD00616 2 National 3 None 4 National 5 302308006 6 National government officer 7 National government officer (occupation) 8 Nation 9 C1555720

Natural childbirth
type: Class
subclass of: Urogenital function (Therapy)
comment: 1 MD00227 2 Natural childbirth 3 None 4 Natural childbirth 5 289259007 6 Vaginal delivery 7 Vaginal delivery (finding) 8 Natural Birth 9 C2985348

Natural events
type: Class
subclass of: Physical/Chemical Environment
comment: 1 MD06659 2 Natural events 3 None 4 Natural events 5 272379006 6 Event 7 Event (event) 8 Natural events 9 C2371697

Nausea associated with dizziness or vertigo
type: Class
subclass of: Sensory function, Pain and Skin function (Symptom)
comment: 1 MD05775 2 Nausea associated with dizziness or vertigo 3 None 4 Nausea associated with dizziness or vertigo 5 422587007 6 Nausea 7 Nausea (finding) 8 Nausea associated with dizziness or vertigo 9 C2370949

Nebule
type: Class
subclass of: Units
comment: 1 M03562 2 Nebule 3 Nebule Dosing Unit 4 Nebule 5 767525000 6 Unit 7 Unit (qualifier value) 8 Nebule Dosing Unit 9 C2347333
alternative label: Nebule Dosing Unit

Neck anatomy
type: Class
subclass of: Musculoskeletal function (Body region)
comment: 1 M01948 2 Neck anatomy 3 None 4 Neck anatomy 5 45048000 6 neck 7 Neck structure (body structure) 8 Neck 9 C0027530

Neck exercise
type: Class
subclass of: Head and neck structure
comment: 1 M02434 2 Neck exercise 3 exercises neck, exercise neck, Neck exercises 4 Neck exercise 5 229137005 6 Neck exercises 7 Neck exercises (regime/therapy) 8 Neck exercises 9 C0454347
alternative label: Neck exercises
alternative label: exercises neck
alternative label: exercise neck

Neck exercises in water
type: Class
subclass of: Head and neck structure
comment: 1 M00282 2 Neck exercises in water 3 None 4 Neck exercises in water 5 229178007 6 Neck exercises in water 7 Neck exercises in water (regime/therapy) 8 Neck exercises in water 9 C0454387

Need support to Get back to original work
type: Class
subclass of: Questionnaire
comment: 1 MD04979 2 Need support to Get back to original work 3 None 4 Need support to Get back to original work 5 713663002 6 Carer Support Needs Assessment Tool 7 Carer Support Needs Assessment Tool (assessment scale) 8 Carer Support Needs Assessment Tool 9 C4075872

Need support to Get back to other job
type: Class
subclass of: Questionnaire
comment: 1 MD04980 2 Need support to Get back to other job 3 None 4 Need support to Get back to other job 5 713663002 6 Carer Support Needs Assessment Tool 7 Carer Support Needs Assessment Tool (assessment scale) 8 Carer Support Needs Assessment Tool 9 C4075872

Neoplasm
type: Class
subclass of: Hospital information, examination/diagnosis/treatment data
comment: 1 MD00399 2 neoplasm 3 None 4 Neoplasm 5 108369006 6 Neoplasm 7 Neoplasm (morphologic abnormality) 8 Neoplasm 9 C0027651
comment: 1 MD00399-2 2 neoplasm 3 None 4 Neoplasm 5 55342001 6 Neoplasm 7 Neoplastic disease (disorder) 8 Neoplasm 9 C0027651
comment: 1 MD00399-3 2 neoplasm 3 None 4 Neoplasm 5 55342001 6 Neoplasm 7 Neoplastic disease (disorder) 8 Neoplastic disease 9 C1882062

Neurofibromatosis
type: Class
subclass of: Nervous system and Mental function (Symptom)
comment: 1 MD00384 2 Neurofibromatosis 3 None 4 Neurofibromatosis 5 81669005 6 Neurofibromatosis 7 Neurofibromatosis (morphologic abnormality) 8 Neurofibromatoses 9 C0162678

Neurology
type: Class
subclass of: Classification of Hospital
comment: 1 MD00631 2 Neurology 3 None 4 Neurology 5 394591006 6 Neurology 7 Neurology (qualifier value) 8 Neurology speciality 9 C0027855

Neuropsychiatry of Korean Medicine
type: Class
subclass of: Classification of Hospital
comment: 1 MD00672 2 Neuropsychiatry of Korean Medicine 3 None 4 Neuropsychiatry of Korean Medicine 5 273786008 6 Schedules for clinical assessment in neuropsychiatry (assessment scale) 7 Schedules for clinical assessment in neuropsychiatry (assessment scale) 8 Schedules for clinical assessment in neuropsychiatry 9 C0451457

Neurosurgery
type: Class
subclass of: Classification of Hospital
comment: 1 MD00635 2 Neuro-Surgery 3 None 4 Neurosurgery 5 394610002 6 Neurosurgery 7 Neurosurgery (qualifier value) 8 Neurosurgery clinic 9 C3839295

Neutral
type: Class
subclass of: Units
comment: 1 MD01769 2 Neutral 3 None 4 Neutral 5 4963003 6 Neutral zone 7 Neutral amino acid (substance) 8 Neutral zone 9 C0445110

Never
type: Class
subclass of: Questionnaire
comment: 1 MD02090 2 Never 3 None 4 Never 5 373067005 6 No 7 No (qualifier value) 8 Never 9 C2003901
comment: 1 MD02090-1 2 Never 3 None 4 Never 5 288462000 6 Unit type 7 Unit type (qualifier value) 8 Never 9 C2003901

Newton per Meter
type: Class
subclass of: Units
comment: 1 M05618 2 Newton per Meter 3 N/m Newton/Meter 4 Newton per Meter 5 278490008 6 newton 7 newton (qualifier value) 8 Newton per Meter 9 C2347350
alternative label: N/m
alternative label: Newton/Meter

Nicotinic acid equivalents
type: Class
subclass of: Units
comment: 1 M03191 2 Nicotinic acid equivalents 3 None 4 Nicotinic acid equivalents 5 282734000 6 Nicotinic acid equivalents 7 Nicotinic acid equivalents (qualifier value) 8 Nicotinic acid equivalents 9 C0560584

NikeFuel
type: Class
subclass of: Device
comment: 1 MD01656 2 NikeFuel 3 None 4 NikeFuel 5 246137000 6 Equipment 7 Equipment (attribute) 8 Equipment 9 C0014672

No intention of returning
type: Class
subclass of: Questionnaire
comment: 1 MD04972 2 No intention of returning 3 None 4 No intention of returning 5 844005 6 Behavior finding 7 Behavior finding (finding) 8 Behavior 9 C0004927

No interaction with others while on duty
type: Class
subclass of: Questionnaire
comment: 1 MD05124 2 No interaction with others while on duty 3 None 4 No interaction with others while on duty 5 273389003 6 Daily activities questionnaire 7 Daily activities questionnaire (assessment scale) 8 questionnaire 9 C0034394

No menstruation
type: Class
subclass of: Urogenital function (Symptom)
comment: 1 MD01727 2 No menstruation 3 not menstruating 4 No menstruation 5 14302001 6 Amenorrhoea 7 Amenorrhea (finding) 8 Amenorrhoea 9 C0002453
alternative label: not menstruating

No need for physical help
type: Class
subclass of: Questionnaire
comment: 1 MD05579 2 No need for physical help 3 None 4 No need for physical help 5 273820006 6 Functional status questionnaire 7 Functional status index (assessment scale) 8 Questionnaire 9 C0034394

No noise heard or disturbed
type: Class
subclass of: Questionnaire
comment: 1 MD05026 2 No noise heard or disturbed 3 None 4 No noise heard or disturbed 5 273389003 6 Daily activities questionnaire 7 Daily activities questionnaire (assessment scale) 8 questionnaire 9 C0034394

No noise when wearing earplugs
type: Class
subclass of: Questionnaire
comment: 1 MD05027 2 No noise when wearing earplugs 3 None 4 No noise when wearing earplugs 5 273389003 6 Daily activities questionnaire 7 Daily activities questionnaire (assessment scale) 8 questionnaire 9 C0034394

No physiology specified
type: Class
subclass of: Urogenital function (Symptom)
comment: 1 MD01728 2 No physiology specified 3 None 4 No physiology specified 5 10003008 6 Non-specific 7 Non-specific (qualifier value) 8 Measure of menstruation 9 C1286030

Nocturnal sleep-related eating disorder
type: Class
subclass of: Digestive function (Symptom)
comment: 1 M00027 2 Nocturnal sleep-related eating disorder 3 None 4 Nocturnal sleep-related eating disorder 5 407666007 6 Nocturnal sleep-related eating disorder 7 Nocturnal sleep-related eating disorder (disorder) 8 Nocturnal sleep-related eating disorder 9 C1319848

Noise
type: Class
subclass of: Physical/Chemical Environment
comment: 1 M00252 2 Noise 3 Noises 4 Noise 5 60862001 6 Noise in ears 7 Tinnitus (finding) 8 Noise 9 C0028263
alternative label: Noises

Noise heard when wearing earplugs
type: Class
subclass of: Questionnaire
comment: 1 MD05028 2 Noise heard when wearing earplugs 3 None 4 Noise heard when wearing earplugs 5 273389003 6 Daily activities questionnaire 7 Daily activities questionnaire (assessment scale) 8 questionnaire 9 C0034394

Noisy breathing
type: Class
subclass of: Digestive function (Symptom)
comment: 1 M00510 2 Noisy breathing 3 None 4 Noisy breathing 5 248573009 6 Noisy breathing 7 Noisy respiration (finding) 8 Noisy breathing 9 C0237304

Noisy respiration
type: Class
subclass of: Respiratory function (Symptom)
comment: 1 M01988 2 Noisy respiration 3 None 4 Noisy respiration 5 248573009 6 Noisy respiration 7 Noisy respiration (finding) 8 Noisy respiration 9 C0237304

Non-24 hour sleep-wake cycle
type: Class
subclass of: Duration
comment: 1 M00063 2 Non-24 hour sleep-wake cycle 3 None 4 Non-24 hour sleep-wake cycle 5 230496009 6 Non-24 hour sleep-wake cycle 7 Non-24 hour sleep-wake cycle (disorder) 8 Non-24 hour sleep-wake cycle 9 C0393772

Non-dominant Hand
type: Class
subclass of: Musculoskeletal function (Body measurement)
comment: 1 MD04494 2 Non-dominant Hand 3 None 4 Non-dominant Hand 5 364486001 6 Measure of hand 7 Measure of hand (observable entity) 8 Hand.non-dominant 9 C4299135

Non-drinker of alcoholic beverage
type: Class
subclass of: Classification of Patient
comment: 1 M02474 2 Non-drinker of alcoholic beverage 3 None 4 Non-drinker of alcoholic beverage 5 105542008 6 Non - drinker alcohol 7 Current non-drinker of alcohol (finding) 8 Current non-drinker of alcohol 9 C0457801

Non-organic sleep disorder
type: Class
subclass of: Activities of disability
comment: 1 M00049 2 Non-organic sleep disorder 3 Non-organic sleep disorders 4 Non-organic sleep disorder 5 270487001 6 Non-organic sleep disorder 7 Non-organic sleep disorder (disorder) 8 Non-organic sleep disorder 9 C0154565
alternative label: Non-organic sleep disorders

Non-remunerative employment
type: Class
subclass of: Individual Related Factors
comment: 1 MD06531 2 Non-remunerative employment 3 None 4 Non-remunerative employment 5 406156006 6 In paid employment 7 In paid employment (finding) 8 Non-remunerative employment 9 C2371591

Non-smoker
type: Class
subclass of: Sub-Cultural Level
comment: 1 M00100 2 non smoker 3 smoker non non smokers 4 Non-smoker 5 8392000 6 Non-smoker 7 Non-smoker (finding) 8 Non-smoker 9 C0337672
comment: 1.M00100-1 2.Non-smoker 3. smoker non non smokers 4. Non-smoker 5. 8392000 6. non-smoker 7. Non-smoker (finding) 8. Cessation of smoking 9. C0337671
alternative label: non smokers
alternative label: smoker non

Non-specific immune response
type: Class
subclass of: Immune system function (Body measurement)
comment: 1 MD05863 2 Non-specific immune response 3 None 4 Non-specific immune response 5 35024006 6 Immune response 7 Immune response, function (observable entity) 8 Non-specific immune response 9 C2371089

Non-speech vocal expression
type: Class
subclass of: Health Related Factors
comment: 1 MD06241 2 Non-speech vocal expression 3 None 4 Non-speech vocal expression 5 129418005 6 Expression - action 7 Expression - action (qualifier value) 8 Speech combined with nonvocal communication 9 C4296974

Non-standard dietary quantity
type: Class
subclass of: Units
comment: 1 M03120 2 Non-standard dietary quantity 3 None 4 Non-standard dietary quantity 5 228955007 6 Non-standard dietary quantity 7 Non-standard dietary quantity (qualifier value) 8 Non-standard dietary quantity 9 C0556603

Non-standard dietary quantity per feed
type: Class
subclass of: Units
comment: 1 M03233 2 Non-standard dietary quantity per feed 3 None 4 Non-standard dietary quantity per feed 5 282798004 6 Non-standard dietary quantity per feed 7 Non-standard dietary quantity per feed (qualifier value) 8 Non-standard dietary quantity per feed 9 C0560683

Non-standard dietary quantity per meal
type: Class
subclass of: Units
comment: 1 M03123 2 Non-standard dietary quantity per meal 3 None 4 Non-standard dietary quantity per meal 5 228973005 6 Non-standard dietary quantity per meal 7 Non-standard dietary quantity per meal (qualifier value) 8 Non-standard dietary quantity per meal 9 C0556606

Non-standard dietary quantity per unit time
type: Class
subclass of: Units
comment: 1 M03122 2 Non-standard dietary quantity per unit time 3 None 4 Non-standard dietary quantity per unit time 5 228959001 6 Non-standard dietary quantity per unit time 7 Non-standard dietary quantity per unit time (qualifier value) 8 Non-standard dietary quantity per unit time 9 C0556605

Nonspecif skin erupt NEC
type: Class
subclass of: Sensory function, Pain and Skin function (Symptom)
comment: 1 M00963 2 Nonspecif skin erupt NEC 3 None 4 Nonspecif skin erupt NEC 5 271807003 6 Skin eruption 7 Eruption of skin (disorder) 8 Eruption of skin present 9 C5395697

Nording walking
type: Class
subclass of: Sport
comment: 1 MD01087 2 Nording walking 3 None 4 Nording walking 5 14468000 6 Sports 7 Sports activity (observable entity) 8 Sports 9 C0038039
comment: 1 MD01087-1 2 Nording walking 3 None 4 Nording walking 5 415577004 6 Sport 7 Sport (qualifier value) 8 Sports 9 C0038039

Normal ankle pulse
type: Class
subclass of: Cardiovascular system function (Body measurement)
comment: 1 M00202 2 Normal ankle pulse 3 None 4 Normal ankle pulse 5 26188006 6 Normal ankle pulse 7 Normal ankle pulse (finding) 8 Normal ankle pulse 9 C0232155

Normal blood pressure
type: Class
subclass of: Cardiovascular system function (Body measurement)
comment: 1 M00136 2 Normal blood pressure 3 Normal pulse, Normotensive, normal bp, Normal heart beat, normal pulses, Stable blood pressure, blood pressure normal, bp normal, normal bp 4 Normal blood pressure 5 2004005 6 Normal blood pressure 7 Normal blood pressure (finding) 8 Normal blood pressure 9 C2712122
alternative label: bp normal
alternative label: Normotensive
alternative label: Stable blood pressure
alternative label: normal bp
alternative label: Normal pulse
alternative label: blood pressure normal

Normal body temperature
type: Class
subclass of: Sensory function, Pain and Skin function (Body measurement)
comment: 1 M00171 2 Normal body temperature 3 body normal temperatures, body normals temperature, body temperature normal, body normal temperature 4 Normal body temperature 5 87273009 6 Temperature normal 7 Temperature normal (finding) 8 Temperature normal 9 C0231262
alternative label: body normals temperature
alternative label: body normal temperatures
alternative label: body temperature normal
alternative label: body normal temperature

Normal central venous pressure
type: Class
subclass of: Cardiovascular system function (Body measurement)
comment: 1 M00134 2 Normal central venous pressure 3 Normal central venous pulse pressure 4 Normal central venous pressure 5 91297005 6 Normal central venous pressure 7 Normal central venous pressure (finding) 8 Normal central venous pressure 9 C0277894

Normal central venous pulse pressure
type: Class
subclass of: Cardiovascular system function (Body measurement)
comment: 1 M02073 2 Normal central venous pressure 3 None 4 Normal central venous pulse pressure 5 91297005 6 normal central venous pressure 7 Normal central venous pressure (finding) 8 normal central venous pressure 9 C0277894
comment: 1 M02073-1 2 Normal central venous pressure 3 None 4 Normal central venous pulse pressure 5 91297005 6 normal central venous pressure 7 Normal central venous pressure (finding) 8 normal central venous pressure 9 C0277894
comment: 1 M02073-2 2 Normal central venous pressure 3 None 4 Normal central venous pulse pressure 5 91297005 6 normal central venous pressure 7 Normal central venous pressure (finding) 8 normal central venous pressure 9 C0277894

Normal hair growth
type: Class
subclass of: Individual Related Factors
comment: 1 M00542 2 Normal hair growth 3 Hair growth normal 4 Normal hair growth 5 38062005 6 Hair growth normal 7 Hair growth normal (finding) 8 Hair growth normal 9 C0232408
alternative label: Hair growth normal

Normal heart rate
type: Class
subclass of: Cardiovascular system function (Body measurement)
comment: 1 M00180 2 Normal heart rate 3 heart normal rate, heart rate normal, heart normal rates, heart normals rate, Normal cardiac rate, Normal heart beat, heart beat normal, normal pulses, pulse normal 4 Normal heart rate 5 76863003 6 Normal heart rate 7 Normal heart rate (finding) 8 Normal heart rate 9 C2712143
alternative label: heart normal rate
alternative label: heart beat normal
alternative label: normal pulses
alternative label: Normal cardiac rate
alternative label: pulse normal
alternative label: heart normals rate
alternative label: heart rate normal
alternative label: Normal heart beat

Normal or near normal gait
type: Class
subclass of: Questionnaire
comment: 1 MD04783 2 Normal or near normal gait 3 None 4 Normal or near normal gait 5 8117002 6 Gait normal 7 Gait normal (finding) 8 gait normal 9 C0231683

Normal peripheral pulse
type: Class
subclass of: Cardiovascular system function (Body measurement)
comment: 1 M00208 2 Normal peripheral pulse 3 Peripheral pulses normal 4 Normal peripheral pulse 5 40969002 6 Peripheral pulses normal 7 Peripheral pulses normal (finding) 8 Peripheral pulses normal 9 C0232140
alternative label: Peripheral pulses normal

Normal radial pulse
type: Class
subclass of: Cardiovascular system function (Body measurement)
comment: 1 M00218 2 Normal radial pulse 3 None 4 Normal radial pulse 5 15137004 6 Normal radial pulse 7 Normal radial pulse (finding) 8 Normal radial pulse 9 C0232143

Normal respiratory rate
type: Class
subclass of: Respiratory function (Body measurement)
comment: 1 M00225 2 Normal respiratory rate 3 Respiratory rate normal, normal rate respiratory, normal rates respiratory 4 Normal respiratory rate 5 20716004 6 Respiratory rate normal 7 Respiratory rate normal (finding) 8 Respiratory rate normal 9 C0231833
alternative label: normal rate respiratory
alternative label: normal rates respiratory
alternative label: Respiratory rate normal

Normoglycemic
type: Class
subclass of: Functions of Blood System, Metabolic system and Endocrine system (Body measurement)
comment: 1 M02656 2 Normoglycemic 3 normal blood glucose, Blood glucose normal, normal glucose blood, Normoglycaemic 4 Normoglycemic 5 166921001 6 Normoglycemic 7 Blood glucose normal (finding) 8 Blood glucose normal 9 C0580545
alternative label: normal blood glucose
alternative label: normal glucose blood
alternative label: Blood glucose normal
alternative label: Normoglycaemic

Nose
type: Class
subclass of: Sensory function, Pain and Skin function (Body region)
comment: 1 M00235 2 Nose 3 None 4 Nose 5 45206002 6 Nose 7 Nasal structure (body structure) 8 Nose 9 C0028429

Nose wrinkling exercises
type: Class
subclass of: Active exercise
comment: 1 M00285 2 Nose wrinkling exercises 3 None 4 Nose wrinkling exercises 5 229136001 6 Nose wrinkling exercises 7 Nose wrinkling exercises (regime/therapy) 8 Nose wrinkling exercises 9 C0454346

Not Applicable
type: Class
subclass of: Questionnaire
comment: 1 MD05247 2 Not Applicable 3 None 4 Not Applicable 5 385432009 6 Not applicable 7 Not applicable (qualifier value) 8 Not applicable 9 C1272460

Not passing urine
type: Class
subclass of: Urogenital function (Symptom)
comment: 1 M01651 2 Not passing urine 3 None 4 Not passing urine 5 267064002 6 Not passing urine 7 Retention of urine (disorder) 8 Not passing urine 9 C0080274

Not require color distinction
type: Class
subclass of: Questionnaire
comment: 1 MD05120 2 MD05120 3 None 4 Not require color distinction 5 273389003 6 Daily activities questionnaire 7 Daily activities questionnaire (assessment scale) 8 questionnaire 9 C0034394

Not require communication
type: Class
subclass of: Questionnaire
comment: 1 MD05114 2 Not require communication 3 None 4 Not require communication 5 273389003 6 Daily activities questionnaire 7 Daily activities questionnaire (assessment scale) 8 questionnaire 9 C0034394

Notification of checkup result date
type: Class
subclass of: Day
comment: 1 MD00822 2 Notification of checkup result date 3 None 4 Notification of checkup result date 5 399651003 6 Date of report 7 Date of report (observable entity) 8 Date of report 9 C1302584
comment: 1 MD00822-1 2 Notification of checkup result date 3 None 4 Notification of checkup result date 5 399651003 6 Date of report 7 Date of report (observable entity) 8 Value type - Date 9 C1548309

Number of detailed actions separated
type: Class
subclass of: Units
comment: 1 MD05563 2 Number of detailed actions separated 3 None 4 Number of detailed actions separated 5 260965001 6 Number of units 7 Number of units (qualifier value) 8 Number of units 9 C0449961

Number of exercise equipment performed
type: Class
subclass of: Units
comment: 1 MD03747 2 Number of exercise equipment performed 3 None 4 Number of exercise equipment performed 5 252109000 6 Number of times 7 Number of times (qualifier value) 8 Number of times 9 C0449809

Number of items
type: Class
subclass of: Units
comment: 1 MD04580 2 Number of items 3 None 4 Number of items 5 260965001 6 Number of units 7 Number of units (qualifier value) 8 Number of units 9 C0449961

Number of products handled per day
type: Class
subclass of: Questionnaire
comment: 1 MD04884 2 Number of products handled per day 3 None 4 Number of products handled per day 5 260965001 6 Number of units 7 Number of units (qualifier value) 8 Number of units 9 C0449961

Number of questions
type: Class
subclass of: Units
comment: 1 MD04586 2 Number of questions 3 None 4 Number of questions 5 260965001 6 Number of units 7 Number of units (qualifier value) 8 Number of units 9 C0449961

Number of visit
type: Class
subclass of: Units
comment: 1 MD00909 2 Number of visit 3 None 4 Number of visit 5 722248002 6 Patient hospital visit number 7 Patient hospital visit number (observable entity) 8 Patient hospital visit number 9 C4302705

Number of workers
type: Class
subclass of: Hospital Administration
comment: 1 MD04912 2 Number of workers 3 None 4 Number of workers 5 410680006 6 Number 7 Number (attribute) 8 Numbers 9 C0237753

Nursing hospital
type: Class
subclass of: Classification of Hospital
comment: 1 MD00237 2 Nursing hospital 3 Nursing institution nursing facility 4 Nursing hospital 5 708170008 6 Nursing service 7 Nursing service (qualifier value) 8 Nursing Service, Hospital 9 C0028696
alternative label: nursing facility
alternative label: Nursing institution

Nutrient ingestion
type: Class
subclass of: Nutrient intake
comment: 1 M00790 2 Nutrient ingestion 3 None 4 Nutrient ingestion 5 26320007 6 Nutrient intake 7 Nutrient intake (observable entity) 8 Nutrient intake - finding 9 C1287879

Nutrient intake
type: Class
subclass of: Nutrition
comment: 1 M00460 2 Nutrient intake 3 None 4 Nutrient intake 5 226320007 6 Nutrient intake 7 Nutrient intake (observable entity) 8 Nutrient intake 9 C5234928

Nutrition
type: Class
comment: 1 M00455 2 Nutrition 3 nutrient 4 Nutrition 5 384759009 6 Nutrition 7 Nutrition, function (observable entity) 8 Nutrition 9 C1442959
alternative label: nutrient

Nutrition Status
type: Class
subclass of: Nutritional status
comment: 1 M00465 2 Nutrition Status 3 Nutritional status, Nutrition.status, nutritional state 4 Nutrition Status 5 87276001 6 Nutritional status 7 Nutritional status (observable entity) 8 Nutritional status 9 C0392209
alternative label: nutritional state

Nutrition alteration
type: Class
subclass of: Nutritional management
comment: 1 M01753 2 Nutrition alteration 3 None 4 Nutrition alteration 5 129844000 6 Nutrition alteration 7 Alteration in nutrition (finding) 8 Nutrition alteration 9 C0184548

Nutrition treatments and procedures
type: Class
subclass of: Nutritional management
comment: 1 M05847 2 Nutrition treatments and procedures 3 None 4 Nutrition treatments and procedures 5 386373004 6 Nutrition treatments and procedures 7 Nutrition therapy (regime/therapy) 8 Nutrition treatments and procedures 9 C2937349

Nutritional Therapy
type: Class
subclass of: Nutritional management
comment: 1 M02025 2 Nutritional therapy 3 Nutrition therapy (regime/therapy), Nutrition therapy 4 Nutritional Therapy 5 386373004 6 nutrition therapy 7 Nutrition therapy (regime/therapy) 8 Nutrition Therapy 9 C2937349
alternative label: Nutrition therapy (regime/therapy)
alternative label: Nutrition therapy

Nutritional alopecia
type: Class
subclass of: Disorder of nutrition
comment: 1 M00457 2 Nutritional alopecia 3 None 4 Nutritional alopecia 5 65130004 6 Nutritional alopecia 7 Nutritional alopecia (disorder) 8 Nutritional alopecia 9 C0002178

Nutritional anemia
type: Class
subclass of: Disorder of nutrition
comment: 1 M00458 2 Nutritional anemia 3 nutritional anaemias, nutritional anaemia, nutritional anemias, anemia nutritional 4 Nutritional anemia 5 66612000 6 Nutritional anemia 7 Nutritional anemia (disorder) 8 Nutritional anemia 9 C0271903
alternative label: nutritional anaemia
alternative label: nutritional anaemias
alternative label: anemia nutritional
alternative label: nutritional anemias

Nutritional atrophy
type: Class
subclass of: Nervous system and Mental function (Symptom)
comment: 1 M01688 2 Nutritional atrophy 3 None 4 Nutritional atrophy 5 29740003 6 Nutritional atrophy 7 Nutritional marasmus (disorder) 8 Nutritional atrophy 9 C0086588

Nutritional disease
type: Class
subclass of: Disorder of nutrition
comment: 1 M01255 2 Nutritional disease 3 disease nutrition, disease nutritional, diseases nutrition, diseases nutritional, nutrition disease, nutrition diseases 4 Nutritional disease 5 2492009 6 Nutritional disease 7 Nutritional disorder (disorder) 8 Nutrition Disorders 9 C3714509
alternative label: diseases nutrition
alternative label: diseases nutritional
alternative label: nutrition disease
alternative label: disease nutrition
alternative label: nutrition diseases
alternative label: disease nutritional

Nutritional lifestyle assessment tool
type: Class
subclass of: Tool
comment: 1 MD03948 2 Nutritional lifestyle assessment tool 3 None 4 Nutritional lifestyle assessment tool 5 443781008 6 Assessment of lifestyle 7 Assessment of lifestyle (procedure) 8 Assessment of lifestyle 9 C0814436

Nutritional marasmus
type: Class
subclass of: Disorder of nutrition
comment: 1 M00468 2 Acquired deficiency 3 None 4 Acquired deficiency 5 102635008 6 Acute nutritional deficiency 7 Acute nutritional deficiency (finding) 8 Acute deficiency state 9 C0522074

O2 Pulse
type: Class
subclass of: Functions of Blood System, Metabolic system and Endocrine system (Body measurement)
comment: 1 MD03173 2 O2 Pulse 3 None 4 O2 Pulse 5 464975006 6 Oxygen saturation/pulse rate simulator 7 Oxygen saturation/pulse rate simulator (physical object) 8 Oxygen saturation/pulse rate simulator 9 C1138869

Obesity index
type: Class
subclass of: Hospital information, examination/diagnosis/treatment data
comment: 1 MD00701 2 Obesity index 3 None 4 Obesity index 5 414916001 6 Obesity 7 Obesity (disorder) 8 Obesity 9 C0028754

Obex Region
type: Class
subclass of: Nervous system and Mental function (Body region)
comment: 1 M00878 2 Obex Region 3 None 4 Obex Region 5 52530000 6 Body region 7 Body region structure (body structure) 8 Obex Region 9 C2985202

Object classification
type: Class
subclass of: Questionnaire
comment: 1 MD05503 2 Object classification 3 None 4 Object classification 5 272734009 6 Object 7 Object (attribute) 8 Object 9 C0347997

Observation of ambient temperature
type: Class
subclass of: Health Related Factors
comment: 1 M02614 2 Observation of ambient temperature 3 None 4 Observation of ambient temperature 5 250825003 6 Ambient temperature 7 Ambient temperature (observable entity) 8 Observation of ambient temperature 9 C0542496

Observation of diarrhea
type: Class
subclass of: Digestive function (Symptom)
comment: 1 M00869 2 Observation of diarrhea 3 Observation of diarrhoea 4 Observation of diarrhea 5 62315008 6 Observation of diarrhea 7 Diarrhea (finding) 8 Diarrhea 9 C0011991
alternative label: Observation of diarrhoea

Observation of form of skeletal muscle
type: Class
subclass of: Musculoskeletal function (Body measurement)
comment: 1 M02003 2 Observation of form of skeletal muscle 3 None 4 Observation of form of skeletal muscle 5 127954009 6 skeletal muscle 7 Skeletal muscle structure (body structure) 8 Skeletal muscle part 9 C0584660

Observation of heart rate
type: Class
subclass of: Cardiovascular system function (Body measurement)
comment: 1 M02645 2 Observation of heart rate 3 None 4 Observation of heart rate 5 301113001 6 Observation of heart rate 7 Finding of heart rate (finding) 8 Finding of heart rate 9 C0577802

Observation of peripheral pulse
type: Class
subclass of: Cardiovascular system function (Body measurement)
comment: 1 M02647 2 Observation of peripheral pulse 3 None 4 Observation of peripheral pulse 5 301145006 6 Observation of peripheral pulse 7 Finding of peripheral pulse (finding) 8 Finding of peripheral pulse 9 C0577835

Observation of rate of respiration
type: Class
subclass of: Respiratory function (Body measurement)
comment: 1 M02652 2 Observation of rate of respiration 3 None 4 Observation of rate of respiration 5 301283003 6 Observation of rate of respiration 7 Finding of rate of respiration (finding) 8 Finding of rate of respiration 9 C0577970

Observation of systemic arterial pressure
type: Class
subclass of: Cardiovascular system function (Body measurement)
comment: 1 M02646 2 Observation of systemic arterial pressure 3 None 4 Observation of systemic arterial pressure 5 30114000 6 Observation of systemic arterial pressure 7 Finding of systemic arterial pressure (finding) 8 Finding of systemic arterial pressure 9 C0577830

Obstetrics
type: Class
subclass of: Classification of Hospital
comment: 1 MD00639 2 Obstetrics 3 None 4 Obstetrics 5 408470005 6 Obstetrics 7 Obstetrics (qualifier value) 8 Discipline of obstetrics 9 C0028773

Obstetrics and Gynecology of Korean Medicine
type: Class
subclass of: Classification of Hospital
comment: 1 MD00669 2 Obstetrics and Gynecology of Korean Medicine 3 None 4 Obstetrics and Gynecology of Korean Medicine 5 394585009 6 Obstetrics and gynecology 7 Obstetrics and gynecology (qualifier value) 8 Obstetrics and gynecology (clinical specialty) 9 C1274104

Obstructive sleep apnea
type: Class
subclass of: Respiratory function (Symptom)
comment: 1 M02542 2 Obstructive sleep apnea 3 Obstructive sleep apnoea Obstructive sleep apnea syndrome Obstructive Sleep Apneas Obstructive sleep apnoea syndrome obstructive sleep osa apnea sleep apnea obstructive syndrome 4 Obstructive sleep apnea 5 78275009 6 Obstructive sleep apnea 7 Obstructive sleep apnea syndrome (disorder) 8 Sleep Apnea, Obstructive 9 C0520679
alternative label: sleep apnea obstructive syndrome
alternative label: Obstructive sleep apnoea syndrome
alternative label: Obstructive Sleep Apneas
alternative label: Obstructive sleep apnea syndrome
alternative label: obstructive sleep osa apnea
alternative label: Obstructive sleep apnoea

Occasional drinker
type: Class
subclass of: Sub-Cultural Level
comment: 1 M00019 2 Occasional drinker 3 Drinks occasionally 4 Occasional drinker 5 228276006 6 Occasional drinker 7 Occasional drinker (finding) 8 Occasional drinker 9 C0556298
alternative label: Drinks occasionally

Occasional smoker
type: Class
subclass of: Sub-Cultural Level
comment: 1 M00085 2 Occasional smoker 3 Occasional cigarette smoker 4 Occasional smoker 5 230059006 6 Occasional tobacco smoker (finding) 7 Occasional cigarette smoker (finding) 8 Trivial cigarette smoker 9 C0425294
alternative label: Occasional cigarette smoker

Occult hematuria
type: Class
subclass of: Hospital information, examination/diagnosis/treatment data
comment: 1 MD00704 2 Occult hematuria 3 None 4 Occult hematuria 5 11184008 6 Chemical test for occult blood, urine 7 Urinalysis, blood, qualitative (procedure) 8 Urinary occult blood 9 C5442257

Offset
type: Class
subclass of: Units
comment: 1 MD02440 2 Offset 3 None 4 Offset 5 767525000 6 Unit 7 Unit (qualifier value) 8 Unit 9 C0439148

Often kneeling or squatting
type: Class
subclass of: Questionnaire
comment: 1 MD05066 2 Often kneeling or squatting 3 None 4 Often kneeling or squatting 5 273389003 6 Daily activities questionnaire 7 Daily activities questionnaire (assessment scale) 8 questionnaire 9 C0034394

Ohm
type: Class
subclass of: Units
comment: 1 M04556 2 Ohm 3 ohms 4 Ohm 5 282140003 6 ohm 7 ohm (qualifier value) 8 ohm 9 C0560037
alternative label: ohms

Olfactory perception
type: Class
subclass of: Nervous system and Mental function (Body measurement)
comment: 1 MD05674 2 Olfactory perception 3 None 4 Olfactory perception 5 1173081001 6 Olfactory perception 7 Olfactory perception function (observable entity) 8 Olfactory perception 9 C2350520

Olympic fencing
type: Class
subclass of: Sport
comment: 1 M05855 2 Olympic fencing 3 None 4 Olympic fencing 5 415577004 6 Sport 7 Sport (qualifier value) 8 Sports 9 C0038039

On examination - level of fever
type: Class
subclass of: Sensory function, Pain and Skin function (Symptom)
comment: 1 M02371 2 On examination - level of fever 3 O/E - level of fever, O/E - temperature level 4 On examination - level of fever 5 268984004 6 Examination of fever 7 Examination of fever (procedure) 8 Examination of fever 9 C0436148
alternative label: O/E - level of fever
alternative label: O/E - temperature level

On the day
type: Class
subclass of: Day
comment: 1 MD00240 2 On the day 3 None 4 On the day 5 258703001 6 day 7 day (qualifier value) 8 day 9 C0439228

Ondine Syndrome
type: Class
subclass of: Respiratory function (Symptom)
comment: 1 M02562 2 Ondine Syndrome 3 None 4 Ondine Syndrome 5 27405005 6 Central sleep apnea 7 Central sleep apnea syndrome (disorder) 8 Sleep Apnea, Central 9 C0520680

One-Time Set
type: Class
subclass of: Units
comment: 1 MD02651 2 One-Time Set 3 None 4 One-Time Set 5 767525000 6 Unit 7 Unit (qualifier value) 8 Unit 9 C0439148

One Hundred International Units per Milliliter
type: Class
subclass of: Units
comment: 1 M05437 2 One Hundred International Units per Milliliter 3 100 IU/mL 100IU/Milliliter 100 International units/Milliliter 100 International Units per Milliliter 4 One Hundred International Units per Milliliter 5 767525000 6 unit 7 Unit (qualifier value) 8 Unit 9 C0439189
alternative label: 100 IU/mL
alternative label: 100IU/Milliliter
alternative label: 100 International Units per Milliliter
alternative label: 100 International units/Milliliter

One Second Everyday
type: Class
subclass of: Units
comment: 1 M05762 2 One Second Everyday 3 None 4 One Second Everyday 5 413568008 6 Application - unit of product usage (qualifier value) 7 Application - unit of product usage (qualifier value) 8 Application dose 9 C1533134

One of the following three tests
type: Class
subclass of: Questionnaire
comment: 1 MD04480 2 One of the following three tests 3 None 4 One of the following three tests 5 272393004 6 Tests 7 Tests (qualifier value) 8 Tests (qualifier value) 9 C0392366

Online banking
type: Class
subclass of: Tool
comment: 1 MD05437 2 Online banking 3 None 4 Online banking 5 246137000 6 equipment 7 Equipment (attribute) 8 equipment 9 C0014672

Online shopping
type: Class
subclass of: Health Related Factors
comment: 1 MD05407 2 Online shopping 3 None 4 Online shopping 5 129011005 6 Shopping 7 Shopping (observable entity) 8 Shopping (activity) 9 C0150768

Onset of menstruation
type: Class
subclass of: Day
comment: 1 MD06003 2 Onset of menstruation 3 None 4 Onset of menstruation 5 364314008 6 Age of onset of menstruation 7 Age of onset of menstruation (observable entity) 8 Onset of menstruation 9 C0518182

Onset of sleep
type: Class
subclass of: Individual Related Factors
comment: 1 MD05639 2 Onset of sleep 3 None 4 Onset of sleep 5 401175000 6 Sleep pattern finding 7 Sleep pattern finding (finding) 8 Onset of sleep 9 C0871908

Open sealed container or new jar lid
type: Class
subclass of: Questionnaire
comment: 1 MD04216 2 Open sealed container or new jar lid 3 None 4 Open sealed container or new jar lid 5 56116003 6 Open 7 Patent (qualifier value) 8 Behavior 9 C0004927

Open space planning policies
type: Class
subclass of: Public Policy Factors
comment: 1 MD06725 2 Open space planning policies 3 None 4 Open space planning policies 5 276339004 6 environment 7 Environment (environment) 8 Open space planning policies 9 C2371757

Open space planning services
type: Class
subclass of: Public Policy Factors
comment: 1 MD06723 2 Open space planning services 3 None 4 Open space planning services 5 224930009 6 services 7 Services (qualifier value) 8 Open space planning services 9 C2371755

Open space planning systems
type: Class
subclass of: Public Policy Factors
comment: 1 MD06724 2 Open space planning systems 3 None 4 Open space planning systems 5 246333005 6 system 7 System (attribute) 8 Open space planning systems 9 C2371756

Open the door
type: Class
subclass of: Health Related Factors
comment: 1 MD04545 2 Open the door 3 None 4 Open the door 5 56116003 6 Open 7 Patent (qualifier value) 8 Open 9 C0175566

Openness to experience
type: Class
subclass of: Nervous system and Mental function (Body measurement)
comment: 1 MD05623 2 Openness to experience 3 None 4 Openness to experience 5 272150007 6 Openness 7 Openness (qualifier value) 8 Openness to experience 9 C0871006

Operation characteristics
type: Class
subclass of: Questionnaire
comment: 1 MD04991 2 Operation characteristics 3 None 4 Operation characteristics 5 900000000000449001 6 Characteristic type 7 Characteristic type (core metadata concept) 8 Characteristic type 9 C3645613

Operation record
type: Class
subclass of: Hospital information, examination/diagnosis/treatment data
comment: 1 MD03301 2 Operation record 3 None 4 Operation record 5 161615003 6 History of surgery (situation) 7 History of surgery (situation) 8 H/O: surgery 9 C0455610

Ophthalmology
type: Class
subclass of: Classification of Hospital
comment: 1 MD00641 2 Ophthalmology 3 None 4 Ophthalmology 5 394594003 6 Ophthalmology 7 Ophthalmology (qualifier value) 8 Ophthalmology specialty 9 C0029087

Ophthalmoplegia
type: Class
subclass of: Sensory function, Pain and Skin function (Symptom)
comment: 1 MD00458 2 Ophthalmoplegia 3 None 4 Ophthalmoplegia 5 16110005 6 Ophthalmoplegia 7 Ophthalmoplegia (disorder) 8 Ophthalmoplegia 9 C0029089

Opposition
type: Class
subclass of: Health Related Factors
comment: 1 MD04127 2 Opposition 3 None 4 Opposition 5 249959000 6 Opposition of thumb 7 Opposition of thumb, function (observable entity) 8 Opposition of thumb 9 C0427082

Optimism
type: Class
subclass of: Nervous system and Mental function (Body measurement)
comment: 1 MD05624 2 Optimism 3 None 4 Optimism 5 225648009 6 Optimistic 7 Optimistic (finding) 8 Optimism 9 C0237428

Oral Maxillofacial Pathology
type: Class
subclass of: Classification of Hospital
comment: 1 MD00665 2 Oral & Maxillofacial Pathology 3 None 4 Oral Maxillofacial Pathology 5 66476003 6 Oral and maxillofacial pathologist 7 Oral pathologist (occupation) 8 Dentist - Pathology, Oral & Maxillofacial 9 C1553095

Oral Medicine
type: Class
subclass of: Classification of Hospital
comment: 1 MD00663 2 Oral Medicine 3 None 4 Oral Medicine 5 1259957004 6 Oral medicine 7 Oral medicine (qualifier value) 8 Oral Medicine 9 C0029167

Oral and Maxillofacial Surgery
type: Class
subclass of: Classification of Hospital
comment: 1 MD00657 2 Oral and Maxillo-Facial Surgery 3 None 4 Oral and Maxillofacial Surgery 5 408465003 6 Oral and maxillofacial surgery (qualifier value 7 Oral and maxillofacial surgery (qualifier value) 8 Oral and maxillofacial surgery (qualifier value) 9 C0812928

Oral and maxillofacial radiology
type: Class
subclass of: Classification of Hospital
comment: 1 MD00664 2 Oral and Maxillofacial radiation Surgery 3 None 4 Oral and maxillofacial radiology 5 788008002 6 Oral and maxillofacial surgery service 7 Oral and maxillofacial surgery service (qualifier value) 8 Dentist - Oral and Maxillofacial Radiology 9 C1555931

Oral motor exercises
type: Class
subclass of: Active exercise
comment: 1 M00272 2 Oral motor exercises 3 exercises motor oral 4 Oral motor exercises 5 311707005 6 Oral motor exercises 7 Oral motor exercises (regime/therapy) 8 Oral motor exercises 9 C0589304
alternative label: exercises motor oral

Oral pharynx
type: Class
subclass of: Respiratory function (Body region)
comment: 1 MD06913 2 Oral pharynx 3 None 4 Oral pharynx 5 54066008 6 pharynx 7 Pharyngeal structure (body structure) 8 Oral pharynx 9 C0521367

Oral rehabilitation
type: Class
subclass of: Voice and Speaking (Therapy)
comment: 1 M00628 2 Oral rehabilitation 3 None 4 Oral rehabilitation 5 183284000 6 Oral rehabilitation 7 Oral rehabilitation (regime/therapy) 8 Oral rehabilitation 9 C0419104

Oral temperature
type: Class
subclass of: Sensory function, Pain and Skin function (Body measurement)
comment: 1 M00172 2 Oral temperature 3 None 4 Oral temperature 5 415945006 6 Oral temperature 7 Estimated core body temperature measured in sublingual space (observable entity) 8 Oral temperature 9 C1532216

Order of implementation
type: Class
subclass of: Duration
comment: 1 MD04818 2 Order of implementation 3 None 4 Order of implementation 5 272103003 6 Time patterns 7 Time patterns (qualifier value) 8 Time patterns 9 C0439545

Organ-related rehabilitation
type: Class
subclass of: Digestive function (Therapy)
comment: 1 M00625 2 Organ-related rehabilitation 3 None 4 Organ-related rehabilitation 5 52052004 6 Rehabilitation 7 Rehabilitation therapy (regime/therapy) 8 Rehabilitation therapy 9 C0034991

Organic sleep disorder
type: Class
subclass of: Activities of disability
comment: 1 M00050 2 Organic sleep disorder 3 Organic sleep disorders 4 Organic sleep disorder 5 418955009 6 Organic sleep disorder 7 Organic sleep disorder (disorder) 8 Organic sleep disorder 9 C1561892
alternative label: Organic sleep apnea

Organization and planning
type: Class
subclass of: Nervous system and Mental function (Body measurement)
comment: 1 MD05689 2 Organization and planning 3 None 4 Organization and planning 5 21139007 6 Organization 7 Organization (morphologic abnormality) 8 Organization and planning 9 C2370891

Organize your bank account
type: Class
subclass of: Health Related Factors
comment: 1 MD05433 2 Organize your bank account 3 None 4 Organize your bank account 5 844005 6 Behavior finding 7 Behavior finding (finding) 8 Behavior 9 C0004927

Organized religion
type: Class
subclass of: Individual Related Factors
comment: 1 MD06559 2 Organized religion 3 None 4 Organized religion 5 1400009 6 Spiritual or religious belief 7 Spiritual or religious belief (religion/philosophy) 8 Organized religion 9 C0681213

Organizing
type: Class
subclass of: Health Related Factors
comment: 1 MD04516 2 Organizing 3 Organize 4 Organizing 5 385650005 6 Organized 7 Organized (qualifier value) 8 Organized 9 C1300196
alternative label: Organize

Organizing gymnastics
type: Class
subclass of: Conditioning exercise
comment: 1 MD02805 2 Organizing gymnastics 3 None 4 Organizing gymnastics 5 256235009 6 exercise 7 Exercise (observable entity) 8 Gymnastics 9 C0018409

Organizing the Refrigerator
type: Class
subclass of: Health Related Factors
comment: 1 MD05385 2 Organizing the Refrigerator 3 None 4 Organizing the Refrigerator 5 844005 6 Behavior finding 7 Behavior finding (finding) 8 Behavior 9 C0004927

Organizing the hem of a dress shirt with pants
type: Class
subclass of: Health Related Factors
comment: 1 MD04513 2 Organizing the hem of a dress shirt with pants 3 None 4 Organizing the hem of a dress shirt with pants 5 385650005 6 Organized 7 Organized (qualifier value) 8 Organized 9 C1300196

Orientation functions
type: Class
subclass of: Nervous system and Mental function (Body measurement)
comment: 1 MD05604 2 Orientation functions 3 None 4 Orientation functions 5 43173001 6 Orientation, function 7 Orientation, function (observable entity) 8 Orientation functions 9 C0029266

Orientation to objects
type: Class
subclass of: Nervous system and Mental function (Body measurement)
comment: 1 MD05612 2 Orientation to objects 3 None 4 Orientation to objects 5 43173001 6 Orientation 7 Orientation, function (observable entity) 8 Orientation to objects 9 C2371921

Orientation to others
type: Class
subclass of: Nervous system and Mental function (Body measurement)
comment: 1 MD05609 2 Orientation to others 3 None 4 Orientation to others 5 43173001 6 Orientation 7 Orientation, function (observable entity) 8 Orientation to others 9 C2371001

Orientation to person
type: Class
subclass of: Nervous system and Mental function (Body measurement)
comment: 1 MD05607 2 Orientation to person 3 None 4 Orientation to person 5 43173001 6 Orientation 7 Orientation, function (observable entity) 8 Orientation to person 9 C2371003

Orientation to place
type: Class
subclass of: Nervous system and Mental function (Body measurement)
comment: 1 MD05606 2 Orientation to place 3 None 4 Orientation to place 5 43173001 6 Orientation 7 Orientation, function (observable entity) 8 Orientation to place 9 C2370999

Orientation to self
type: Class
subclass of: Nervous system and Mental function (Body measurement)
comment: 1 MD05608 2 Orientation to self 3 None 4 Orientation to self 5 43173001 6 Orientation 7 Orientation, function (observable entity) 8 Orientation to self 9 C2371000

Orientation to space
type: Class
subclass of: Nervous system and Mental function (Body measurement)
comment: 1 MD05613 2 Orientation to space 3 None 4 Orientation to space 5 43173001 6 Orientation 7 Orientation, function (observable entity) 8 Orientation to space 9 C2371922

Orientation to time
type: Class
subclass of: Nervous system and Mental function (Body measurement)
comment: 1 MD05605 2 Orientation to time 3 None 4 Orientation to time 5 43173001 6 Orientation 7 Orientation, function (observable entity) 8 Orientation to time 9 C0599544

Original score
type: Class
subclass of: Units
comment: 1 MD04484 2 Original score 3 None 4 Original score 5 246262008 6 Score 7 Score (attribute) 8 Score 9 C0449820

Orthodontics
type: Class
subclass of: Classification of Hospital
comment: 1 MD00659 2 Orthodontics 3 None 4 Orthodontics 5 394608004 6 Orthodontics 7 Orthodontics (qualifier value) 8 Orthodontics speciality 9 C0029335

Orthopedic Surgery
type: Class
subclass of: Classification of Hospital
comment: 1 MD00634 2 Orthopedic Surgery 3 None 4 Orthopedic Surgery 5 702933008 6 Orthopedic clinic 7 Orthopedic clinic (environment) 8 Orthopedics 9 C0029355

Orthoptic-pleoptic training
type: Class
subclass of: Health Related Factors
comment: 1 M01763 2 Orthoptic-pleoptic training 3 None 4 Orthoptic-pleoptic training 5 40505001 6 Orthoptic-pleoptic training 7 Orthoptic training (regime/therapy) 8 Orthoptic-pleoptic training 9 C0200245

Orthoptic exercises
type: Class
subclass of: Active exercise
comment: 1 M00265 2 Orthoptic exercises 3 None 4 Orthoptic exercises 5 40505001 6 Orthoptic exercises 7 Orthoptic training (regime/therapy) 8 Orthoptic exercises 9 C0200245

Orthoptic training
type: Class
subclass of: Health Related Factors
comment: 1 M01762 2 Orthoptic training 3 None 4 Orthoptic training 5 40505001 6 Orthoptic training 7 Orthoptic training (regime/therapy) 8 Orthoptic training 9 C0200245

Osmolarity
type: Class
subclass of: Units
comment: 1 M03609 2 Osmolarity 3 Osmolarities Osmolar Concentrations Osmolar Concentration 4 Osmolarity 5 62970001 6 Osmolarity 7 Osmolarity (observable entity) 8 Osmolarity 9 C0029387
alternative label: Osmolar Concentrations
alternative label: Osmolar Concentration
alternative label: Osmolarities

Osmole
type: Class
subclass of: Units
comment: 1 M03691 2 Osmole 3 osmol osmols osmoles osm 4 Osmole 5 258729001 6 osmole 7 osmole (qualifier value) 8 osmole 9 C0439186
alternative label: osmol
alternative label: osm
alternative label: osmols
alternative label: osmoles

Ossicles
type: Class
subclass of: Sensory function, Pain and Skin function (Body region)
comment: 1 MD06876 2 Ossicles 3 None 4 Ossicles 5 41845008 6 auditory ossicle 7 Ear ossicle structure (body structure) 8 Ossicles 9 C2371871

Osteochondrodysplasia
type: Class
subclass of: Musculoskeletal function (Symptom)
comment: 1 MD00511 2 Osteochondrodysplasia 3 None 4 Osteochondrodysplasia 5 105986008 6 Osteochondrodysplasia 7 Congenital skeletal dysplasia (disorder) 8 Skeletal dysplasia 9 C0410528

Osteopetrosis
type: Class
subclass of: Musculoskeletal function (Symptom)
comment: 1 MD00516 2 Osteopetrosis 3 None 4 Osteopetrosis 5 1926006 6 Osteopetrosis 7 Osteopetrosis (disorder) 8 Osteopetrosis 9 C0029454

Osteopsathyrosis
type: Class
subclass of: Musculoskeletal function (Symptom)
comment: 1 MD00441 2 Osteopsathyrosis 3 None 4 Osteopsathyrosis 5 78314001 6 Osteopsathyrosis 7 Osteogenesis imperfecta (disorder) 8 Osteogenesis Imperfecta 9 C0029434

Other Risk Factors
type: Class
subclass of: Questionnaire
comment: 1 MD05023 2 Other Risk Factors 3 None 4 Other Risk Factors 5 80943009 6 Risk factor 7 Risk factor (observable entity) 8 risk factors 9 C0035648

Other admission fees
type: Class
subclass of: Hospital Administration
comment: 1 MD00184 2 Other admission fees 3 None 4 Other admission fees 5 308590000 6 Payment for service procedure 7 Payment for service procedure (procedure) 8 Fees, Medical 9 C0015754

Other functions of the skin
type: Class
subclass of: Sensory function, Pain and Skin function (Body measurement)
comment: 1 MD06107 2 Other functions of the skin 3 None 4 Other functions of the skin 5 64501009 6 Skin function 7 Skin function (observable entity) 8 Other functions of the skin 9 C2371271

Other porphyria
type: Class
subclass of: Functions of Blood System, Metabolic system and Endocrine system (Symptom)
comment: 1 MD00322 2 Other porphyria 3 None 4 Other porphyria 5 418470004 6 Porphyria 7 Porphyria (disorder) 8 Porphyria 9 C3463940

Other professionals
type: Class
subclass of: Hospital information, examination/diagnosis/treatment data
comment: 1 MD06693 2 Other professionals 3 None 4 Other professionals 5 14679004 6 Profession 7 Occupation (occupation) 8 Other professionals 9 C2371723

Other purposeful sensing
type: Class
subclass of: Health Related Factors
comment: 1 MD06117 2 Other purposeful sensing 3 None 4 Other purposeful sensing 5 272144002 6 Sensation 7 Sensation quality (qualifier value) 8 Other purposeful sensing 9 C2371284

Other specified acquiring a place to live
type: Class
subclass of: Health Related Factors
comment: 1 MD06415 2 Other specified acquiring a place to live 3 None 4 Other specified acquiring a place to live 5 264362003 6 Home 7 Home (environment) 8 Acquiring a place to live, other specified 9 C2371486

Other specified acquiring concepts
type: Class
subclass of: Health Related Factors
comment: 1 MD06142 2 Other specified acquiring concepts 3 None 4 Other specified acquiring concepts 5 844005 6 Behavior finding 7 Behavior finding (finding) 8 Acquiring concepts, other specified 9 C2371984

Other specified acquiring language
type: Class
subclass of: Health Related Factors
comment: 1 MD06135 2 Other specified acquiring language 3 None 4 Other specified acquiring language 5 844005 6 Behavior finding 7 Behavior finding (finding) 8 Learning through actions, other specified 9 C2371971

Other specified acquiring skills
type: Class
subclass of: Health Related Factors
comment: 1 MD06166 2 Other specified acquiring skills 3 None 4 Other specified acquiring skills 5 844005 6 Behavior finding 7 Behavior finding (finding) 8 Acquiring skills, other specified 9 C2371294

Other specified acquisition of goods and services
type: Class
subclass of: Health Related Factors
comment: 1 MD06420 2 Other specified acquisition of goods and services 3 None 4 Other specified acquisition of goods and services 5 224930009 6 Services 7 Services (qualifier value) 8 Acquisition of goods and services, other specified 9 C2371490

Other specified additional functions of the respiratory system
type: Class
subclass of: Respiratory function (Body measurement)
comment: 1 MD05895 2 Other specified additional functions of the respiratory system 3 None 4 Other specified additional functions of the respiratory system 5 301282008 6 Finding of respiration 7 Finding of respiration (finding) 8 Additional respiratory functions, other specified 9 C2371937

Other specified additional musculoskeletal structures related to movement
type: Class
subclass of: Musculoskeletal function (Body region)
comment: 1 MD07099 2 Other specified additional musculoskeletal structures related to movement 3 None 4 Other specified additional musculoskeletal structures related to movement 5 26107004 6 Musculoskeletal structure 7 Structure of musculoskeletal system (body structure) 8 Additional musculoskeletal structures related to movement, other specified 9 C2371900

Other specified air quality
type: Class
subclass of: Physical/Chemical Environment
comment: 1 MD06679 2 Other specified air quality 3 None 4 Other specified air quality 5 263496004 6 Quality 7 Quality (attribute) 8 Air quality, other specified 9 C2371712

Other specified alternative vocalization functions
type: Class
subclass of: Voice and Speaking (Body measurement)
comment: 1 MD05829 2 Other specified alternative vocalization functions 3 None 4 Other specified alternative vocalization functions 5 278288005 6 vocalization 7 Vocalization (finding) 8 Alternative vocalization functions, other specified 9 C2370989

Other specified assets
type: Class
subclass of: Characteristics of the individual
comment: 1 MD06632 2 Other specified assets 3 None 4 Other specified assets 5 118598001 6 Property 7 Property (qualifier value) 8 Assets, other specified 9 C2371682

Other specified assisting others
type: Class
subclass of: Health Related Factors
comment: 1 MD06456 2 Other specified assisting others 3 None 4 Other specified assisting others 5 119265000 6 Assisting 7 Assisting (procedure) 8 Assisting others, other specified 9 C2371525

Other specified attention functions
type: Class
subclass of: Nervous system and Mental function (Body measurement)
comment: 1 MD05651 2 Other specified attention functions 3 None 4 Other specified attention functions 5 6769007 6 Attention function 7 Attention function (observable entity) 8 Attention functions, other specified 9 C2370877

Other specified attitudes
type: Class
subclass of: Individual Related Factors
comment: 1 MD06708 2 Other specified attitudes 3 None 4 Other specified attitudes 5 225464009 6 attitude 7 Attitude (observable entity) 8 Attitudes, other specified 9 C2371739

Other specified basic interpersonal interactions
type: Class
subclass of: Individual Related Factors
comment: 1 MD06469 2 Other specified basic interpersonal interactions 3 None 4 Other specified basic interpersonal interactions 5 304879008 6 Recording interpersonal interactions 7 Recording interpersonal interactions (procedure) 8 Basic interpersonal interactions, other specified 9 C2371539

Other specified blood pressure functions
type: Class
subclass of: Cardiovascular system function (Body measurement)
comment: 1 MD05850 2 Other specified blood pressure functions 3 None 4 Other specified blood pressure functions 5 75367002 6 blood pressure 7 Blood pressure (observable entity) 8 Blood pressure functions, other specified 9 C2371018

Other specified blood vessel functions
type: Class
subclass of: Cardiovascular system function (Body measurement)
comment: 1 MD05844 2 Other specified blood vessel functions 3 None 4 Other specified blood vessel functions 5 21829004 6 blood vessel finding 7 Blood vessel finding (finding) 8 Blood vessel functions, other specified 9 C2371015

Other specified calculating
type: Class
subclass of: Health Related Factors
comment: 1 MD06185 2 Other specified calculating 3 None 4 Other specified calculating 5 844005 6 Behavior finding 7 Behavior finding (finding) 8 Calculating, other specified 9 C2372021

Other specified calculation functions
type: Class
subclass of: Nervous system and Mental function (Body measurement)
comment: 1 MD05718 2 Other specified calculation functions 3 None 4 Other specified calculation functions 5 246464006 6 Function 7 Function (observable entity) 8 Calculation functions, other specified 9 C2370911

Other specified caring for body parts
type: Class
subclass of: Health Related Factors
comment: 1 MD06385 2 Other specified caring for body parts 3 None 4 Other specified caring for body parts 5 225364005 6 Care of body sites 7 Care of body sites (regime/therapy) 8 Caring for body parts, other specified 9 C2371462

Other specified caring for household objects
type: Class
subclass of: Health Related Factors
comment: 1 MD06447 2 Other specified caring for household objects 3 None 4 Other specified caring for household objects 5 35359004 6 Family 7 Family (social concept) 8 Caring for household objects, other specified 9 C2372076

Other specified carrying out daily routine
type: Class
subclass of: Health Related Factors
comment: 1 MD06215 2 Other specified carrying out daily routine 3 None 4 Other specified carrying out daily routine 5 844005 6 Behavior finding 7 Behavior finding (finding) 8 Carrying out daily routine, other specified 9 C2371324

Other specified changing basic body position
type: Class
subclass of: Health Related Factors
comment: 1 MD06284 2 Other specified changing basic body position 3 None 4 Other specified changing basic body position 5 397155001 6 Body position 7 Body position (observable entity) 8 Changing basic body position, other specified 9 C2371381

Other specified climate
type: Class
subclass of: Physical/Chemical Environment
comment: 1 MD06657 2 Other specified climate 3 None 4 Other specified climate 5 276339004 6 Environment 7 Environment (environment) 8 Climate, other specified 9 C2371695

Other specified communicating with receiving nonverbal messages
type: Class
subclass of: Health Related Factors
comment: 1 MD06235 2 Other specified communicating with receiving nonverbal messages 3 None 4 Other specified communicating with receiving nonverbal messages 5 288577006 6 Communicates 7 Does communicate (finding) 8 Communicating with - receiving - nonverbal messages, other specified 9 C2371341

Other specified communicating with receiving spoken messages
type: Class
subclass of: Health Related Factors
comment: 1 MD06229 2 Other specified communicating with receiving spoken messages 3 None 4 Other specified communicating with receiving spoken messages 5 288577006 6 Communicates 7 Does communicate (finding) 8 Communicating with - receiving - spoken messages, other specified 9 C2372042

Other specified communication
type: Class
subclass of: Health Related Factors
comment: 1 MD06273 2 Other specified communication 3 None 4 Other specified communication 5 263536004 6 Communication 7 Communication (attribute) 8 Communication, other specified 9 C2371375

Other specified community life
type: Class
subclass of: Individual Related Factors
comment: 1 MD06547 2 Other specified community life 3 None 4 Other specified community life 5 133928008 6 Community 7 Community (social concept) 8 Community life, other specified 9 C2371609

Other specified complex interpersonal interactions
type: Class
subclass of: Individual Related Factors
comment: 1 MD06477 2 Other specified complex interpersonal interactions 3 None 4 Other specified complex interpersonal interactions 5 304879008 6 Recording interpersonal interactions 7 Recording interpersonal interactions (procedure) 8 Complex interpersonal interactions, other specified 9 C2371547

Other specified consciousness functions
type: Class
subclass of: Nervous system and Mental function (Body measurement)
comment: 1 MD05602 2 Other specified consciousness functions 3 None 4 Other specified consciousness functions 5 106167005 6 Consciousness 7 Consciousness related finding (finding) 8 Consciousness functions, other specified 9 C2370998

Other specified control of voluntary movement functions
type: Class
subclass of: Nervous system and Mental function (Body measurement)
comment: 1 MD06082 2 Other specified control of voluntary movement functions 3 None 4 Other specified control of voluntary movement functions 5 364807002 6 Control of movement - finding 7 Finding of control of movement (finding) 8 Control of voluntary movement functions 9 C2371247

Other specified conversation
type: Class
subclass of: Health Related Factors
comment: 1 MD06258 2 Other specified conversation 3 None 4 Other specified conversation 5 288636002 6 Does make conversation 7 Does make conversation (finding) 8 conversation 9 C0871703

Other specified defecation functions
type: Class
subclass of: Digestive function (Body measurement)
comment: 1 MD05938 2 Other specified defecation functions 3 None 4 Other specified defecation functions 5 111989001 6 Defecation 7 Defecation (observable entity) 8 Defecation functions, other specified 9 C2371132

Other specified digestive functions
type: Class
subclass of: Digestive function (Body measurement)
comment: 1 MD05929 2 Other specified digestive functions 3 None 4 Other specified digestive functions 5 386617003 6 digestive system finding 7 Digestive system finding (finding) 8 Digestive functions, other specified 9 C2371127

Other specified discussion
type: Class
subclass of: Health Related Factors
comment: 1 MD06263 2 Other specified discussion 3 None 4 Other specified discussion 5 223482009 6 Discussion 7 Discussion (procedure) 8 Discussion, other specified 9 C2371366

Other specified doing housework
type: Class
subclass of: Health Related Factors
comment: 1 MD06435 2 Other specified doing housework 3 None 4 Other specified doing housework 5 129014002 6 Doing housework 7 Doing housework (observable entity) 8 Doing housework, other specified 9 C2371504

Other specified domestic life
type: Class
subclass of: Health Related Factors
comment: 1 MD06459 2 Other specified domestic life 3 None 4 Other specified domestic life 5 261770009 6 Domestic 7 Domestic (environment) 8 Domestic life, other specified 9 C2371528

Other specified dressing
type: Class
subclass of: Health Related Factors
comment: 1 MD06399 2 Other specified dressing 3 None 4 Other specified dressing 5 3895009 6 Dressing 7 Application of dressing (procedure) 8 Dressing, other specified 9 C2371470

Other specified driving
type: Class
subclass of: Health Related Factors
comment: 1 MD06365 2 Other specified driving 3 None 4 Other specified driving 5 129060000 6 Driving 7 Driving (observable entity) 8 Driving, other specified 9 C2371446

Other specified economic self-sufficiency
type: Class
subclass of: Individual Related Factors
comment: 1 MD06538 2 Other specified economic self-sufficiency 3 None 4 Other specified economic self-sufficiency 5 844005 6 Behavior finding 7 Behavior finding (finding) 8 Economic self-sufficiency, other specified 9 C2371599

Other specified emotional functions
type: Class
subclass of: Nervous system and Mental function (Symptom)
comment: 1 MD05669 2 Other specified emotional functions 3 None 4 Other specified emotional functions 5 1155970002 6 Emotion function 7 Emotion function (observable entity) 8 Emotional functions, other specified 9 C2370886

Other specified energy and drive functions
type: Class
subclass of: Nervous system and Mental function (Body measurement)
comment: 1 MD05635 2 Other specified energy and drive functions 3 None 4 Other specified energy and drive functions 5 91208009 6 Energy and drive functions 7 Energy and drive functions 8 Energy and drive functions, other specified 9 C2370868

Other specified exercise tolerance functions
type: Class
subclass of: Musculoskeletal function (Body measurement)
comment: 1 MD05901 2 Other specified exercise tolerance functions 3 None 4 Other specified exercise tolerance functions 5 248243004 6 Exercise tolerance 7 Exercise tolerance (observable entity) 8 Exercise tolerance functions, other specified 9 C2371108

Other specified experience of self and time functions
type: Class
subclass of: Nervous system and Mental function (Body measurement)
comment: 1 MD05725 2 Other specified experience of self and time functions 3 None 4 Other specified experience of self and time functions 5 246464006 6 Function 7 Function (observable entity) 8 Experience of self and time functions, other specified 9 C2370916

Other specified expression of language
type: Class
subclass of: Nervous system and Mental function (Body measurement)
comment: 1 MD05710 2 Other specified expression of language 3 None 4 Other specified expression of language 5 61909002 6 Language 7 Language, function (observable entity) 8 Expression of language, other specified 9 C2370904

Other specified family relationships
type: Class
subclass of: Individual Related Factors
comment: 1 MD06500 2 Other specified family relationships 3 None 4 Other specified family relationships 5 272151006 6 Relationships 7 Relationships (qualifier value) 8 Family relationships, other specified 9 C2371567

Other specified fine hand use
type: Class
subclass of: Health Related Factors
comment: 1 MD06320 2 Other specified fine hand use 3 None 4 Other specified fine hand use 5 288361006 6 Ability to use hands 7 Ability to perform general manipulative activities (observable entity) 8 Fine hand use, other specified 9 C2371411

Other specified fluency and rhythm of speech functions
type: Class
subclass of: Voice and Speaking (Body measurement)
comment: 1 MD05824 2 Other specified fluency and rhythm of speech functions 3 None 4 Other specified fluency and rhythm of speech functions 5 106132005 6 speech finding 7 Speech finding (finding) 8 Fluency and rhythm of speech functions, other specified 9 C2370984

Other specified focusing attention
type: Class
subclass of: Health Related Factors
comment: 1 MD06172 2 Other specified focusing attention 3 None 4 Other specified focusing attention 5 311517002 6 Focused attention 7 Focused attention, function (observable entity) 8 Focusing attention, other specified 9 C2372003

Other specified formal relationships
type: Class
subclass of: Individual Related Factors
comment: 1 MD06485 2 Other specified formal relationships 3 None 4 Other specified formal relationships 5 272151006 6 Relationships 7 Relationships (qualifier value) 8 Formal relationships, other specified 9 C2371556

Other specified functions of structures adjoining the eye
type: Class
subclass of: Sensory function, Pain and Skin function (Body measurement)
comment: 1 MD05753 2 Other specified functions of structures adjoining the eye 3 None 4 Other specified functions of structures adjoining the eye 5 414302002 6 Function of eye region structure 7 Function of eye region structure (observable entity) 8 Functions of structures adjoining the eye, other specified 9 C2370936

Other specified functions of the skin and related structures
type: Class
subclass of: Sensory function, Pain and Skin function (Body measurement)
comment: 1 MD06113 2 Other specified functions of the skin and related structures 3 None 4 Other specified functions of the skin and related structures 5 64501009 6 Skin function 7 Skin function (observable entity) 8 Functions of the skin and related structures, other specified 9 C2371278

Other specified functions related to mucus
type: Class
subclass of: Respiratory function (Body measurement)
comment: 1 MD05893 2 Other specified functions related to mucus 3 None 4 Other specified functions related to mucus 5 49909006 6 Mucus 7 Mucus (substance) 8 Mucous body substance 9 C0026727

Other specified general metabolic functions
type: Class
subclass of: Functions of Blood System, Metabolic system and Endocrine system (Body measurement)
comment: 1 MD05953 2 Other specified general metabolic functions 3 None 4 Other specified general metabolic functions 5 47722004 6 General metabolic function 7 General metabolic function (observable entity) 8 General metabolic functions, other specified 9 C2371142

Other specified general tasks and demands
type: Class
subclass of: Health Related Factors
comment: 1 MD06223 2 Other specified general tasks and demands 3 None 4 Other specified general tasks and demands 5 844005 6 Behavior finding 7 Behavior finding (finding) 8 General tasks and demands, other specified 9 C2371332

Other specified genitourinary and reproductive functions
type: Class
subclass of: Urogenital function (Body measurement)
comment: 1 MD06022 2 Other specified genitourinary and reproductive functions 3 None 4 Other specified genitourinary and reproductive functions 5 118255001 6 Reproductive function 7 Reproductive function (observable entity) 8 Genitourinary and reproductive functions, other specified 9 C2371194

Other specified haematological system functions
type: Class
subclass of: Functions of Blood System, Metabolic system and Endocrine system (Body measurement)
comment: 1 MD05858 2 Other specified haematological system functions 3 None 4 Other specified haematological system functions 5 86084001 6 haematologic function 7 Hematologic function (observable entity) 8 Haematological system functions, other specified 9 C2371087

Other specified hand and arm use
type: Class
subclass of: Health Related Factors
comment: 1 MD06329 2 Other specified hand and arm use 3 None 4 Other specified hand and arm use 5 85562004 6 Hand 7 Hand structure (body structure) 8 Hand and arm use, other specified 9 C2371415

Other specified handling stress and other psychological demands
type: Class
subclass of: Health Related Factors
comment: 1 MD06221 2 Other specified handling stress and other psychological demands 3 None 4 Other specified handling stress and other psychological demands 5 844005 6 Behavior finding 7 Behavior finding (finding) 8 Handling stress and other psychological demands, other specified 9 C2371330

Other specified hearing functions
type: Class
subclass of: Sensory function, Pain and Skin function (Body measurement)
comment: 1 MD05763 2 Other specified hearing functions 3 None 4 Other specified hearing functions 5 47078008 6 Hearing, function 7 Hearing, function (observable entity) 8 Hearing functions, other specified 9 C2370941

Other specified heart functions
type: Class
subclass of: Cardiovascular system function (Body measurement)
comment: 1 MD05838 2 Other specified heart functions 3 None 4 Other specified heart functions 5 739122008 6 heart function 7 Cardiac physiological function (observable entity) 8 Heart functions, other specified 9 C2371011

Other specified higher-level cognitive functions
type: Class
subclass of: Nervous system and Mental function (Body measurement)
comment: 1 MD05695 2 Other specified higher-level cognitive functions 3 None 4 Other specified higher-level cognitive functions 5 311465003 6 Cognitive functions 7 Cognitive functions (observable entity) 8 Higher-level cognitive functions, other specified 9 C2370893

Other specified immune response
type: Class
subclass of: Immune system function (Body measurement)
comment: 1 MD05864 2 Other specified immune response 3 None 4 Other specified immune response 5 35024006 6 Immune response 7 Immune response, function (observable entity) 8 Immune response, other specified 9 C2371090

Other specified immunological system functions
type: Class
subclass of: Immune system function (Body measurement)
comment: 1 MD05869 2 Other specified immunological system functions 3 None 4 Other specified immunological system functions 5 106183005 6 immunologic function 7 Immunologic function (observable entity) 8 Immunological system functions, other specified 9 C2371093

Other specified informal social relationships
type: Class
subclass of: Individual Related Factors
comment: 1 MD06493 2 Other specified informal social relationships 3 None 4 Other specified informal social relationships 5 272151006 6 Relationships 7 Relationships (qualifier value) 8 Informal social relationships, other specified 9 C2371564

Other specified ingestion functions
type: Class
subclass of: Digestive function (Symptom)
comment: 1 MD05922 2 Other specified ingestion functions 3 None 4 Other specified ingestion functions 5 111984006 6 ingestion 7 Ingestion (observable entity) 8 Ingestion 9 C0232478

Other specified interpersonal interactions and relationships
type: Class
subclass of: Individual Related Factors
comment: 1 MD06509 2 Other specified interpersonal interactions and relationships 3 None 4 Other specified interpersonal interactions and relationships 5 225706007 6 Interpersonal relationship finding 7 Interpersonal relationship finding (finding) 8 Interpersonal interactions and relationships, other specified 9 C2371575

Other specified intimate relationships
type: Class
subclass of: Individual Related Factors
comment: 1 MD06506 2 Other specified intimate relationships 3 None 4 Other specified intimate relationships 5 272151006 6 Relationships 7 Relationships (qualifier value) 8 Intimate relationships, other specified 9 C2371572

Other specified involuntary movement functions
type: Class
subclass of: Musculoskeletal function (Body measurement)
comment: 1 MD06094 2 Other specified involuntary movement functions 3 None 4 Other specified involuntary movement functions 5 255324009 6 Movement 7 Movement (observable entity) 8 Involuntary movement functions 9 C2371257

Other specified learning and applying knowledge
type: Class
subclass of: Health Related Factors
comment: 1 MD06194 2 Other specified learning and applying knowledge 3 None 4 Other specified learning and applying knowledge 5 417924000 6 Apply 7 Apply - dosing instruction imperative (qualifier value) 8 Learning and applying knowledge, other specified 9 C2371303
comment: 1 MD06194 2 Other specified learning and applying knowledge 3 None 4 Other specified learning and applying knowledge 5 69998004 6 Learning 7 Learning, function (observable entity) 8 Learning and applying knowledge, other specified 9 C2371303

Other specified learning through actions with objects
type: Class
subclass of: Health Related Factors
comment: 1 MD06129 2 Other specified learning through actions with objects 3 None 4 Other specified learning through actions with objects 5 69998004 6 Learning 7 Learning, function (observable entity) 8 Learning through actions, other specified 9 C2371971

Other specified learning to calculate
type: Class
subclass of: Health Related Factors
comment: 1 MD06161 2 Other specified learning to calculate 3 None 4 Other specified learning to calculate 5 69998004 6 Learning 7 Learning, function (observable entity) 8 Learning to calculate, other specified 9 C2371999

Other specified learning to read
type: Class
subclass of: Health Related Factors
comment: 1 MD06149 2 Other specified learning to read 3 None 4 Other specified learning to read 5 69998004 6 Learning 7 Learning, function (observable entity) 8 Learning to read, other specified 9 C2371989

Other specified learning to write
type: Class
subclass of: Health Related Factors
comment: 1 MD06155 2 Other specified learning to write 3 None 4 Other specified learning to write 5 69998004 6 Learning 7 Learning, function (observable entity) 8 Learning to write, other specified 9 C2371994

Other specified light
type: Class
subclass of: Physical/Chemical Environment
comment: 1 MD06663 2 Other specified light 3 None 4 Other specified light 5 371268001 6 Light 7 Light color (qualifier value) 8 Light, other specified 9 C2371700

Other specified major life areas
type: Class
subclass of: Individual Related Factors
comment: 1 MD06541 2 Other specified major life areas 3 None 4 Other specified major life areas 5 42798000 6 Area 7 Area (qualifier value) 8 Major life areas, other specified 9 C2371602

Other specified memory functions
type: Class
subclass of: Nervous system and Mental function (Body measurement)
comment: 1 MD05658 2 Other specified memory functions 3 None 4 Other specified memory functions 5 303116000 6 Memory function 7 Memory function (observable entity) 8 Memory functions, other specified 9 C2370878

Other specified menstruation functions
type: Class
subclass of: Urogenital function (Body measurement)
comment: 1 MD06005 2 Other specified menstruation functions 3 None 4 Other specified menstruation functions 5 248957007 6 Menstruation, function 7 Menstruation, function (observable entity) 8 Menstruation functions, other specified 9 C2371179

Other specified mental functions
type: Class
subclass of: Nervous system and Mental function (Body measurement)
comment: 1 MD05728 2 Other specified mental functions 3 None 4 Other specified mental functions 5 285231000 6 Mental function 7 Mental function (observable entity) 8 Mental functions, other specified 9 C2370919

Other specified mental functions of language
type: Class
subclass of: Nervous system and Mental function (Body measurement)
comment: 1 MD05713 2 Other specified mental functions of language 3 None 4 Other specified mental functions of language 5 285231000 6 Mental function 7 Mental function (observable entity) 8 Mental functions of language, other specified 9 C2370907

Other specified mobility
type: Class
subclass of: Health Related Factors
comment: 1 MD06369 2 Other specified mobility 3 None 4 Other specified mobility 5 246197003 6 Mobility 7 Mobility (attribute) 8 Mobility, other specified 9 C2371450

Other specified mobility of bone functions
type: Class
subclass of: Musculoskeletal function (Body measurement)
comment: 1 MD06041 2 Other specified mobility of bone functions 3 None 4 Other specified mobility of bone functions 5 363803005 6 Mobility 7 Mobility (observable entity) 8 Mobility of bone functions, other specified 9 C2371213

Other specified mobility of joint functions
type: Class
subclass of: Musculoskeletal function (Body measurement)
comment: 1 MD06028 2 Other specified mobility of joint functions 3 None 4 Other specified mobility of joint functions 5 364564000 6 Range of motion 7 Range of joint movement (observable entity) 8 Mobility of joint functions, other specified 9 C2371201

Other specified motor reflex functions
type: Class
subclass of: Nervous system and Mental function (Body measurement)
comment: 1 MD06074 2 Other specified motor reflex functions 3 None 4 Other specified motor reflex functions 5 106146005 6 Reflexes 7 Reflex finding (finding) 8 Motor reflex functions 9 C2371245

Other specified moving around
type: Class
subclass of: Health Related Factors
comment: 1 MD06344 2 Other specified moving around 3 None 4 Other specified moving around 5 302000008 6 move 7 Does move (finding) 8 Moving around, other specified 9 C2371426

Other specified moving around in different locations
type: Class
subclass of: Health Related Factors
comment: 1 MD06350 2 Other specified moving around in different locations 3 None 4 Other specified moving around in different locations 5 302000008 6 move 7 Does move (finding) 8 Moving around in different locations, other specified 9 C2371432

Other specified moving objects with lower extremities
type: Class
subclass of: Health Related Factors
comment: 1 MD06313 2 Other specified moving objects with lower extremities 3 None 4 Other specified moving objects with lower extremities 5 61685007 6 Lower extremity 7 Lower limb structure (body structure) 8 Moving objects with lower extremities, other specified 9 C2371407

Other specified muscle endurance functions
type: Class
subclass of: Musculoskeletal function (Body measurement)
comment: 1 MD06067 2 Other specified muscle endurance functions 3 None 4 Other specified muscle endurance functions 5 406203001 6 Endurance 7 Endurance (observable entity) 8 Muscle endurance functions 9 C2371239

Other specified muscle power functions
type: Class
subclass of: Musculoskeletal function (Body measurement)
comment: 1 MD06051 2 Other specified muscle power functions 3 None 4 Other specified muscle power functions 5 271708004 6 Muscle power 7 Finding of power of skeletal muscle (finding) 8 Muscle power functions 9 C2371225

Other specified muscle tone functions
type: Class
subclass of: Musculoskeletal function (Body measurement)
comment: 1 MD06061 2 Other specified muscle tone functions 3 None 4 Other specified muscle tone functions 5 366725004 6 Muscle tone - finding 7 Finding of muscle tone (finding) 8 Tone of muscles of one limb 9 C2371227

Other specified muscles of respiration
type: Class
subclass of: Respiratory function (Body region)
comment: 1 MD06952 2 Other specified muscles of respiration 3 None 4 Other specified muscles of respiration 5 71616004 6 muscle 7 Skeletal and/or smooth muscle structure (body structure) 8 Muscles of respiration, other specified 9 C2371030

Other specified natural environment and human-made changes to environment
type: Class
subclass of: Biological environment
comment: 1 MD06681 2 Other specified natural environment and human-made changes to environment 3 None 4 Other specified natural environment and human-made changes to environment 5 276339004 6 Environment 7 Environment (environment) 8 Natural environment and human-made changes to environment, other 9 C2371714

Other specified neuromusculoskeletal and movement-related functions
type: Class
subclass of: Musculoskeletal function (Body measurement)
comment: 1 MD06103 2 Other specified neuromusculoskeletal and movement-related functions 3 None 4 Other specified neuromusculoskeletal and movement-related functions 5 91097001 6 Neuromuscular procedure 7 Neuromuscular procedure (procedure) 8 Neuromusculoskeletal and movement-related functions, other specified 9 C2371265

Other specified orientation functions
type: Class
subclass of: Nervous system and Mental function (Body measurement)
comment: 1 MD05614 2 Other specified orientation functions 3 None 4 Other specified orientation functions 5 43173001 6 Orientation 7 Orientation, function (observable entity) 8 Orientation functions, other specified 9 C2371004

Other specified orientation to person
type: Class
subclass of: Nervous system and Mental function (Body measurement)
comment: 1 MD05610 2 Other specified orientation to person 3 None 4 Other specified orientation to person 5 43173001 6 Orientation 7 Orientation, function (observable entity) 8 Orientation to person, other specified 9 C2371002

Other specified pain in body part
type: Class
subclass of: Sensory function, Pain and Skin function (Symptom)
comment: 1 MD05805 2 Other specified pain in body part 3 None 4 Other specified pain in body part 5 279001004 6 Pain of body region 7 Pain finding at anatomical site (finding) 8 Pain in body part, other specified 9 C2370969

Other specified perceptual functions
type: Class
subclass of: Nervous system and Mental function (Body measurement)
comment: 1 MD05678 2 Other specified perceptual functions 3 None 4 Other specified perceptual functions 5 81742003 6 Perception function 7 Perception function (observable entity) 8 Perceptual functions, other specified 9 C2370888

Other specified physical geography
type: Class
subclass of: Physical/Chemical Environment
comment: 1 MD06639 2 Other specified physical geography 3 None 4 Other specified physical geography 5 272498009 6 Geographical feature 7 Geographical feature (environment) 8 Physical geography, other specified 9 C2371688

Other specified population
type: Class
subclass of: Characteristics of the community
comment: 1 MD06644 2 Other specified population 3 None 4 Other specified population 5 385436007 6 Population 7 Population (social concept) 8 Climate, other specified 9 C2371695

Other specified preparing meals
type: Class
subclass of: Nutrient intake
comment: 1 MD06426 2 Other specified preparing meals 3 None 4 Other specified preparing meals 5 286491009 6 Prepares meal 7 Does prepare meal (finding) 8 Preparing meals, other specified 9 C2371496

Other specified procreation functions
type: Class
subclass of: Urogenital function (Body measurement)
comment: 1 MD06012 2 Other specified procreation functions 3 None 4 Other specified procreation functions 5 386216000 6 Delivery 7 Human parturition, function (observable entity) 8 Procreation functions, other specified 9 C2371185

Other specified producing nonverbal messages
type: Class
subclass of: Health Related Factors
comment: 1 MD06247 2 Other specified producing nonverbal messages 3 None 4 Other specified producing nonverbal messages 5 844005 6 Behavior finding 7 Behavior finding (finding) 8 Producing nonverbal messages, other specified 9 C2371351

Other specified products and technology
type: Class
subclass of: Device
comment: 1 MD06634 2 Other specified products and technology 3 None 4 Other specified products and technology 5 272394005 6 Technique 7 Technique (qualifier value) 8 Products and technology, other specified 9 C2371684

Other specified products and technology for communication
type: Class
subclass of: Device
comment: 1 MD06586 2 Other specified products and technology for communication 3 None 4 Other specified products and technology for communication 5 272394005 6 Technique 7 Technique (qualifier value) 8 Products and technology for personal use in daily living, other specified 9 C2371628

Other specified products and technology for education
type: Class
subclass of: Device
comment: 1 MD06591 2 Other specified products and technology for education 3 None 4 Other specified products and technology for education 5 272394005 6 Technique 7 Technique (qualifier value) 8 Products and technology for education, other specified 9 C2371643

Other specified products and technology for employment
type: Class
subclass of: Device
comment: 1 MD06596 2 Other specified products and technology for employment 3 None 4 Other specified products and technology for employment 5 272394005 6 Technique 7 Technique (qualifier value) 8 Products and technology for employment, other specified 9 C2371648

Other specified products and technology for personal indoor and outdoor mobility and transportation
type: Class
subclass of: Device
comment: 1 MD06581 2 Other specified products and technology for personal indoor and outdoor mobility and transportation 3 None 4 Other specified products and technology for personal indoor and outdoor mobility and transportation 5 272394005 6 Technique 7 Technique (qualifier value) 8 Products and technology for personal use in daily living, other specified 9 C2371628

Other specified products and technology for personal use in daily living
type: Class
subclass of: Device
comment: 1 MD06576 2 Other specified products and technology for personal use in daily living 3 None 4 Other specified products and technology for personal use in daily living 5 272394005 6 Technique 7 Technique (qualifier value) 8 Products and technology for personal use in daily living, other specified 9 C2371628

Other specified products and technology of land development
type: Class
subclass of: Device
comment: 1 MD06627 2 Other specified products and technology of land development 3 None 4 Other specified products and technology of land development 5 272394005 6 Technique 7 Technique (qualifier value) 8 Products and technology of land development, other specified 9 C2371677

Other specified products or substances for personal consumption
type: Class
subclass of: Health Related Factors
comment: 1 MD06571 2 Other specified products or substances for personal consumption 3 None 4 Other specified products or substances for personal consumption 5 105590001 6 Substance 7 Substance (substance) 8 Other specified products or substances for personal consumption 9 C2371623

Other specified psychomotor functions
type: Class
subclass of: Nervous system and Mental function (Body measurement)
comment: 1 MD05663 2 Other specified psychomotor functions 3 None 4 Other specified psychomotor functions 5 230460005 6 Psychomotor status 7 Complex partial status epilepticus (disorder) 8 Psychomotor functions, other specified 9 C2370881

Other specified pubertal functions
type: Class
subclass of: Functions of Blood System, Metabolic system and Endocrine system (Body measurement)
comment: 1 MD05974 2 Other specified pubertal functions 3 None 4 Other specified pubertal functions 5 419960003 6 Pubertal 7 Pubertal (finding) 8 Pubertal functions, other specified 9 C2371945

Other specified quality of vision
type: Class
subclass of: Sensory function, Pain and Skin function (Body measurement)
comment: 1 MD05744 2 Other specified quality of vision 3 None 4 Other specified quality of vision 5 246646005 6 quality of visual image 7 Quality of visual image (observable entity) 8 Quality of vision, other specified 9 C2370930

Other specified reception of language
type: Class
subclass of: Nervous system and Mental function (Body measurement)
comment: 1 MD05703 2 Other specified reception of language 3 None 4 Other specified reception of language 5 61909002 6 Language 7 Language, function (observable entity) 8 Reception of language, other specified 9 C2370898

Other specified recreation and leisure
type: Class
subclass of: Health Related Factors
comment: 1 MD06556 2 Other specified recreation and leisure 3 None 4 Other specified recreation and leisure 5 405081003 6 Leisure behavior 7 Leisure behavior (observable entity) 8 Recreation and leisure, other specified 9 C2371614

Other specified religion and spirituality
type: Class
subclass of: Individual Related Factors
comment: 1 MD06561 2 Other specified religion and spirituality 3 None 4 Other specified religion and spirituality 5 1400009 6 Spiritual or religious belief 7 Spiritual or religious belief (religion/philosophy) 8 Religion and spirituality, other specified 9 C2371616

Other specified remunerative employment
type: Class
subclass of: Individual Related Factors
comment: 1 MD06529 2 Other specified remunerative employment 3 None 4 Other specified remunerative employment 5 406156006 6 In paid employment 7 In paid employment (finding) 8 Remunerative employment, other specified 9 C2371589

Other specified respiration functions
type: Class
subclass of: Respiratory function (Body measurement)
comment: 1 MD05876 2 Other specified respiration functions 3 None 4 Other specified respiration functions 5 301282008 6 Finding of respiration 7 Finding of respiration (finding) 8 Respiration functions, other specified 9 C2371097

Other specified respiratory muscle functions
type: Class
subclass of: Respiratory function (Body measurement)
comment: 1 MD05882 2 Other specified respiratory muscle functions 3 None 4 Other specified respiratory muscle functions 5 301282008 6 Finding of respiration 7 Finding of respiration (finding) 8 Respiratory muscle functions, other specified 9 C2371101

Other specified seeing functions
type: Class
subclass of: Sensory function, Pain and Skin function (Body measurement)
comment: 1 MD05746 2 Other specified seeing functions 3 None 4 Other specified seeing functions 5 281004000 6 Visual function 7 Visual function (observable entity) 8 Seeing functions, other specified 9 C2370932

Other specified self-care
type: Class
subclass of: Health Related Factors
comment: 1 MD06409 2 Other specified self-care 3 None 4 Other specified self-care 5 707810004 6 Cares for self 7 Cares for self (finding) 8 Self-care, other specified 9 C2371478

Other specified sensations associated with genital and reproductive functions
type: Class
subclass of: Urogenital function (Symptom)
comment: 1 MD06019 2 Other specified sensations associated with genital and reproductive functions 3 None 4 Other specified sensations associated with genital and reproductive functions 5 272144002 6 sensation 7 Sensation quality (qualifier value) 8 Sensations associated with genital and reproductive functions, other specified 9 C2371191

Other specified sensations associated with hearing and vestibular function
type: Class
subclass of: Sensory function, Pain and Skin function (Body measurement)
comment: 1 MD05778 2 Other specified sensations associated with hearing and vestibular function 3 None 4 Other specified sensations associated with hearing and vestibular function 5 247331000 6 Ear sensations 7 Ear sensations (observable entity) 8 Sensations associated with hearing and vestibular function, other specified 9 C2370951

Other specified sensations associated with the digestive system
type: Class
subclass of: Digestive function (Body measurement)
comment: 1 MD05945 2 Other specified sensations associated with the digestive system 3 None 4 Other specified sensations associated with the digestive system 5 272144002 6 sensation 7 Sensation quality (qualifier value) 8 Sensations associated with the digestive system, other specified 9 C2371138

Other specified sensations related to muscles and movement functions
type: Class
subclass of: Musculoskeletal function (Symptom)
comment: 1 MD06100 2 Other specified sensations related to muscles and movement functions 3 None 4 Other specified sensations related to muscles and movement functions 5 277426005 6 Sensation of movement 7 Sensation of movement (finding) 8 Sensations related to muscles and movement functions 9 C2371259

Other specified sensory functions and pain
type: Class
subclass of: Sensory function, Pain and Skin function (Symptom)
comment: 1 MD05811 2 Other specified sensory functions and pain 3 None 4 Other specified sensory functions and pain 5 106148006 6 Sensory function 7 Sensory function (observable entity) 8 Sensory functions and pain, other specified 9 C2370975

Other specified sensory functions related to temperature and other stimuli
type: Class
subclass of: Sensory function, Pain and Skin function (Body measurement)
comment: 1 MD05790 2 Other specified sensory functions related to temperature and other stimuli 3 None 4 Other specified sensory functions related to temperature and other stimuli 5 106148006 6 Sensory function 7 Sensory function (observable entity) 8 Sensory functions related to temperature and other stimuli, other specified 9 C2370963

Other specified sexual functions
type: Class
subclass of: Urogenital function (Body measurement)
comment: 1 MD05997 2 Other specified sexual functions 3 None 4 Other specified sexual functions 5 76859005 6 Sexual function 7 Sexual function (observable entity) 8 Sexual functions, other specified 9 C2371175

Other specified skin and related structures
type: Class
subclass of: Sensory function, Pain and Skin function (Body region)
comment: 1 MD07130 2 Other specified skin and related structures 3 None 4 Other specified skin and related structures 5 39937001 6 Skin 7 Skin structure (body structure) 8 Structure of hair, other specified 9 C2371962

Other specified sleep functions
type: Class
subclass of: Nervous system and Mental function (Body measurement)
comment: 1 MD05643 2 Other specified sleep functions 3 None 4 Other specified sleep functions 5 258158006 6 Sleep, function 7 Sleep, function (observable entity) 8 Sleep functions, other specified 9 C2370872

Other specified solving problems
type: Class
subclass of: Health Related Factors
comment: 1 MD06190 2 Other specified solving problems 3 None 4 Other specified solving problems 5 365926000 6 Problem solving - finding 7 Finding of problem solving (finding) 8 Solving problems, other specified 9 C2371300

Other specified sound
type: Class
subclass of: Physical/Chemical Environment
comment: 1 MD06673 2 Other specified sound 3 None 4 Other specified sound 5 68325009 6 Sound 7 Sound, device (physical object) 8 Sound, other specified 9 C2371708

Other specified spinal cord and related structures
type: Class
subclass of: Nervous system and Mental function (Body region)
comment: 1 MD06849 2 Other specified spinal cord and related structures 3 None 4 Other specified spinal cord and related structures 5 2748008 6 spinal cord 7 Spinal cord structure (body structure) 8 Spinal cord and related structures, other specified 9 C2371855

Other specified spontaneous movements
type: Class
subclass of: Musculoskeletal function (Body measurement)
comment: 1 MD06087 2 Other specified spontaneous movements 3 None 4 Other specified spontaneous movements 5 255324009 6 Movement 7 Movement (observable entity) 8 Spontaneous movements 9 C2371948

Other specified stability of joint functions
type: Class
subclass of: Musculoskeletal function (Body measurement)
comment: 1 MD06034 2 Other specified stability of joint functions 3 None 4 Other specified stability of joint functions 5 366716005 6 Stability of joint 7 Stability of joint (finding) 8 Stability of joint functions, other specified 9 C2371206

Other specified structure of ankle and foot
type: Class
subclass of: Musculoskeletal function (Body region)
comment: 1 MD07078 2 Other specified structure of ankle and foot 3 None 4 Other specified structure of ankle and foot 5 410773000 6 Structure of ankle and/or foot 7 Structure of fascia of lower leg (body structure) 8 Structure of ankle and foot, other specified 9 C2371893

Other specified structure of areas of skin
type: Class
subclass of: Sensory function, Pain and Skin function (Body region)
comment: 1 MD07110 2 Other specified structure of areas of skin 3 None 4 Other specified structure of areas of skin 5 39937001 6 Skin structure 7 Skin structure (body structure) 8 Structure of areas of skin, other specified 9 C2371909

Other specified structure of brain
type: Class
subclass of: Nervous system and Mental function (Body region)
comment: 1 MD06838 2 Other specified structure of brain 3 None 4 Other specified structure of brain 5 12738006 6 brain 7 Brain structure (body structure) 8 Structure of brain, other specified 9 C2371850

Other specified structure of brain stem
type: Class
subclass of: Nervous system and Mental function (Body region)
comment: 1 MD06835 2 Other specified structure of brain stem 3 None 4 Other specified structure of brain stem 5 15926001 6 brain stem 7 Brainstem structure (body structure) 8 Structure of brain stem, other specified 9 C2371848

Other specified structure of cardiovascular system
type: Class
subclass of: Cardiovascular system function (Body region)
comment: 1 MD06931 2 Other specified structure of cardiovascular system 3 None 4 Other specified structure of cardiovascular system 5 113257007 6 cardiovascular system 7 Structure of cardiovascular system (body structure) 8 Structure of cardiovascular system, other specified 9 C2371026

Other specified structure of cortical lobes
type: Class
subclass of: Nervous system and Mental function (Body region)
comment: 1 MD06826 2 Other specified structure of cortical lobes 3 None 4 Other specified structure of cortical lobes 5 90597002 6 lobe of brain 7 Structure of lobe of brain (body structure) 8 Structure of cortical lobes, other specified 9 C2371843

Other specified structure of endocrine glands
type: Class
subclass of: Functions of Blood System, Metabolic system and Endocrine system (Body region)
comment: 1 MD06974 2 Other specified structure of endocrine glands 3 None 4 Other specified structure of endocrine glands 5 387910009 6 endocrine gland structure 7 Endocrine gland structure (body structure) 8 Structure of endocrine glands, other specified 9 C2371037

Other specified structure of eyeball
type: Class
subclass of: Sensory function, Pain and Skin function (Body region)
comment: 1 MD06864 2 Other specified structure of eyeball 3 None 4 Other specified structure of eyeball 5 81745001 6 eyeball 7 Structure of eye proper (body structure) 8 Structure of eyeball, other specified 9 C2371863

Other specified structure of forearm
type: Class
subclass of: Musculoskeletal function (Body region)
comment: 1 MD07040 2 Other specified structure of forearm 3 None 4 Other specified structure of forearm 5 14975008 6 Forearm 7 Forearm structure (body structure) 8 Structure of forearm, other specified 9 C2371072

Other specified structure of hair
type: Class
subclass of: Sensory function, Pain and Skin function (Body region)
comment: 1 MD07128 2 Other specified structure of hair 3 None 4 Other specified structure of hair 5 386045008 6 Hair 7 Hair structure (body structure) 8 Structure of hair, other specified 9 C2371962

Other specified structure of hand
type: Class
subclass of: Musculoskeletal function (Body region)
comment: 1 MD07047 2 Other specified structure of hand 3 None 4 Other specified structure of hand 5 85562004 6 Hand 7 Hand structure (body structure) 8 Hand 9 C0018563

Other specified structure of head and neck region
type: Class
subclass of: Musculoskeletal function (Body region)
comment: 1 MD07018 2 Other specified structure of head and neck region 3 None 4 Other specified structure of head and neck region 5 774007 6 Structure of head and/or neck 7 Structure of head and/or neck (body structure) 8 Structure of head and neck region, other specified 9 C2371061

Other specified structure of immune system
type: Class
subclass of: Immune system function (Body region)
comment: 1 MD06939 2 Other specified structure of immune system 3 None 4 Other specified structure of immune system 5 116003000 6 Immune system 7 Structure of immune system (body structure) 8 Structure of immune system, other specified 9 C2371028

Other specified structure of inner ear
type: Class
subclass of: Sensory function, Pain and Skin function (Body region)
comment: 1 MD06884 2 Other specified structure of inner ear 3 None 4 Other specified structure of inner ear 5 22945000 6 inner ear 7 Inner ear structure (body structure) 8 Structure of inner ear, other specified 9 C2371874

Other specified structure of intestine
type: Class
subclass of: Digestive function (Body region)
comment: 1 MD06964 2 Other specified structure of intestine 3 None 4 Other specified structure of intestine 5 113276009 6 intestine 7 Intestinal structure (body structure) 8 Structure of intestine, other specified 9 C2371035

Other specified structure of larynx
type: Class
subclass of: Respiratory function (Body region)
comment: 1 MD06918 2 Other specified structure of larynx 3 None 4 Other specified structure of larynx 5 4596009 6 larynx 7 Laryngeal structure (body structure) 8 Structure of larynx, other specified 9 C2371021

Other specified structure of lower extremity
type: Class
subclass of: Musculoskeletal function (Body region)
comment: Body region Musculoskeletal function None 1 MD07080 2 Other specified structure of lower extremity 3 None 4 Other specified structure of lower extremity 5 61685007 6 Lower extremity 7 Lower limb structure (body structure) 8 Structure of lower extremity, other specified 9 C2371894

Other specified structure of lower leg
type: Class
subclass of: Musculoskeletal function (Body region)
comment: 1 MD07071 2 Other specified structure of lower leg 3 None 4 Other specified structure of lower leg 5 30021000 6 Lower leg 7 Structure of lower extremity from knee to ankle (body structure) 8 Structure of lower leg, other specified 9 C2371888

Other specified structure of middle ear
type: Class
subclass of: Sensory function, Pain and Skin function (Body region)
comment: 1 MD06877 2 Other specified structure of middle ear 3 None 4 Other specified structure of middle ear 5 25342003 6 middle ear 7 Middle ear structure (body structure) 8 Structure of middle ear, other specified 9 C2371872

Other specified structure of mouth
type: Class
subclass of: Digestive function (Body region)
comment: 1 MD06909 2 Other specified structure of mouth 3 None 4 Other specified structure of mouth 5 123851003 6 mouth 7 Mouth region structure (body structure) 8 Structure of mouth, other specified 9 C2371880

Other specified structure of nails
type: Class
subclass of: Sensory function, Pain and Skin function (Body region)
comment: 1 MD07120 2 Other specified structure of nails 3 None 4 Other specified structure of nails 5 770803002 6 Entire nail unit 7 Entire nail unit (body structure) 8 Structure of nails, other specified 9 C2371914

Other specified structure of nose
type: Class
subclass of: Sensory function, Pain and Skin function (Body region)
comment: 1 MD06892 2 Other specified structure of nose 3 None 4 Other specified structure of nose 5 45206002 6 nose 7 Nasal structure (body structure) 8 Structure of nose, other specified 9 C2371879

Other specified structure of pelvic region
type: Class
subclass of: Musculoskeletal function (Body region)
comment: 1 MD07056 2 Other specified structure of pelvic region 3 None 4 Other specified structure of pelvic region 5 12921003 6 Pelvic region 7 Structure of pelvis (body structure) 8 Structure of pelvic region, other specified 9 C2371082

Other specified structure of pharynx
type: Class
subclass of: Respiratory function (Body region)
comment: 1 MD06914 2 Other specified structure of pharynx 3 None 4 Other specified structure of pharynx 5 54066008 6 pharynx 7 Pharyngeal structure (body structure) 8 Structure of pharynx, other specified 9 C2371020

Other specified structure of respiratory system
type: Class
subclass of: Respiratory function (Body region)
comment: 1 MD06954 2 Other specified structure of respiratory system 3 None 4 Other specified structure of respiratory system 5 20139000 6 respiratory system 7 Structure of respiratory system (body structure) 8 Structure of respiratory system, other specified 9 C2371031

Other specified structure of shoulder region
type: Class
subclass of: Musculoskeletal function (Body region)
comment: 1 MD07025 2 Other specified structure of shoulder region 3 None 4 Other specified structure of shoulder region 5 16982005 6 Shoulder region 7 Shoulder region structure (body structure) 8 Structure of shoulder region, other specified 9 C2371066

Other specified structure of skin glands
type: Class
subclass of: Sensory function, Pain and Skin function (Body region)
comment: 1 MD07115 2 Other specified structure of skin glands 3 None 4 Other specified structure of skin glands 5 732104009 6 Entire skin gland 7 Entire skin gland (body structure) 8 Structure of skin glands, other specified 9 C2371912

Other specified structure of spinal cord
type: Class
subclass of: Nervous system and Mental function (Body region)
comment: 1 MD06846 2 Other specified structure of spinal cord 3 None 4 Other specified structure of spinal cord 5 2748008 6 spinal cord 7 Spinal cord structure (body structure) 8 Structure of spinal cord, other specified 9 C2371853

Other specified structure of thigh
type: Class
subclass of: Musculoskeletal function (Body region)
comment: 1 MD07064 2 Other specified structure of thigh 3 None 4 Other specified structure of thigh 5 68367000 6 Thigh 7 Thigh structure (body structure) 8 Structure of thigh, other specified 9 C2371884

Other specified structure of trunk
type: Class
subclass of: Musculoskeletal function (Body region)
comment: 1 MD07092 2 Other specified structure of trunk 3 None 4 Other specified structure of trunk 5 22943007 6 Trunk 7 Trunk structure (body structure) 8 Structure of trunk, other specified 9 C2371897

Other specified structure of upper arm
type: Class
subclass of: Musculoskeletal function (Body region)
comment: Body region Musculoskeletal function None 1 MD07033 2 Other specified structure of upper arm 3 None 4 Other specified structure of upper arm 5 40983000 6 Upper arm 7 Structure of upper extremity between shoulder and elbow (body structure) 8 Structure of upper arm, other specified 9 C2371070

Other specified structure of upper extremity
type: Class
subclass of: Musculoskeletal function (Body region)
comment: 1 MD07049 2 Other specified structure of upper extremity 3 None 4 Other specified structure of upper extremity 5 53120007 6 Upper extremity 7 Upper limb structure (body structure) 8 Structure of upper extremity, other specified 9 C2371076

Other specified structure of urinary system
type: Class
subclass of: Urogenital function (Body region)
comment: 1 MD06983 2 Other specified structure of urinary system 3 None 4 Other specified structure of urinary system 5 122489005 6 Urinary system 7 Urinary system structure (body structure) 8 Structure of urinary system, other specified 9 C2371041

Other specified structure of uterus
type: Class
subclass of: Urogenital function (Body region)
comment: 1 MD06992 2 Other specified structure of uterus 3 None 4 Other specified structure of uterus 5 35039007 6 Uterus 7 Uterine structure (body structure) 8 Structure of uterus, other specified 9 C2371045

Other specified structure of vertebral column
type: Class
subclass of: Musculoskeletal function (Body region)
comment: 1 MD07089 2 Other specified structure of vertebral column 3 None 4 Other specified structure of vertebral column 5 421060004 6 Structure of vertebral column 7 Structure of vertebral column (body structure) 8 Structure of lower extremity, other specified 9 C2371894

Other specified structures around eye
type: Class
subclass of: Sensory function, Pain and Skin function (Body region)
comment: 1 MD06870 2 Other specified structures around eye 3 None 4 Other specified structures around eye 5 81745001 6 eye structure 7 Structure of eye proper (body structure) 8 Structures around eye, other specified 9 C2371868

Other specified structures involved in voice and speech
type: Class
subclass of: Voice and Speaking (Body region)
comment: 1 MD06920 2 Other specified structures involved in voice and speech 3 None 4 Other specified structures involved in voice and speech 5 38866009 6 Body part structure 7 Body part structure (body structure) 8 Structures involved in voice and speech, other specified 9 C2371022

Other specified structures related to movement
type: Class
subclass of: Musculoskeletal function (Body region)
comment: 1 MD07101 2 Other specified structures related to movement 3 None 4 Other specified structures related to movement 5 272673000 6 Body structure 7 Bone structure (body structure) 8 Structures related to movement, other specified 9 C2371902

Other specified structures related to the genitourinary and reproductive systems
type: Class
subclass of: Urogenital function (Body region)
comment: 1 MD07009 2 Other specified structures related to the genitourinary and reproductive systems 3 None 4 Other specified structures related to the genitourinary and reproductive systems 5 21514008 6 Genitourinary system 7 Structure of genitourinary system (body structure) 8 Structures related to the genitourinary and reproductive systems, other specified 9 C2371053
comment: 1 MD07009-1 2 Other specified structures related to the genitourinary and reproductive systems 3 None 4 Other specified structures related to the genitourinary and reproductive systems 5 278875001 6 Entire reproductive system 7 Entire reproductive system (body structure) 8 Structures related to the genitourinary and reproductive systems, other specified 9 C2371053

Other specified support and relationships
type: Class
subclass of: Characteristics of the community
comment: 1 MD06694 2 Other specified support and relationships 3 None 4 Other specified support and relationships 5 272151006 6 Relationships 7 Relationships (qualifier value) 8 Support and relationships, other specified 9 C2371724

Other specified swallowing
type: Class
subclass of: Digestive function (Body measurement)
comment: 1 MD05917 2 Other specified swallowing 3 None 4 Other specified swallowing 5 54731003 6 Swallowing 7 Deglutition (observable entity) 8 Swallowing, other specified 9 C2371118

Other specified teeth
type: Class
subclass of: Digestive function (Body region)
comment: 1 MD06898 2 Other specified teeth 3 None 4 Other specified teeth 5 245543004 6 Teeth 7 Structure of dentition (body structure) 8 Teeth, other specified 9 C2371956

Other specified temperament and personality functions
type: Class
subclass of: Nervous system and Mental function (Body measurement)
comment: 1 MD05627 2 Other specified temperament and personality functions 3 None 4 Other specified temperament and personality functions 5 71565002 6 Personality, function 7 Personality, function (observable entity) 8 Temperament and personality functions, other specified 9 C2370865

Other specified thermoregulatory functions
type: Class
subclass of: Functions of Blood System, Metabolic system and Endocrine system (Body measurement)
comment: 1 MD05967 2 Other specified thermoregulatory functions 3 None 4 Other specified thermoregulatory functions 5 386726008 6 Thermoregulation, function 7 Thermoregulation, function (observable entity) 8 Thermoregulatory functions, other specified 9 C2371152

Other specified thought functions
type: Class
subclass of: Nervous system and Mental function (Body measurement)
comment: 1 MD05685 2 Other specified thought functions 3 None 4 Other specified thought functions 5 88952004 6 Thinking, function 7 Thinking, function (observable entity) 8 Thought functions, other specified 9 C2370890

Other specified time-related changes
type: Class
subclass of: Time
comment: 1 MD06668 2 Other specified time-related changes 3 None 4 Other specified time-related changes 5 263703002 6 Changed 7 Changed status (qualifier value) 8 Time-related changes, unspecified 9 C2371705

Other specified toileting
type: Class
subclass of: Health Related Factors
comment: 1 MD06391 2 Other specified toileting 3 None 4 Other specified toileting 5 129004006 6 Toileting 7 Toileting (observable entity) 8 oileting, other specified 9 C2371467

Other specified transferring oneself
type: Class
subclass of: Health Related Factors
comment: 1 MD06298 2 Other specified transferring oneself 3 None 4 Other specified transferring oneself 5 29005007 6 Transferring 7 Transferring (observable entity) 8 Transferring oneself, other specified 9 C2371392

Other specified undertaking multiple tasks
type: Class
subclass of: Health Related Factors
comment: 1 MD06208 2 Other specified undertaking multiple tasks 3 None 4 Other specified undertaking multiple tasks 5 844005 6 Behavior finding 7 Behavior finding (finding) 8 Undertaking multiple tasks, other specified 9 C2371318

Other specified urinary excretory functions
type: Class
subclass of: Urogenital function (Body measurement)
comment: 1 MD05982 2 Other specified urinary excretory functions 3 None 4 Other specified urinary excretory functions 5 63911002 6 Excretory function 7 Excretory function (observable entity) 8 Urinary excretory functions, other specified 9 C2371163

Other specified urination functions
type: Class
subclass of: Urogenital function (Body measurement)
comment: 1 MD05988 2 Other specified urination functions 3 None 4 Other specified urination functions 5 102834005 6 normal urination 7 Normal micturition (finding) 8 Urination functions, other specified 9 C2371166

Other specified using communication devices and techniques
type: Class
subclass of: Health Related Factors
comment: 1 MD06270 2 Other specified using communication devices and techniques 3 None 4 Other specified using communication devices and techniques 5 719369003 6 Uses communication device 7 Does use communication device (finding)| 8 Using communication devices and techniques, other specified 9 C2371372

Other specified using transportation
type: Class
subclass of: Health Related Factors
comment: 1 MD06359 2 Other specified using transportation 3 None 4 Other specified using transportation 5 1137434003 6 Has access to transportation 7 Has access to transportation (finding) 8 Using transportation, other specified 9 C2371441

Other specified vestibular functions
type: Class
subclass of: Sensory function, Pain and Skin function (Body measurement)
comment: 1 MD05769 2 Other specified vestibular functions 3 None 4 Other specified vestibular functions 5 49441007 6 Vestibular nerve function 7 Vestibular nerve function (observable entity) 8 Vestibular functions, other specified 9 C2370945

Other specified visual acuity functions
type: Class
subclass of: Sensory function, Pain and Skin function (Body measurement)
comment: 1 MD05736 2 Other specified visual acuity functions 3 None 4 Other specified visual acuity functions 5 281004000 6 Visual function 7 Visual function (observable entity) 8 Visual acuity functions, other specified 9 C2370926

Other specified voice and speech functions
type: Class
subclass of: Voice and Speaking (Body measurement)
comment: 1 MD05831 2 Other specified voice and speech functions 3 None 4 Other specified voice and speech functions 5 285567008 6 ability to perform function for speech 7 Ability to perform functions for speech (observable entity) 8 Voice and speech functions, other specified 9 C2370991

Other specified voice functions
type: Class
subclass of: Voice and Speaking (Body measurement)
comment: 1 MD05816 2 Other specified voice functions 3 None 4 Other specified voice functions 5 415825004 6 Vocal function 7 Vocal function (observable entity) 8 Voice functions, other specified 9 C2370979

Other specified washing oneself
type: Class
subclass of: Health Related Factors
comment: 1 MD06375 2 Other specified washing oneself 3 None 4 Other specified washing oneself 5 286852005 6 Washing self 7 Washing self, function (observable entity) 8 Washing oneself, other specified 9 C2371457

Other specified writing
type: Class
subclass of: Health Related Factors
comment: 1 MD06180 2 Other specified writing 3 None 4 Other specified writing 5 12261009 6 Writing 7 Writing (observable entity) 8 Writing, other specified 9 C2372017

Other than Korean traditional medicine
type: Class
subclass of: Classification of Hospital
comment: 1 MD00117 2 Other than Korean traditional medicine 3 None 4 Other than Korean traditional medicine 5 773412008 6 Traditional medicine 7 Traditional medicine (regime/therapy) 8 Medicine, Korean Traditional 9 C2350504

Otolaryngology and Throat Dermatology of Korean Medicine
type: Class
subclass of: Classification of Hospital
comment: 1 MD00671 2 Otolaryngology and Throat Dermatology of Korean Medicine 3 None 4 Otolaryngology and Throat Dermatology of Korean Medicine 5 418960008 6 Otolaryngology 7 Otolaryngology (qualifier value) 8 Medicine, Korean Traditional 9 C2350504

Otologic fee
type: Class
subclass of: Hospital Administration
comment: 1 MD00150 2 Otologic fee 3 None 4 Otologic fee 5 308590000 6 Payment for service procedure 7 Payment for service procedure (procedure) 8 Fees, Medical 9 C0015754

Otorhinolaryngology
type: Class
subclass of: Classification of Hospital
comment: 1 MD00642 2 Otorhinolaryngology 3 None 4 Otorhinolaryngology 5 309978002 6 Otorhinolaryngology department 7 Ear, nose and throat department (environment) 8 Otorhinolaryngology clinic 9 C1552775

Ounce
type: Class
subclass of: Units
comment: 1 M03757 2 Ounce 3 ounces oz oz (avdp) 4 Ounce 5 258692008 6 ounce 7 ounces (qualifier value) 8 ounce 9 C0439218
alternative label: oz
alternative label: oz (avdp)
alternative label: ounces

Out of bed
type: Class
subclass of: Individual Related Factors
comment: 1 MD01152 2 Out of bed 3 None 4 Out of bed 5 301675000 6 Able to get off a bed 7 Able to get off a bed (finding) 8 Stay out of bed 9 C2987219

Out patient department
type: Class
subclass of: Classification of Hospital
comment: 1 MD00603 2 Out patient department 3 None 4 Out patient department 5 33022008 6 OPD - Outpatients department 7 Hospital-based outpatient department (environment) 8 hospital services outpatient department 9 C3694483

Outdoor air quality
type: Class
subclass of: Physical/Chemical Environment
comment: 1 MD06678 2 Outdoor air quality 3 None 4 Outdoor air quality 5 263496004 6 Quality 7 Quality (attribute) 8 Outdoor air quality 9 C2371711

Outdoor running
type: Class
subclass of: Aerobic Exercise
comment: 1 MD01804 2 Outdoor running 3 None 4 Outdoor running 5 1153622008 6 Running 7 Running (observable entity) 8 Outdoor activity 9 C4283770

Outpatient
type: Class
subclass of: Hospital Administration
comment: 1 MD00120 2 Outpatient 3 None 4 Outpatient 5 373864002 6 Outpatient 7 Outpatient (person) 8 Outpatient 9 C0029921

Ovaries
type: Class
subclass of: Urogenital function (Body region)
comment: 1 MD06987 2 Ovaries 3 None 4 Ovaries 5 83238006 6 Both ovaries 7 Both ovaries (body structure) 8 Ovaries 9 C0029939

Over the past month
type: Class
subclass of: Month
comment: 1 MD02168 2 Over the past month 3 None 4 Over the past month 5 258706009 6 month 7 month (qualifier value) 8 month 9 C0439231

Overall
type: Class
subclass of: Units
comment: 1 MD02238 2 Overall 3 None 4 Overall 5 255503000 6 Entire 7 Entire (qualifier value) 8 Overall 9 C1561607

Overall results
type: Class
subclass of: Questionnaire
comment: 1 MD05160 2 Overall results 3 None 4 Overall results 5 394617004 6 Result 7 Result (navigational concept) 8 Result 9 C1274040

Overbreathing
type: Class
subclass of: Respiratory function (Symptom)
comment: 1 M01178 2 Overbreathing 3 None 4 Overbreathing 5 68978004 6 Overbreathing 7 Hyperventilation (finding) 8 Hyperventilation 9 C0020578

Oversleeps
type: Class
subclass of: Nervous system and Mental function (Symptom)
comment: 1 M00035 2 Oversleeps 3 oversleep, oversleeping 4 Oversleeps 5 248261008 6 Oversleeps 7 Oversleeps (disorder) 8 Oversleeps 9 C0424572
alternative label: oversleeping
alternative label: oversleep

Overweight
type: Class
subclass of: Hospital information, examination/diagnosis/treatment data
comment: 1 M05817 2 Overweight 3 None 4 Overweight 5 238131007 6 Overweight 7 Overweight (finding) 8 Overweight 9 C0497406

Oxygen-carrying functions of the blood
type: Class
subclass of: Functions of Blood System, Metabolic system and Endocrine system (Body measurement)
comment: 1 MD05855 2 Oxygen-carrying functions of the blood 3 None 4 Oxygen-carrying functions of the blood 5 86084001 6 haematologic function 7 Hematologic function (observable entity) 8 Oxygen-carrying functions of the blood 9 C2371085

http://www.semanticweb.org/user/ontologies/2023/10/untitled-ontology-5#P
type: Class
subclass of: Units
comment: 1 M04314 2 P 3 None 4 P 5 58900009 6 P 7 Properdin (substance) 8 P 9 C0033452
comment: 1 M04314-1 2 P 3 None 4 P 5 58900009 6 P 7 Properdin (substance) 8 P 9 C0439115
comment: 1 M04314-10 2 P 3 None 4 P 5 421824005 6 p 7 Tumor staging descriptor p (tumor staging) 8 p 9 C0439140
comment: 1 M04314-11 2 P 3 None 4 P 5 421824005 6 p 7 Tumor staging descriptor p (tumor staging) 8 p 9 C1704238
comment: 1 M04314-12 2 P 3 None 4 P 5 421542006 6 p 7 Lower case Roman letter p (qualifier value) 8 P 9 C0033452
comment: 1 M04314-13 2 P 3 None 4 P 5 421542006 6 p 7 Lower case Roman letter p (qualifier value) 8 P 9 C0439115
comment: 1 M04314-14 2 P 3 None 4 P 5 421542006 6 p 7 Lower case Roman letter p (qualifier value) 8 p 9 C0439140
comment: 1 M04314-15 2 P 3 None 4 P 5 421542006 6 p 7 Lower case Roman letter p (qualifier value) 8 p 9 C1704238
comment: 1 M04314-2 2 P 3 None 4 P 5 58900009 6 P 7 Properdin (substance) 8 p 9 C0439140
comment: 1 M04314-3 2 P 3 None 4 P 5 58900009 6 P 7 Properdin (substance) 8 p 9 C1704238
comment: 1 M04314-4 2 P 3 None 4 P 5 257972000 6 P 7 Upper case Roman letter P (qualifier value) 8 P 9 C0033452
comment: 1 M04314-5 2 P 3 None 4 P 5 257972000 6 P 7 Upper case Roman letter P (qualifier value) 8 P 9 C0439115
comment: 1 M04314-6 2 P 3 None 4 P 5 257972000 6 P 7 Upper case Roman letter P (qualifier value) 8 p 9 C0439140
comment: 1 M04314-7 2 P 3 None 4 P 5 257972000 6 P 7 Upper case Roman letter P (qualifier value) 8 p 9 C1704238
comment: 1 M04314-8 2 P 3 None 4 P 5 421824005 6 p 7 Tumor staging descriptor p (tumor staging) 8 P 9 C0033452
comment: 1 M04314-9 2 P 3 None 4 P 5 421824005 6 p 7 Tumor staging descriptor p (tumor staging) 8 P 9 C0439115

P90X exercises
type: Class
subclass of: Sport
comment: 1 MD01035 2 P90X exercises 3 None 4 P90X exercises 5 256235009 6 exercise 7 Exercise (observable entity) 8 exercise 9 C0015259

PAINFUL ERECTIONS SLEEP RELAT
type: Class
subclass of: Urogenital function (Symptom)
comment: 1 M02207 2 PAINFUL ERECTIONS SLEEP RELAT 3 None 4 PAINFUL ERECTIONS SLEEP RELAT 5 230498005 6 Sleep-related painful erections 7 Sleep-related painful erections (disorder) 8 Sleep-related painful erections 9 C0393776

PAIN PHARYNX
type: Class
subclass of: Respiratory function (Symptom)
comment: 1 M02006 2 PAIN PHARYNX 3 Pain in the pharynx 4 PAIN PHARYNX 5 125591009 6 injury of pharynx 7 Injury of pharynx (disorder) 8 Injury of pharynx 9 C0347589
alternative label: Pain in the pharynx

PAR-Q
type: Class
subclass of: Tool
comment: 1 MD03255 2 PAR-Q 3 Health assessment questionnaire (assessment scale) 4 PAR-Q 5 273510007 6 Health assessment questionnaire 7 Health assessment questionnaire (assessment scale) 8 Health assessment questionnaire 9 C0451208
comment: 1 MD03681 2 PAR-Q 3 Health assessment questionnaire (assessment scale) 4 PAR-Q 5 273249006 6 Assessment scales 7 Assessment scales (assessment scale) 8 Assessment scales 9 C0450973

PC
type: Class
subclass of: Device
comment: 1 MD05410 2 PC 3 None 4 PC 5 706692004 6 Computer 7 Computer (physical object) 8 Personal computers 9 C0162419

PCI
type: Class
subclass of: Hospital information, examination/diagnosis/treatment data
comment: 1 MD03115 2 PCI 3 None 4 PCI 5 415070008 6 Percutaneous coronary intervention 7 Percutaneous coronary intervention (procedure) 8 Percutaneous coronary intervention 9 C1532338

PET diagnosis
type: Class
subclass of: Hospital information, examination/diagnosis/treatment data
comment: 1 MD00210 2 PET diagnosis 3 None 4 PET diagnosis 5 363678002 6 PET imaging 7 Positron emission tomographic imaging - action (qualifier value) 8 Positron emission tomography (PET) imaging; whole body 9 C1504148

PIP
type: Class
subclass of: Musculoskeletal function (Body region)
comment: 1 MD04043 2 PIP 3 None 4 PIP 5 732165008 6 Entire interphalangeal joint 7 Entire interphalangeal joint (body structure) 8 Entire interphalangeal joint 9 C4517060

PIP flexion
type: Class
subclass of: Musculoskeletal function (Body measurement)
comment: 1 MD04042 2 PIP flexion 3 None 4 PIP flexion 5 299063008 6 Range of finger flexion 7 Range of finger flexion (observable entity) 8 Range of finger flexion 9 C0575831

PLAN
type: Class
subclass of: Hospital information, examination/diagnosis/treatment data
comment: 1 MD01994 2 PLAN 3 None 4 PLAN 5 397943006 6 Planned 7 Planned (qualifier value) 8 Planned 9 C1301732

PREACHER CUAL
type: Class
subclass of: Aerobic Exercise
comment: 1 MD02000 2 PREACHER CUAL 3 None 4 PREACHER CUAL 5 183301007 6 Physical exercises 7 Physical exercises (regime/therapy) 8 Physical therapy exercises 9 C0452242

PRESS
type: Class
subclass of: Health Related Factors
comment: 1 MD02007 2 PRESS 3 None 4 PRESS 5 303365000 6 Pushes 7 Does push (finding) 8 Does push (finding) 9 C0580841

PSYCHOTHER
type: Class
subclass of: Nervous system and Mental function (Therapy)
comment: 1 M01297 2 PSYCHOTHER 3 None 4 PSYCHOTHER 5 75516001 6 Psychotherapy 7 Psychotherapy (regime/therapy) 8 Psychotherapy 9 C0033968

PULSE
type: Class
subclass of: Cardiovascular system function (Body measurement)
comment: 1 M01899 2 PULSE 3 None 4 PULSE 5 8499008 6 Pulse 7 Pulse, function (observable entity) 8 Pulse 9 C0391850

Pace of thought
type: Class
subclass of: Nervous system and Mental function (Body measurement)
comment: 1 MD05681 2 Pace of thought 3 None 4 Pace of thought 5 88952004 6 Thinking, function 7 Thinking, function (observable entity) 8 Pace of thought 9 C2370889

Pack Dosing Unit
type: Class
subclass of: Units
comment: 1 M05264 2 Pack Dosing Unit 3 Pack 4 Pack Dosing Unit 5 257260001 6 Pack 7 Pack (physical object) 8 Pack 9 C1968514
alternative label: Pack

Pack Year
type: Class
subclass of: Units
comment: 1 M03312 2 Pack Year 3 Pack years 4 Pack Year 5 315609007 6 Pack years 7 Pack years (assessment scale) 8 Pack years (assessment scale) 9 C1277691
alternative label: Pack years

Package Dosing Unit
type: Class
subclass of: Units
comment: 1 M05263 2 Package Dosing Unit 3 PKG Package 4 Package Dosing Unit 5 1681000175101 6 Package 7 Package - unit of product usage (qualifier value) 8 Package Dosing Unit 9 C1704710
alternative label: Package
alternative label: PKG

Packet
type: Class
subclass of: Units
comment: 1 M05202 2 Packet Dosing Unit 3 Packet - unit of product usage Packet - Unit dose packets 4 Packet 5 419888008 6 Packet 7 Packet - unit of product usage (qualifier value) 8 Packet 9 C1641805

Packet - Unit dose
type: Class
subclass of: Units
comment: 1 M05201 2 Packet Dosing Unit 3 Packet - unit of product usage Packet packets 4 Packet - Unit dos 5 419888007 6 Packet 7 Packet - unit of product usage (qualifier value) 8 Packet 9 C1641804

Packet - unit of product usage
type: Class
subclass of: Units
comment: 1 M05200 2 Packet Dosing Unit 3 Packet - Unit dose Packet packets 4 Packet - unit of product usage 5 419888008 6 Packet - unit of product usage 7 Packet - unit of product usage (qualifier value) 8 Packet - unit of product usage 9 C1641805

Packet Dosing Unit
type: Class
subclass of: Units
comment: 1 M05199 2 Packet Dosing Unit 3 Packet - unit of product usage Packet - Unit dose Packet packets 4Packet Dosing Unit 5 419888008 6 Packet 7 Packet - unit of product usage (qualifier value) 8 Packet 9 C1641805

Pad - unit of product usage
type: Class
subclass of: Units
comment: 1 M05330 2 Pad - unit of product usage 3 Pad pads 4 Pad - unit of product usage 5 421823004 6 Pad - unit of product usage 7 Pad - unit of product usage (qualifier value) 8 Pad - unit of product usage 9 C1882271
alternative label: Pad
alternative label: pads

Pain Scale
type: Class
subclass of: Tool
comment: 1 MD03261 2 Pain Scale 3 None 4 Pain Scale 5 425401001 6 Pain intensity rating scale 7 Pain intensity rating scale (assessment scale) 8 pain scale 9 C1504479
comment: 1 MD03687 2 Pain Scale 3 None 4 Pain Scale 5 763306003 6 Abbey Pain Scale 7 Abbey Pain Scale (assessment scale) 8 Abbey Pain Scale 9 C4706384

Pain emptying bladder
type: Class
subclass of: Urogenital function (Symptom)
comment: 1 M00912 2 Pain emptying bladder 3 Pain on voiding Pain passing urine Dysuria VOIDING PAIN 4 Pain emptying bladder 5 49650001 6 Pain emptying bladder 7 Dysuria (finding) 8 Dysuria 9 C0013428
alternative label: Dysuria
alternative label: Pain passing urine
alternative label: VOIDING PAIN
alternative label: Pain on voiding

Pain in body part
type: Class
subclass of: Sensory function, Pain and Skin function (Symptom)
comment: 1 MD05795 2 Pain in body part 3 None 4 Pain in body part 5 279001004 6 Pain of body region 7 Pain finding at anatomical site (finding) 8 Pain in body part 9 C2370966

Pain in head and neck
type: Class
subclass of: Sensory function, Pain and Skin function (Symptom)
comment: 1 MD05796 2 Pain in head and neck 3 None 4 Pain in head and neck 5 301365009 6 Pain of head and neck region 7 Pain of head and neck region (finding) 8 Pain in head and neck 9 C2370967

Pain in joints
type: Class
subclass of: Sensory function, Pain and Skin function (Symptom)
comment: 1 MD05804 2 Pain in joints 3 None 4 Pain in joints 5 57676002 6 Joint pain 7 Joint pain (finding) 8 Pain in joints 9 C0003862

Pain in multiple body parts
type: Class
subclass of: Sensory function, Pain and Skin function (Symptom)
comment: 1 MD05807 2 Pain in multiple body parts 3 None 4 Pain in multiple body parts 5 279001004 6 Pain of body region 7 Pain finding at anatomical site (finding) 8 Pain in multiple body parts 9 C2370971

Pain in stomach or abdomen
type: Class
subclass of: Sensory function, Pain and Skin function (Symptom)
comment: 1 MD05800 2 Pain in stomach or abdomen 3 None 4 Pain in stomach or abdomen 5 21522001 6 Abdominal pain 7 Abdominal pain (finding) 8 Pain in stomach or abdomen 9 C2370968

Pain in upper limb
type: Class
subclass of: Sensory function, Pain and Skin function (Symptom)
comment: 1 MD05802 2 Pain in upper limb 3 None 4 Pain in upper limb 5 102556003 6 Pain in upper limb 7 Pain in upper limb (finding) 8 Pain in upper limb 9 C0239377
comment: 1 MD05803 2 Pain in lower limb 3 None 4 Pain in lower limb 5 10601006 6 Pain in lower limb 7 Pain in lower limb (finding) 8 Pain in lower limb 9 C0023222

Pain on micturition
type: Class
subclass of: Urogenital function (Symptom)
comment: 1 M00913 2 Pain on micturition 3 MICTURITION PAINFUL Painful micturition 4 Pain on micturition 5 49650001 6 Pain on micturition 7 Dysuria (finding) 8 Dysuria 9 C0013428
alternative label: Painful micturition
alternative label: MICTURITION PAINFUL

Pain passing water
type: Class
subclass of: Urogenital function (Symptom)
comment: 1 M00916 2 Pain passing water 3 Passing water hurts 4 Pain passing water 5 49650001 6 Pain passing water 7 Dysuria (finding) 8 Dysuria 9 C0013428
alternative label: Passing water hurts

Painful respiratory movement
type: Class
subclass of: Respiratory function (Symptom)
comment: 1 M02255 2 Painful respiratory movement 3 None 4 Painful respiratory movement 5 75483001 6 Painful respiration 7 Breathing painful (finding) 8 Chest pain on breathing 9 C0423729

Palatal exercises
type: Class
subclass of: Active exercise
comment: 1 M00286 2 Palatal exercises 3 Palate exercises 4 Palatal exercises 5 311717000 6 Palatal exercises 7 Palatal exercises (regime/therapy) 8 Palatal exercises 9 C0589314
alternative label: Palate exercises

Pale complexion
type: Class
subclass of: Sensory function, Pain and Skin function (Symptom)
comment: 1 M01268 2 Pale complexion 3 None 4 Pale complexion 5 398979000 6 Pale complexion 7 Pale complexion (finding) 8 Pale complexion 9 C0030232

Palmar
type: Class
subclass of: Musculoskeletal function (Body region)
comment: 1 MD04006 2 Palmar 3 Palmar region, Palmar Region 4 Palmar 5 781000124109 6 Palmar 7 Palmar (qualifier value) 8 Palmar 9 C1184147
alternative label: Palmar region
alternative label: Palmar Region

Palmar abduction
type: Class
subclass of: Health Related Factors
subclass of: Musculoskeletal function (Body measurement)
comment: Body measurement Musculoskeletal function None 1 MD04007 2 Palmar abduction 3 None 4 Palmar abduction 5 60074003 6 Abduction 7 Abduction, function (observable entity) 8 Abduction 9 C0231456
comment: Lifelog Health Related Factors None 1 MD04034 2 Palmar abduction 3 None 4 Palmar abduction 5 60074003 6 Abduction 7 Abduction, function (observable entity) 8 Abduction 9 C0231456

Palsy
type: Class
subclass of: Musculoskeletal function (Symptom)
comment: 1 M02585 2 Palsy 3 palsies palsied 4 Palsy 5 44695005 6 Palsy 7 Paralysis (finding) 8 Paralysed 9 C0522224
alternative label: palsies
alternative label: palsied

Pancreatic transplant
type: Class
subclass of: Digestive function (Therapy)
comment: 1 MD00264 2 Pancreatic transplant 3 None 4 Pancreatic transplant 5 62438007 6 Pancreatic transplant 7 Transplantation of pancreas (procedure) 8 Pancreas Transplantation 9 C0030275

Panthera
type: Class
subclass of: Equipment
comment: 1 MD01934 2 Panthera 3 None 4 Panthera 5 49062001 6 Device 7 Device (physical object) 8 Devices 9 C0699733

Para-cycling
type: Class
subclass of: Sport
comment: 1 M05867 2 Para-cycling 3 None 4 Para-cycling 5 300648001 6 Rides a bicycle 7 Does ride a bicycle (finding) 8 Bicycling (recreational activity) 9 C0005377

Paraaortic
type: Class
subclass of: Cardiovascular system function (Body region)
comment: 1 M01962 2 Paraaortic 3 Paraaortic Region 4 Paraaortic 5 90769006 6 paraaortic body 7 Structure of paraaortic body (body structure) 8 Para-aortic region 9 C0456269
alternative label: Paraaortic Region

Paradoxical Sleep
type: Class
subclass of: Individual Related Factors
comment: 1 M01387 2 Paradoxical Sleep 3 None 4 Paradoxical Sleep 5 89129007 6 Paradoxical sleep 7 Rapid eye movement sleep, function (observable entity) 8 Sleep, REM 9 C0037322

Paragliding
type: Class
subclass of: Sport
comment: 1 MD01036 2 Paragliding 3 None 4 Paragliding 5 102395001 6 Paragliding 7 Paragliding (qualifier value) 8 Paragliding 9 C0522722

Paralympic cycling
type: Class
subclass of: Sport
comment: 1 M05868 2 Paralympic cycling 3 None 4 Paralympic cycling 5 300648001 6 Rides a bicycle 7 Does ride a bicycle (finding) 8 Bicycling (recreational activity) 9 C0005377

Paralysis
type: Class
subclass of: Nervous system and Mental function (Symptom)
comment: 1 M00513 2 Paralysis 3 paralyse, Paralysed, Paralyses 4 Paralysis 5 44695005 6 Paralysis 7 Paralysis (finding) 8 Paralysis 9 C0522224
alternative label: paralyse
alternative label: Paralysed
alternative label: Paralyses

Parent
type: Class
subclass of: Units
comment: 1 MD02430 2 Parent 3 None 4 Parent 5 40683002 6 Parent 7 Parent (person) 8 Parent 9 C0030551

Parent infus nutrit sub
type: Class
subclass of: Nutritional status
comment: 1 M01276 2 Parent infus nutrit sub 3 None 4 Parent infus nutrit sub 5 25156005 6 Parenteral nutrition 7 Intravenous feeding of patient (regime/therapy) 8 Parenteral Nutrition, Total 9 C0030548

Parenteral Hyperalimentation
type: Class
subclass of: Nutritional status
comment: 1 M01278 2 Parenteral Hyperalimentation 3 None 4 Parenteral Hyperalimentation 5 225372007 6 Parenteral hyperalimentation 7 Total parenteral nutrition (regime/therapy) 8 Parenteral hyperalimentation 9 C0030548

Parenteral infusion of concentrated nutritional substances
type: Class
subclass of: Nutritional status
comment: 1 M01279 2 Parenteral infusion of concentrated nutritional substances 3 None 4 Parenteral infusion of concentrated nutritional substances 5 25156005 6 Parenteral nutrition 7 Intravenous feeding of patient (regime/therapy) 8 Parenteral Nutrition, Total 9 C0030548

Paroxysmal nocturnal hemoglobinuria
type: Class
subclass of: Hospital information, examination/diagnosis/treatment data
comment: 1 MD00450 2 Paroxysmal nocturnal hemoglobinuria 3 None 4 Paroxysmal nocturnal hemoglobinuria 5 1963002 6 Paroxysmal nocturnal hemoglobinuria 7 Paroxysmal nocturnal hemoglobinuria (disorder) 8 Paroxysmal nocturnal hemoglobinuria 9 C0024790

Parrot atrophy of the newborn
type: Class
subclass of: Nervous system and Mental function (Symptom)
comment: 1 M01689 2 Parrot atrophy of the newborn 3 None 4 Parrot atrophy of the newborn 5 29740003 6 Parrot atrophy of the newborn 7 Nutritional marasmus (disorder) 8 Parrot atrophy of the newborn 9 C0086588

Pars corporis
type: Class
subclass of: Sensory function, Pain and Skin function (Body region)
comment: 1 M01804 2 Pars corporis 3 None 4 Pars corporis 5 38866009 6 Body part 7 Body part structure (body structure) 8 Body part 9 C0229962

Part-time employment
type: Class
subclass of: Individual Related Factors
comment: 1 MD06527 2 Part-time employment 3 None 4 Part-time employment 5 160904001 6 Part-time employment 7 Part-time employment (finding) 8 Part-time employment 9 C0682294
comment: 1 MD06527-1 2 Part-time employment 3 None 4 Part-time employment 5 160904001 6 Part-time employment 7 Part-time employment (finding) 8 Part-time employment 9 C2584322

Part Per Billion
type: Class
subclass of: Units
comment: 1 M05622 2 Part Per Billion 3 parts per billion (ppb) Parts per billion ppb 4 Part Per Billion 5 282106003 6 Parts per billion 7 Parts per billion (qualifier value) 8 Parts per billion 9 C0560002
alternative label: Parts per billion
alternative label: parts per billion (ppb)
alternative label: ppb

Part Per Trillion
type: Class
subclass of: Units
comment: 1 M05086 2 Part Per Trillion 3 pptr Parts per Trillion 4 Part Per Trillion 5 767525000 6 unit 7 Unit (qualifier value) 8 Unit 9 C0439163
alternative label: pptr
alternative label: Parts per Trillion

Part per million
type: Class
subclass of: Units
comment: 1 M02885 2 Part per million 3 ppms Parts per million ppm 4 Part per million 5 258731005 6 ppm 7 Parts per million (qualifier value) 8 Parts per million (qualifier value) 9 C0439187
alternative label: ppms
alternative label: ppm
alternative label: Parts per million

Partial failure of hair growth
type: Class
subclass of: Sensory function, Pain and Skin function (Symptom)
comment: 1 M00540 2 Partial failure of hair growth 3 None 4 Partial failure of hair growth 5 247526001 6 Partial failure of hair growth 7 Partial failure of hair growth (finding) 8 Partial failure of hair growth 9 C0423846

Pascal
type: Class
subclass of: Units
comment: 1 M04313 2 Pascal 3 Pa 4 Pascal 5 259016002 6 Pascal 7 Pascal (qualifier value) 8 Pascal 9 C0439473
alternative label: Pa

Passage of loose stools
type: Class
subclass of: Digestive function (Symptom)
comment: 1 M00871 2 Passage of loose stools 3 None 4 Passage of loose stools 5 398032003 6 Loose stools 7 Loose stool (finding) 8 Diarrhoea (& symptoms) or loose stools 9 C1534286

Passes water too often
type: Class
subclass of: Urogenital function (Symptom)
comment: 1 M01567 2 Passes water too often 3 None 4 Passes water too often 5 162116003 6 Passes water too often 7 Increased frequency of urination (finding) 8 Passes water too often 9 C0042023

Passive
type: Class
subclass of: Units
comment: 1 MD02644 2 Passive 3 None 4 Passive 5 21278004 6 passive motion 7 Passive movement (observable entity) 8 Passive 9 C3686820

Passive exercise
type: Class
subclass of: Preference of exercise
comment: Exercise Preference of exercise Passive exercise 1 M00377 2 Passive exercise 3 passive exercises 4 Passive exercise 5 183311000 6 Passive exercise 7 Passive exercise (regime/therapy) 8 Passive exercise 9 C0419121
alternative label: passive exercises

Past history disease occurrence
type: Class
subclass of: Hospital information, examination/diagnosis/treatment data
comment: 1 MD00033 2 Past history disease occurrence 3 None 4 Past history disease occurrence 5 417662000 6 History of clinical finding in subject (situation) 7 History of clinical finding in subject (situation) 8 PMH - past medical history 9 C0455458

Patch Dosing Unit
type: Class
subclass of: Units
comment: 1 M05313 2 Patch Dosing Unit 3 Patch Patch Dosage Form patches 4 Patch Dosing Unit 5 419702001 6 Patch 7 Patch - unit of product usage (qualifier value) 8 Patch Dosing Unit 9 C1706366
alternative label: patches
alternative label: Patch
alternative label: Patch Dosage Form

Pattern of fever
type: Class
subclass of: Hospital information, examination/diagnosis/treatment data
comment: 1 M00159 2 Pattern of fever 3 fever patterns fever pattern 4 Pattern of fever 5 248430002 6 Pattern of fever 7 Pattern of fever (observable entity) 8 Pattern of fever 9 C0424758
alternative label: fever pattern
alternative label: fever patterns

Pay by the person
type: Class
subclass of: Hospital Administration
comment: 1 MD00161 2 Pay by the person 3 None 4 Pay by the person 5 308590000 6 Payment for service procedure 7 Payment for service procedure (procedure) 8 Persons 9 C0027361
comment: 1 MD00215 2 Pay by the person 3 None 4 Pay by the person 5 308590000 6 Payment for service procedure 7 Payment for service procedure (procedure) 8 Payment for service procedure 9 C0586213
comment: 1 MD00219 2 Pay by the person 3 None 4 Pay by the person 5 308590000 6 Payment for service procedure 7 Payment for service procedure (procedure) 8 Payment for service procedure 9 C0586213

Peak Torque
type: Class
subclass of: Units
comment: 1 MD03116 2 peak torque 3 None 4 Peak Torque 5 365605003 6 Body measurement finding 7 Body measurement finding (finding) 8 Body measurement finding 9 C1287249

Peak Torque of the joint
type: Class
subclass of: Units
comment: 1 MD03692 2 Peak Torque of the joint 3 None 4 Peak Torque of the joint 5 54709006 6 Body measurement 7 Body measurement (procedure) 8 Body measure procedure 9 C0203910

Peak climbing
type: Class
subclass of: Sport
comment: 1 M02119 2 Peak climbing 3 None 4 Peak climbing 5 111055000 6 Peak climbing 7 Mountain climbing (qualifier value) 8 Peak climbing 9 C0336963

Pedal RPM
type: Class
subclass of: Units
comment: 1 MD03196 2 Pedal RPM 3 None 4 Pedal RPM 5 304618008 6 RPM 7 Revolutions per minute (qualifier value) 8 Revolutions per minute 9 C0582523

Pedal pulse
type: Class
subclass of: Cardiovascular system function (Body measurement)
comment: 1 M01924 2 Pedal pulse 3 pulse pedal, pedal pulses, Foot pulse, pulse foot, foot pulses 4 Pedal pulse 5 421811005 6 Pedal pulse 7 Dorsalis pedis pulse, function (observable entity) 8 Pedal pulse 9 C1706488
alternative label: pedal pulses
alternative label: pulse foot
alternative label: pulse pedal
alternative label: foot pulses

Pedatrophy
type: Class
subclass of: Nervous system and Mental function (Symptom)
comment: 1 M01691 2 Pedatrophy 3 Pedatrophia 4 Pedatrophy 5 29740003 6 Pedatrophy 7 Nutritional marasmus (disorder) 8 Pedatrophy 9 C0086588
alternative label: Pedatrophia

Pediatric
type: Class
subclass of: Units
comment: 1 MD01927 2 Pediatric 3 pediatrics 4 Pediatric 5 394537008 6 Pediatrics 7 Pediatric specialty (qualifier value) 8 Pediatric 9 C1521725

Pediatric Dentistry
type: Class
subclass of: Classification of Hospital
comment: 1 MD00660 2 Pediatric Dentistry 3 None 4 Pediatric Dentistry 5 394607009 6 Pediatric dentistry 7 Pediatric dentistry (qualifier value) 8 Pediatric Dentistry Specialty 9 C0030763

Pediatric cancer
type: Class
subclass of: Hospital information, examination/diagnosis/treatment data
comment: 1 MD00257 2 Pediatric cancer 3 None 4 Pediatric cancer 5 1240414004 6 cancer 7 Malignant neoplasm (morphologic abnormality) 8 Pediatric cancer stager:Type:Point in time:Cancer.To be specified in another part of the message:Nominal 9 C0804711
comment: 1 MD00257-1 2 Pediatric cancer 3 None 4 Pediatric cancer 5 363346000 6 cancer 7 Malignant neoplastic disease (disorder) 8 Pediatric cancer stager:Type:Point in time:Cancer.To be specified in another part of the message:Nominal 9 C0804711

Pediatrics of Korean Medicine
type: Class
subclass of: Classification of Hospital
comment: 1 MD00670 2 Pediatrics of Korean Medicine 3 None 4 Pediatrics of Korean Medicine 5 394537008 6 Pediatric 7 Pediatric specialty (qualifier value) 8 Pediatric 9 C1521725

Pellet Dosing Unit
type: Class
subclass of: Units
comment: 1 M05306 2 Pellet Dosing Unit 3 Pellet - unit of product usage PEL Pellet 4 Pellet Dosing Unit 5 428640004 6 Pellet 7 Pellet - unit of product usage (qualifier value) 8 Pellet Dosing Unit 9 C1706128
alternative label: Pellet - unit of product usage
alternative label: Pellet
alternative label: PEL

Pelvic floor exercises
type: Class
subclass of: Active exercise
comment: 1 M00321 2 Pelvic floor exercises 3 PFE - Pelvic floor exercises, PFEX - Pelvic floor exercises 4 Pelvic floor exercises 5 183306002 6 Pelvic floor exercises 7 Pelvic floor exercises (regime/therapy) 8 Pelvic floor exercises 9 C0262718
alternative label: PFE - Pelvic floor exercises
alternative label: PFEX - Pelvic floor exercises

Pelvic floor exercises advised
type: Class
subclass of: Muscle Strengthening Exercise
comment: 1 M02043 2 Pelvic floor exercises advised 3 None 4 Pelvic floor exercises advised 5 183306002 6 Pelvic floor exercises 7 Pelvic floor exercises (regime/therapy) 8 Pelvic floor exercises 9 C0262718

Pelvic tilting exercise
type: Class
subclass of: Active exercise
comment: 1 M00322 2 Pelvic tilting exercise 3 None 4 Pelvic tilting exercise 5 229139008 6 Pelvic tilting exercise 7 Pelvic tilting exercise (regime/therapy) 8 Pelvic tilting exercise 9 C0454349

Pelvic tilting exercise in water
type: Class
subclass of: Active exercise
comment: 1 M00323 2 Pelvic tilting exercise in water 3 None 4 Pelvic tilting exercise in water 5 229187003 6 Pelvic tilting exercise in water 7 Pelvic tilting exercise in water (regime/therapy) 8 Pelvic tilting exercise in water 9 C0454396

Pemphigus foliaceus
type: Class
subclass of: Sensory function, Pain and Skin function (Symptom)
comment: 1 MD00486 2 Pemphigus foliaceus 3 None 4 Pemphigus foliaceus 5 35154004 6 Pemphigus foliaceus 7 Pemphigus foliaceus (disorder) 8 Pemphigus foliaceus 9 C0263313

Pemphigus vulgaris
type: Class
subclass of: Sensory function, Pain and Skin function (Symptom)
comment: 1 MD00343 2 Pemphigus vulgaris 3 None 4 Pemphigus vulgaris 5 49420001 6 Pemphigus vulgaris 7 Pemphigus vulgaris (disorder) 8 Pemphigus vulgaris 9 C0030809

People in positions of authority
type: Class
subclass of: Public Policy Factors
comment: 1 MD06687 2 People in positions of authority 3 None 4 People in positions of authority 5 125676002 6 Person 7 Person (person) 8 People in positions of authority 9 C2371719

People in subordinate positions
type: Class
subclass of: Characteristics of the community
comment: 1 MD06688 2 People in subordinate positions 3 None 4 People in subordinate positions 5 125676002 6 Person 7 Person (person) 8 People in subordinate positions 9 C2371720

Per Billion
type: Class
subclass of: Units
comment: 1 M05621 2 Per Billion 3 None 4 Per Billion 5 282106003 6 Parts per billion 7 Parts per billion (qualifier value) 8 Parts per billion 9 C0560002

Per Hour
type: Class
subclass of: Units
comment: 1 M04668 2 Per Hour 3 /h /hour 4 Per Hour 5 286551008 6 per hour 7 per hour (qualifier value) 8 per hour 9 C0564385
alternative label: /h
alternative label: /hour

Per Kilometer
type: Class
subclass of: Units
comment: 1 MD02429 2 Per Kilometer 3 per kilometer 4 Per Kilometer 5 258670009 6 Kilometer 7 Kilometer (qualifier value) 8 Kilometer 9 C0439198

Per Microliter
type: Class
subclass of: Units
comment: 1 M04732 2 Per Microliter 3 per microlitre Per uL /mcL 4 Per Microliter 5 420167005 6 Per microliter 7 Per microliter (qualifier value) 8 Per microliter 9 C1300557
alternative label: /mcL
alternative label: per microlitre
alternative label: Per uL

Per Million
type: Class
subclass of: Units
comment: 1 M03694 2 Per Million 3 None 4 Per Million 5 767525000 6 Unit 7 Unit (qualifier value) 8 Unit 9 C0439148

Per Minute
type: Class
subclass of: Units
comment: 1 M04708 2 Per Minute 3 /min /minute per min 4 Per Minute 5 286549009 6 per minute 7 per minute (qualifier value) 8 per minute 9 C0702093
alternative label: /min
alternative label: /minute
alternative label: per min

Per Second
type: Class
subclass of: Second
comment: 1 M04679 2 Per Second 3 per sec /second /s 4 Per Second 5 288495006 6 per second 7 per second (qualifier value) 8 per second 9 C0565930
alternative label: per sec
alternative label: /s
alternative label: /second

Per Trillion
type: Class
subclass of: Units
comment: 1 M05084 2 Per Trillion 3 None 4 Per Trillion 5 767525000 6 unit 7 Unit (qualifier value) 8 Unit 9 C0439161

Per Year
type: Class
subclass of: Units
comment: 1 M04363 2 Per Year 3 "per years /year" 4 Per Year 5 259039008 6 per year 7 per year (qualifier value) 8 per year 9 C0439508
alternative label: /year
alternative label: per years

Per low power field
type: Class
subclass of: Units
comment: 1 M04881 2 Per low power field 3 (HealthVault) per low powered field LPF 4 Per low power field 5 415059001 6 Per low power field 7 Per low power field (qualifier value) 8 Per low power field 9 C1532175
alternative label: (HealthVault) per low powered field

Percent Mass per Mass
type: Class
subclass of: Units
comment: 1 M05336 2 %M/M 3 m/m% 4 Percent Mass per Mass 5 767525000 6 unit 7 Unit (qualifier value) 8 Unit 9 C0439181

Percent Mass per Volume
type: Class
subclass of: Units
comment: 1 M04568 2 Percent Mass per Volume 3 Mass-Volume Percentage Percent Mass/Volume %M/V 4 Percent Mass per Volume 5 767525000 6 unit 7 Unit (qualifier value) 8 Unit 9 C0439150
alternative label: Mass-Volume Percentage
alternative label: Percent Mass/Volume

Percent Weight per Volume
type: Class
subclass of: Units
comment: 1 M04566 2 Percent Weight per Volume 3 weight/volume ratio PERCENT WEIGHT/VOLUME 4 Percent Weight per Volume 5 767525000 6 unit 7 Unit (qualifier value) 8 Unit 9 C0439148
alternative label: weight/volume ratio
alternative label: PERCENT WEIGHT/VOLUME

Percent Weight per Weight
type: Class
subclass of: Units
comment: 1 M05335 2 Percent Weight per Weight 3 Weight-Weight Percentage w/w% %W/W Percent Weight/Weight 4 Percent Weight per Weight 5 767525000 6 unit 7 Unit (qualifier value) 8 Unit 9 C0439180
alternative label: %W/W
alternative label: Percent Weight/Weight
alternative label: w/w%
alternative label: Weight-Weight Percentage

Percent area reduction
type: Class
subclass of: Units
comment: 1 M04723 2 Percent area reduction 3 None 4 Percent area reduction 5 397441001 6 Percent area reduction 7 Percentage area reduction (qualifier value) 8 Percent area reduction 9 C1275671

Percent bound
type: Class
subclass of: Units
comment: 1 M05211 2 Percent bound 3 None 4 Percent bound 5 418131003 6 Percent bound 7 Percentage bound (qualifier value) 8 Percent bound 9 C1689898

Percent by Volume
type: Class
subclass of: Units
comment: 1 M04579 2 Percent by Volume 3 None 4 Percent by Volume 5 767525000 6 unit 7 Unit (qualifier value) 8 Unit 9 C0439152

Percent by Weight
type: Class
subclass of: Units
comment: 1 M05337 2 Percent by Weight 3 None 4 Percent by Weight 5 767525000 6 unit 7 Unit (qualifier value) 8 Unit 9 C0439182

Percent diameter reduction
type: Class
subclass of: Units
comment: 1 M04724 2 Percent diameter reduction 3 None 4 Percent diameter reduction 5 397442008 6 Percent diameter reduction 7 Percentage diameter reduction (qualifier value) 8 Percent diameter reduction 9 C1275672

Percent energy intake
type: Class
subclass of: Units
comment: 1 M04695 2 Percent energy intake 3 None 4 Percent energy intake 5 288493004 6 percent energy intake 7 Percentage energy intake (qualifier value) 8 percent energy intake 9 C0600082

Percent excreted
type: Class
subclass of: Units
comment: 1 M05209 2 Percent excreted 3 % excreted 4 Percent excreted 5 418678001 6 Percent excreted 7 Percentage excreted (qualifier value) 8 Percent excreted 9 C1688651
alternative label: % excreted

Percent inhibition
type: Class
subclass of: Units
comment: 1 M05155 2 Percent inhibition 3 % inhibition % inhib 4 Percent inhibition 5 419495008 6 Percent inhibition 7 Percentage inhibition (qualifier value) 8 Percent inhibition 9 C1628982
alternative label: % inhibition
alternative label: % inhib

Percent normal
type: Class
subclass of: Units
comment: 1 M03669 2 Percent normal 3 Normal percent normal % % normal % normal forms percent normal forms 4 Percent normal 5 258744000 6 percent normal 7 Percentage normal (qualifier value) 8 percent normal 9 C0439166
alternative label: normal %
alternative label: percent normal forms
alternative label: % normal forms
alternative label: Normal percent
alternative label: % normal

Percent of total
type: Class
subclass of: Units
comment: 1 M03678 2 Percent of total 3 % of total 4 Percent of total 5 258755000 6 percent of total 7 Percentage of total (qualifier value) 8 percent of total 9 C0439175
alternative label: % of total

Percent release
type: Class
subclass of: Units
comment: 1 M03682 2 Percent release 3 % release 4Percent release 5 258760001 6 percent release 7 Percentage release (qualifier value) 8 percent release 9 C0439180

Percent suppression
type: Class
subclass of: Units
comment: 1 M03683 2 Percent suppression 3 None 4 Percent suppression 5 258761002 6 percent suppression 7 Percentage suppression (qualifier value) 8 percent suppression 9 C0439181

Percent uptake
type: Class
subclass of: Units
comment: 1 M03640 2 Percent uptake 3 None 4 Percent uptake 5 258763004 6 percent uptake 7 Percentage uptake (qualifier value) 8 percent uptake 9 C0347980

Percent volume
type: Class
subclass of: Units
comment: 1 M05220 2 Percent volume 3 % volume 4 Percent volume 5 419569009 6 Percent volume 7 Percentage volume (qualifier value) 8 Percent volume 9 C1690016
alternative label: % volume

Percentile
type: Class
subclass of: Units
comment: 1 MD04768 2 Percentile 3 None 4 Percentile 5 118583003 6 Percentile 7 Percentile (property) (qualifier value) 8 Percentile 9 C1264641

Percentile in sample population
type: Class
subclass of: Units
comment: 1 MD04766 2 Percentile in sample population 3 None 4 Percentile in sample population 5 118583003 6 Percentile 7 Percentile (property) (qualifier value) 8 Percentile 9 C1264641

Perception
type: Class
subclass of: Nervous system and Mental function (Body measurement)
comment: 1 MD02935 2 Perception 3 Perceptual functions 4 Perception 5 81742003 6 Perception 7 Perception function (observable entity) 8 Perception 9 C0030971
alternative label: Perceptual functions

Perceptual disturbance
type: Class
subclass of: Body functions of disability
comment: 1 MD02934 2 Perceptual disturbance 3 None 4 Perceptual disturbance 5 1157237004 6 Perceptual disturbance 7 Altered perception (finding) 8 Perceptual disturbance 9 C0233746

Perform independently
type: Class
subclass of: Questionnaire
comment: 1 MD05578 2 Perform independently 3 None 4 Perform independently 5 273820006 6 Functional status questionnaire 7 Functional status index (assessment scale) 8 Questionnaire 9 C0034394

Performance Analysis of Daily Living Work
type: Class
subclass of: Health Related Factors
comment: 1 MD05498 2 Performance Analysis of Daily Living Work 3 None 4 Performance Analysis of Daily Living Work 5 364704001 6 Performance at work 7 Performance at work (observable entity) 8 performance - action 9 C1882330

Performance analysis results
type: Class
subclass of: Questionnaire
comment: 1 MD05490 2 Performance analysis results 3 None 4 Performance analysis results 5 394617004 6 Result 7 Result (navigational concept) 8 result 9 C1274040

Performance classification action
type: Class
subclass of: Questionnaire
comment: 1 MD04461 2 Performance classification action 3 None 4 Performance classification action 5 273248003 6 Action 7 Action (attribute) 8 performance - action 9 C1882330

Performance of the action
type: Class
subclass of: Tool
comment: 1 MD04209 2 Performance of the action 3 Performance actions 4 Performance of the action 5 246137000 6 equipment 7 Equipment (attribute) 8 equipment 9 C0014672
alternative label: Performance actions

Performance ratio during working hours
type: Class
subclass of: Questionnaire
comment: 1 MD04953 2 Performance ratio during working hours 3 None 4 Performance ratio during working hours 5 118586006 6 Ratio 7 Ratio (property) (qualifier value) 8 Ratio 9 C0456603

Performance reflection activity index
type: Class
subclass of: Units
comment: 1 MD05198 2 Performance reflection activity index 3 None 4 Performance reflection activity index 5 257733005 6 Activity 7 Activity (observable entity) 8 Activities 9 C0441655

Performance skills
type: Class
subclass of: Questionnaire
comment: 1 MD05553 2 Performance skills 3 None 4 Performance skills 5 398166005 6 Performed 7 Performed (qualifier value) 8 Performance 9 C0597198

Periampullary Region
type: Class
subclass of: Digestive function (Body region)
comment: 1 M00881 2 Periampullary Region 3 None 4 Periampullary Region 5 52530000 6 Body region 7 Body region structure (body structure) 8 Periampullary Region 9 C1882332

Perineal
type: Class
subclass of: Sensory function, Pain and Skin function (Body region)
comment: 1 M01971 2 Perineal 3 perineum, Perineum, Perineums, Regio perinealis, Perineal structure , Perineal region 4 Perineal 5 261157007 6 Perineal 7 Perineal (qualifier value) 8 Perineal 9 C0031066
alternative label: Perineum
alternative label: Perineal region
alternative label: Perineal structure
alternative label: perineum
alternative label: Perineums
alternative label: Regio perinealis

Periocular Region
type: Class
subclass of: Sensory function, Pain and Skin function (Body region)
comment: 1 M00883 2 Periocular Region 3 None 4 Periocular Region 5 52530000 6 Body region 7 Body region structure (body structure) 8 Structure of periocular tissue 9 C3686709

Periodic leg movements of sleep
type: Class
subclass of: Frequency
comment: 1 M00068 2 Periodic leg movements of sleep 3 None 4 Periodic leg movements of sleep 5 445140006 6 Periodic leg movements of sleep 7 Periodic leg movements of sleep (finding) 8 Periodic leg movements of sleep 9 C2919187

Periodicity of micturition
type: Class
subclass of: Urogenital function (Symptom)
comment: 1 M01568 2 Periodicity of micturition 3 None 4 Periodicity of micturition 5 300471006 6 Periodicity of micturition 7 Finding of frequency of urination (finding) 8 Periodicity of micturition 9 C0042023

Periodontology
type: Class
subclass of: Classification of Hospital
comment: 1 MD00661 2 Periodontology 3 None 4 Periodontology 5 408461007 6 Periodontology 7 Periodontics (qualifier value) 8 Periodontic specialty 9 C0031098

Peripheral pulse
type: Class
subclass of: Cardiovascular system function (Body measurement)
comment: 1 M00199 2 Peripheral pulse 3 peripheral pulses 4 Peripheral pulse 5 54718008 6 Peripheral pulse 7 Peripheral pulse, function (observable entity) 8 Peripheral pulse 9 C0232139
alternative label: peripheral pulses

Peripheral pulse absent
type: Class
subclass of: Cardiovascular system function (Symptom)
comment: 1 M00209 2 Peripheral pulse absent 3 None 4 Peripheral pulse absent 5 301161008 6 Peripheral pulse absent 7 Peripheral pulse absent (finding) 8 Peripheral pulse absent 9 C0577850

Peripheral pulse present
type: Class
subclass of: Cardiovascular system function (Body measurement)
comment: 1 M00210 2 Peripheral pulse present 3 None 4 Peripheral pulse present 5 301151001 6 Peripheral pulse present 7 Peripheral pulse present (finding) 8 Peripheral pulse present 9 C0577840

Peripheral skin
type: Class
subclass of: Sensory function, Pain and Skin function (Body measurement)
comment: 1 MD04433 2 Peripheral skin 3 None 4 Peripheral skin 5 39937001 6 Skin 7 Skin structure (body structure) 8 Skin 9 C1123023

Personal Care Attendant
type: Class
subclass of: Units
comment: 1 MD02958 2 Personal Care Attendant 3 None 4 Personal Care Attendant 5 133932002 6 caregiver 7 Caregiver (person) 8 Personal Care Attendant 9 C1556021

Personal care providers and personal assistants
type: Class
subclass of: Characteristics of the individual
comment: 1 MD06689 2 Personal care providers and personal assistants 3 None 4 Personal care providers and personal assistants 5 125676002 6 Person 7 Person (person) 8 Personal care providers and personal assistants 9 C2371721

Personal economic resources
type: Class
subclass of: Individual Related Factors
comment: 1 MD06536 2 Personal economic resources 3 None 4 Personal economic resources 5 734842000 6 Source 7 Source (property) (qualifier value) 8 Personal economic resources 9 C2371597

Personal hygiene
type: Class
subclass of: Health Related Factors
subclass of: Physical/Chemical Environment
comment: Environment Physical /Chemical environment None 1 MD04550 2 Personal hygiene 3 None 4 Personal hygiene 5 129817005 6 Personal hygiene finding 7 Personal hygiene finding (finding) 8 Personal hygiene finding 9 C1268731
comment: Lifelog Health Related Factor None 1 MD05175 2 Personal hygiene 3 None 4 Personal hygiene 5 286850002 6 Personal hygiene activities 7 Personal hygiene activities, function (observable entity) 8 personal hygiene (activity) 9 C0564673

Personal network therapy
type: Class
subclass of: Nervous system and Mental function (Therapy)
comment: 1 M01792 2 Personal network therapy 3 None 4 Personal network therapy 5 38256005 6 Personal network therapy 7 Social network therapy (regime/therapy) 8 Personal network therapy 9 C0204565

Perspiration
type: Class
subclass of: Sensory function, Pain and Skin function (Symptom)
comment: 1 M01426 2 Perspiration 3 perspiring 4 Perspiration 5 415691001 6 Perspiration 7 Sweating, function (observable entity) 8 Perspiration 9 C0038990
alternative label: perspiring

Petroclival Region
type: Class
subclass of: Musculoskeletal function (Body region)
comment: 1 M00884 2 Petroclival Region 3 None 4 Petroclival Region 5 244429000 6 Petroclival meninges 7 Structure of petroclival meninges (body structure) 8 Petroclival Region 9 C1882351

Peutz-Jeghers syndrome
type: Class
subclass of: Hospital information, examination/diagnosis/treatment data
comment: 1 MD00493 2 Peutz-Jeghers syndrome 3 None 4 Peutz-Jeghers syndrome 5 54411001 6 Peutz-Jeghers syndrome 7 Peutz-Jeghers syndrome (disorder) 8 Peutz-Jeghers syndrome 9 C0031269

Pharmacy
type: Class
subclass of: Classification of Hospital
comment: 1 MD00125 2 Pharmacy 3 None 4 Pharmacy 5 264372000 6 Pharmacy 7 Pharmacy (environment) 8 Pharmacy facility 9 C0031322

Pharmacy Dispensing
type: Class
subclass of: Hospital information, examination/diagnosis/treatment data
comment: 1 MD00121 2 Pharmacy Dispensing 3 None 4 Pharmacy Dispensing 5 373784005 6 Dispensing medication 7 Dispensing medication (procedure) 8 Dispensing medication 9 C0947323

Pharyngeal dryness
type: Class
subclass of: Voice and Speaking (Symptom)
comment: 1 M00236 2 Pharyngeal dryness 3 PHARYNX DRY 4 Pharyngeal dryness 5 102618009 6 Pharyngeal dryness 7 Pharyngeal dryness (finding) 8 Pharyngeal dryness 9 C0235234
alternative label: PHARYNX DRY

Pharyngeal pain
type: Class
subclass of: Respiratory function (Symptom)
comment: 1 M02008 2 Pharyngeal pain 3 None 4 Pharyngeal pain 5 162397003 6 Pharyngeal pain 7 Pain in throat (finding) 8 Pharyngeal pain 9 C0242429

Pharyngeal swallowing
type: Class
subclass of: Respiratory function (Body measurement)
comment: 1 MD05915 2 Pharyngeal swallowing 3 None 4 Pharyngeal swallowing 5 405038001 6 Swallowing status: pharyngeal phase 7 Swallowing status: pharyngeal phase (observable entity) 8 Pharyngeal swallowing 9 C2371116

Phase of fever
type: Class
subclass of: Units
comment: 1 M00164 2 Phase of fever 3 None 4 Phase of fever 5 248431003 6 Phase of fever 7 Phase of fever (observable entity) 8 Phase of fever 9 C0424759

Phone number
type: Class
subclass of: Units
comment: 1 MD00987 2 Phone number 3 None 4 Phone number 5 734005006 6 Phone number 7 Telephone number (property) (qualifier value) 8 Telephone Number 9 C1515258

Phosphate
type: Class
subclass of: Functions of Blood System, Metabolic system and Endocrine system (Symptom)
subclass of: Hospital information, examination/diagnosis/treatment data
comment: Clinical+Disability Hospital information, examination/diagnosis/treatment data None 1 MD00403 2 Phosphate 3 None 4 Phosphate 5 259296007 6 Phosphate 7 Phosphate (substance) 8 phosphate ion 9 C1601799
comment: Symptom Functions_of_Blood_System,_Metabolic_system_and_Endocrine_system_(Symptom' None 1 MD00454-1 2 phosphatases 3 None 4 Phosphate 5 130132002 6 Phosphatase 7 Substance with phosphoric monoester hydrolase mechanism of action (substance) 8 Phosphatase (disposition) 9 C4522024

Photometric and radiometric quantities
type: Class
subclass of: Units
comment: 1 M03184 2 Photometric and radiometric quantities 3 None 4 Photometric and radiometric quantities 5 282574009 6 Photometric and radiometric quantities 7 Photometric and radiometric quantities (qualifier value) 8 Photometric and radiometric quantities 9 C0560426

Physical activity
type: Class
subclass of: Aerobic Exercise
comment: 1 MD00036 2 Physical activity 3 None 4 physical activity 5 68130003 6 Physical activity 7 Physical activity (observable entity) 8 Physical activity 9 C0026606

Physical contact in relationships
type: Class
subclass of: Individual Related Factors
comment: 1 MD06467 2 Physical contact in relationships 3 None 4 Physical contact in relationships 5 76933008 6 Physical contact 7 Physical contact (physical force) 8 Physical contact in relationships 9 C2371538

Physical functions
type: Class
subclass of: Health Related Factors
comment: 1 MD02266 2 Physical functions 3 None 4 Physical functions 5 246464006 6 Function 7 Function (observable entity) 8 Physical function 9 C0516981

Physical geography
type: Class
subclass of: Physical/Chemical Environment
comment: 1 MD06636 2 Physical geography 3 None 4 Physical geography 5 272498009 6 Geographical feature 7 Geographical feature (environment) 8 Physical geography 9 C0681764

Physical rehabilitation therapy procedure
type: Class
subclass of: Nervous system and Mental function (Therapy)
comment: 1 M00631 2 Physical rehabilitation therapy procedure 3 None 4 Physical rehabilitation therapy procedure 5 108305003 6 Physical rehabilitation therapy procedure 7 Physical rehabilitation therapy procedure (regime/therapy) 8 Physical rehabilitation therapy procedure 9 C1266827

Physiotherapeutic massage
type: Class
subclass of: Musculoskeletal function (Therapy)
comment: 1 M01227 2 Physiotherapeutic massage 3 None 4 Physiotherapeutic massage 5 387854002 6 Physiotherapeutic massage 7 Massage physiotherapy (regime/therapy) 8 Massage Therapy 9 C3536731

Physiotherapy
type: Class
subclass of: Nervous system and Mental function (Therapy)
comment: 1 M00615 2 Physiotherapy 3 None 4 Physiotherapy 5 722138006 6 Physiotherapy 7 Physiotherapy (qualifier value) 8 Physiotherapy 9 C0699718
comment: 1 M00615-1 2 Physiotherapy 3 None 4 Physiotherapy 5 722138006 6 Physiotherapy 7 Physiotherapy (qualifier value) 8 Physiotherapy 9 C0949766
comment: 1 M00615-2 2 Physiotherapy 3 None 4 Physiotherapy 5 91251008 6 Physiotherapy 7 Physical therapy procedure (regime/therapy) 8 Physiotherapy 9 C0699718
comment: 1 M00615-3 2 Physiotherapy 3 None 4 Physiotherapy 5 91251008 6 Physiotherapy 7 Physical therapy procedure (regime/therapy) 8 Physiotherapy 9 C0949766

Picking up
type: Class
subclass of: Health Related Factors
comment: 1 MD06316 2 Picking up 3 None 4 Picking up 5 288365002 6 Picks up objects 7 Does pick up objects (finding) 8 Picking up 9 C2371410

Picogram
type: Class
subclass of: Units
comment: 1 M03753 2 Picogram 3 pg picograms 4 Picogram 5 258687006 6 picogram 7 picogram (qualifier value) 8 picogram 9 C0439213
alternative label: picograms
alternative label: pg

Picogram per Deciliter
type: Class
subclass of: Units
comment: 1 M03900 2 Picogram per Deciliter 3 pg/dL picogram/decilitre picogram/deciliter Picrogram/Deciliter 4 Picogram per Deciliter 5 258809009 6 picogram/decilitre 7 Picogram/deciliter (qualifier value) 8 picogram/decilitre 9 C0439277
alternative label: Picrogram/Deciliter
alternative label: picogram/deciliter
alternative label: pg/dL

Picogram per Microgram
type: Class
subclass of: Units
comment: 1 M03862 2 Picogram per Microgram 3 pg/ug pg/mcg 4 Picogram per Microgram 5 767525000 6 Unit 7 Unit (qualifier value) 8 Unit 9 C0439148
alternative label: pg/ug
alternative label: pg/mcg

Picogram per Microliter
type: Class
subclass of: Units
comment: 1 M03884 2 Picogram per Microliter 3 pg/uL 4 Picogram per Microliter 5 767525000 6 Unit 7 Unit (qualifier value) 8 Unit 9 C0439148
alternative label: pg/uL

Picogram per Milligram
type: Class
subclass of: Units
comment: 1 M05141 2 Picogram per Milligram 3 pg/mg 4 Picogram per Milligram 5 767525000 6 unit 7 Unit (qualifier value) 8 Unit 9 C0439172
alternative label: pg/mg

Picogram per Milliliter
type: Class
subclass of: Units
comment: 1 M03997 2 Picogram per Milliliter 3 picogram/millilitre picogram/milliliter pg/mL 4 Picogram per Milliliter 5 258808001 6 Picogram/milliliter 7 Picogram/milliliter (qualifier value) 8 Picogram/milliliter 9 C0439297
alternative label: pg/mL
alternative label: picogram/milliliter
alternative label: picogram/millilitre

Picokatal
type: Class
subclass of: Units
comment: 1 M03813 2 Picokatal 3 pkat 4 Picokatal 5 258781001 6 Picokatal 7 Picokatal (qualifier value) 8 Picokatal 9 C0439248
alternative label: pkat

Picokatal per Microliter
type: Class
subclass of: Units
comment: 1 M05379 2 Picokatal per Microliter 3 pkat/uL 4 Picokatal per Microliter 5 767525000 6 unit 7 Unit (qualifier value) 8 Unit 9 C0439192
alternative label: pkat/uL

Picoliter
type: Class
subclass of: Units
comment: 1 M04706 2 Picoliter 3 pL Picolitre 4 Picoliter 5 282114009 6 Picoliter 7 Picoliter (qualifier value) 8 Picoliter 9 C0700176
alternative label: Picolitre
alternative label: pL

Picometer
type: Class
subclass of: Units
comment: 1 M05624 2 Picometer 3 None 4 Picometer 5 767525000 6 Unit 7 Unit (qualifier value) 8 Picometer 9 C2347516

Picomole
type: Class
subclass of: Units
comment: 1 M03706 2 Picomole 3 picomole (pM) pmol 4 Picomole 5 258721003 6 picomole 7 picomole (qualifier value) 8 picomole 9 C0439192
alternative label: picomole (pM)
alternative label: pm
alternative label: pmol

Picomole per Femtogram
type: Class
subclass of: Units
comment: 1 M05583 2 Picomole per Femtogram 3 pmol/fg 4 Picomole per Femtogram 5 258721003 6 picomole 7 picomole (qualifier value) 8 pmol 9 C0439192
alternative label: pmol/fg

Picomole per Femtoliter
type: Class
subclass of: Units
comment: 1 M05600 2 Picomole per Femtoliter 3 pmol/fL 4 Picomole per Femtoliter 5 258721003 6 picomole 7 picomole (qualifier value) 8 pmol 9 C0439192
alternative label: pmol/fL

Picomole per Liter
type: Class
subclass of: Units
comment: 1 M03925 2 Picomole per Liter 3pmol/L picomole/litre picomole/liter picomolar 4 Picomole per Liter 5 258819003 6 Picomole/liter 7 Picomole/liter (qualifier value) 8 Picomole/liter 9 C0439284
alternative label: picomolar
alternative label: picomole/litre
alternative label: picomole/liter
alternative label: pmol/L

Picomole per Microgram
type: Class
subclass of: Units
comment: 1 M03960 2 Picomole per Microgram 3 pmol/ug pmol/mcg 4 Picomole per Microgram 5 767525000 6 Unit 7 Unit (qualifier value) 8 Unit 9 C0439148
alternative label: pmol/mcg
alternative label: pmol/ug

Picomole per Microliter
type: Class
subclass of: Units
comment: 1 M04014 2 Picomole per Microliter 3 pmol/uL 4 Picomole per Microliter 5 767525000 6 Unit 7 Unit (qualifier value) 8 Unit 9 C0439148
alternative label: pmol/uL

Picomole per Milliliter
type: Class
subclass of: Units
comment: 1 M03907 2 Picomole per Milliliter 3 pmol/mL 4 Picomole per Milliliter 5 767525000 6 Unit 7 Unit (qualifier value) 8 Unit 9 C0439148
alternative label: pmol/mL

Picomole per Nanogram
type: Class
subclass of: Units
comment: 1 M05566 2 Picomole per Nanogram 3 pmol/ng 4 Picomole per Nanogram 5 258721003 6 picomole 7 picomole (qualifier value) 8 pmol 9 C0439192
alternative label: pmol/ng

Picomole per Picogram
type: Class
subclass of: Units
comment: 1 M05548 2 Picomole per Picogram 3 pmol/pg 4 Picomole per Picogram 5 415102003 6 Picomole/gram 7 Picomole/gram (qualifier value) 8 pmol 9 C0439192
alternative label: pmol/pg

Picosecond
type: Class
subclass of: Units
comment: 1 M05625 2 Picosecond 3 psec 4 Picosecond 5 767525000 6 Unit 7 Unit (qualifier value) 8 Picosecond 9 C2347517
alternative label: psec

Pilates exercise
type: Class
subclass of: Aerobic Exercise
comment: 1 M00362 2 Pilates exercise 3 exercises pilates Pilates 4 Pilates exercise 5 404928000 6 Pilates exercise 7 Pilates exercise (regime/therapy) 8 Pilates exercise 9 C1321049
alternative label: Pilates
alternative label: Level of depression
alternative label: exercises pilates

Pilosis
type: Class
subclass of: Sensory function, Pain and Skin function (Symptom)
comment: 1 M01168 2 Pilosis 3 None 4 Pilosis 5 399939002 6 Pilosis 7 Hirsutism (disorder) 8 Hirsutism 9 C0019572

Pinch strength
type: Class
subclass of: Musculoskeletal function (Body measurement)
comment: 1 MD04156 2 Pinch strength 3 None 4 Pinch strength 5 411117005 6 Has strength 7 Has strength (attribute) 8 Pinch strength 9 C1720876

Ping-pong
type: Class
subclass of: Sport
comment: 1 M05879 2 Ping-pong 3 None 4 Ping-pong 5 415577004 6 Sport 7 Sport (qualifier value) 8 Sports 9 C0038039

Pint
type: Class
subclass of: Units
comment: 1 M04544 2 Pint 3 pt 4 Pint 5 282119004 6 pint 7 pint (qualifier value) 8 pint 9 C0560012
alternative label: pt

Pipe smoker
type: Class
subclass of: Sub-Cultural Level
comment: 1 M00113 2 Pipe smoker 3 pipe smokers 4 Pipe smoker 5 82302008 6 Pipe smoker 7 Pipe smoker (finding) 8 Pipe smoker 9 C0337665
alternative label: pipe smokers

Pituitary Gland
type: Class
subclass of: Functions of Blood System, Metabolic system and Endocrine system (Symptom)
comment: 1 MD00397 2 Pituitary Gland 3 None 4 Pituitary Gland 5 56329008 6 Pituitary gland 7 Pituitary structure (body structure) 8 Pituitary Gland 9 C0032005

Place
type: Class
subclass of: Questionnaire
comment: 1 MD05547-1 2 Place 3 None 4 Place 5 246297005 6 Place 7 Place (attribute) 8 Place 9 C0442504
comment: 1 MD05547-2 2 Place 3 None 4 Place 5 246297005 6 Place 7 Place (attribute) 8 Place 9 C1704765
comment: 1 MD05547-3 2 Place 3 None 4 Place 5 257557008 6 Place 7 Place (environment) 8 Place 9 C0442504
comment: 1 MD05547-4 2 Place 3 None 4 Place 5 257557008 6 Place 7 Place (environment) 8 Place 9 C1704765
comment: 1 MD05547-5 2 Place 3 None 4 Place 5 421066005 6 Place 7 Place - dosing instruction imperative (qualifier value) 8 Place 9 C0442504
comment: 1 MD05547-6 2 Place 3 None 4 Place 5 421066005 6 Place 7 Place - dosing instruction imperative (qualifier value) 8 Place 9 C1704765

Plantar Region
type: Class
subclass of: Musculoskeletal function (Body region)
comment: 1 M00927 2 Plantar Region 3 Plantar, Planta 4 Plantar Region 5 25593008 6 Plantaris 7 Plantaris muscle structure (body structure) 8 Sole of Foot 9 C0230463
comment: 1 M00927-1 2 Plantar Region 3 Plantar, Planta 4 Plantar region 5 731075006 6 entire plantar of region 7 Entire sole of foot (body structure) 8 Plantar part of heel 9 C4322680
alternative label: Plantar
alternative label: Planta

Plantar part of foot
type: Class
subclass of: Musculoskeletal function (Body region)
comment: 1 M02054 2 Plantar part of foot 3 None 4 Plantar part of foot 5 57999000 6 plantar region of foot 7 Structure of sole of foot (body structure) 8 Region of plantar part of foot 9 C4322844

Plants
type: Class
subclass of: Biological environment
comment: 1 MD06647 2 Plants 3 None 4 Plants 5 31006001 6 Plant 7 Kingdom Plantae (organism) 8 Plants 9 C0032098

Plastic Surgery
type: Class
subclass of: Classification of Hospital
comment: 1 MD00637 2 Plastic Surgery 3 None 4 Plastic Surgery 5 394611003 6 Plastic surgery 7 Plastic surgery - specialty (qualifier value) 8 Plastic Surgery Specialty 9 C0038911

Platelet
type: Class
subclass of: Functions of Blood System, Metabolic system and Endocrine system (Body measurement)
comment: 1 MD03064 2 Platelet 3 None 4 Platelet 5 16378004 6 Platelet 7 Platelet (cell structure) 8 Platelet 9 C0005821

Play
type: Class
subclass of: Individual Related Factors
comment: 1 MD06550 2 Play 3 None 4 Play 5 300776002 6 Plays 7 Does play (finding) 8 Play 9 C0032214

Play therapy
type: Class
subclass of: Musculoskeletal function (Therapy)
comment: 1 M00585 2 Play therapy 3 therapy play Play Therapies Therapeutic play PLAY THER THER PLAY Play psychotherapy Play therapy 4 Play therapy 5 76075007 6 Play therapy 7 Play therapy (regime/therapy) 8 Play therapy 9 C0032216
alternative label: THER PLAY
alternative label: Play psychotherapy
alternative label: Play Therapies
alternative label: Therapeutic play
alternative label: PLAY THER
alternative label: therapy play

Please rate your ability to do the following activities in the last week
type: Class
subclass of: Questionnaire
comment: 1 MD04851 2 Please rate your ability to do the following activities in the last week 3 None 4 Please rate your ability to do the following activities in the last week 5 246137000 6 equipment 7 Equipment (attribute) 8 equipment 9 C0014672

Plegia
type: Class
subclass of: Musculoskeletal function (Symptom)
comment: 1 M02589 2 Plegia 3 plegias 4 Plegia 5 44695005 6 paralysis 7 Paralysis (finding) 8 Paralysed 9 C0522224
alternative label: plegias

Policies for the production of consumer goods
type: Class
subclass of: Public Policy Factors
comment: 1 MD06713 2 Policies for the production of consumer goods 3 None 4 Policies for the production of consumer goods 5 276339004 6 environment 7 Environment (environment) 8 Policies for the production of consumer goods 9 C2371745

Political life and citizenship
type: Class
subclass of: Sub-Cultural Level
comment: 1 MD06564 2 Political life and citizenship 3 None 4 Political life and citizenship 5 34051000087100 6 Citizenship status (observable entity) 7 Citizenship status 8 Political life and citizenship 9 C2371618

Political policy
type: Class
subclass of: Public Policy Factors
comment: 1 MD06815 2 Political policy 3 None 4 Political policy 5 276339004 6 environment 7 Environment (environment) 8 Political policy 9 C2371836

Political services
type: Class
subclass of: Public Policy Factors
comment: 1 MD06813 2 Political services 3 None 4 Political services 5 224930009 6 services 7 Services (qualifier value) 8 Political services 9 C2371835

Political systems
type: Class
subclass of: Public Policy Factors
comment: 1 MD06814 2 Political systems 3 None 4 Political systems 5 246333005 6 system 7 System (attribute) 8 Political systems 9 C0032381

Pollakisuria
type: Class
subclass of: Urogenital function (Symptom)
comment: 1 M01569 2 Pollakisuria 3 Pollakiuria 4 Pollakisuria 5 162116003 6 Pollakisuria 7 Increased frequency of urination (finding) 8 Pollakisuria 9 C0042023
alternative label: Pollakiuria

Polo
type: Class
subclass of: Sport
comment: 1 M00418 2 Polo 3 None 4 Polo 5 415577004 6 Sport 7 Sport (qualifier value) 8 Sports 9 C0038039

Polyarteritis nodosa
type: Class
subclass of: Functions of Blood System, Metabolic system and Endocrine system (Symptom)
comment: 1 MD00348 2 Polyarteritis nodosa 3 None 4 Polyarteritis nodosa 5 155441006 6 Polyarteritis nodosa 7 Polyarteritis nodosa (disorder) 8 Polyarteritis nodosa 9 C0031036

Polyneuropathy
type: Class
subclass of: Nervous system and Mental function (Symptom)
comment: 1 MD00416 2 Polyneuropathy 3 None 4 Polyneuropathy 5 42345000 6 Polyneuropathy 7 Polyneuropathy (disorder) 8 Polyneuropathy 9 C0152025

Polytrichosis
type: Class
subclass of: Sensory function, Pain and Skin function (Symptom)
comment: 1 M01170 2 Polytrichosis 3 None 4 Polytrichosis 5 29966009 6 Polytrichosis 7 Hypertrichosis (disorder) 8 Hypertrichosis 9 C0020555
alternative label: Polytrichia

Poor hair growth
type: Class
subclass of: Sensory function, Pain and Skin function (Symptom)
comment: 1 M00543 2 Poor hair growth 3 None 4 Poor hair growth 5 247525002 6 Poor hair growth 7 Poor hair growth (finding) 8 Poor hair growth 9 C0423845

Poor sleep pattern
type: Class
subclass of: Duration
comment: 1 M00064 2 Poor sleep pattern 3 None 4 Poor sleep pattern 5 314938000 6 Poor sleep pattern 7 Poor sleep pattern (finding) 8 Poor sleep pattern 9 C1277595

Popliteal pulse
type: Class
subclass of: Cardiovascular system function (Body measurement)
comment: 1 M00213 2 Popliteal pulse 3 None 4 Popliteal pulse 5 74828005 6 Popliteal pulse 7 Popliteal pulse, function (observable entity) 8 Popliteal pulse 9 C0232151

Popliteal pulse absent
type: Class
subclass of: Cardiovascular system function (Symptom)
comment: 1 M00214 2 Popliteal pulse absent 3 None 4 Popliteal pulse absent 5 301168002 6 Popliteal pulse absent 7 Popliteal pulse absent (finding) 8 Popliteal pulse absent 9 C0577857

Popliteal pulse present
type: Class
subclass of: Cardiovascular system function (Body measurement)
comment: 1 M00215 2 Popliteal pulse present 3 None 4 Popliteal pulse present 5 301158007 6 Popliteal pulse present 7 Popliteal pulse present (finding) 8 Popliteal pulse present 9 C0577847

Population
type: Class
subclass of: Characteristics of the community
comment: 1 MD06641 2 Population 3 None 4 Population 5 385436007 6 Population 7 Population (social concept) 8 Population 9 C0032659

Population density
type: Class
subclass of: Characteristics of the community
comment: 1 MD06643 2 Population density 3 None 4 Population density 5 385436007 6 Population 7 Population (social concept) 8 Population density 9 C0032665

Positional vertigo
type: Class
subclass of: Nervous system and Mental function (Symptom)
comment: 1 M00523 2 Positional vertigo 3 vertigo positional 4 Positional vertigo 5 103284002 6 Positional vertigo 7 Positional vertigo (finding) 8 Positional vertigo 9 C0522351
alternative label: vertigo positional

Positive disease
type: Class
subclass of: Hospital information, examination/diagnosis/treatment data
comment: 1 MD00915 2 Positive disease 3 None 4 Positive disease 5 64572001 6 Disease 7 Disease (disorder) 8 Disease 9 C0012634

Post-exercise state
type: Class
subclass of: Health Related Factors
comment: 1 M00256 2 Post-exercise state 3 None 4 Post-exercise state 5 128978002 6 Post-exercise state 7 Post-exercise state (finding) 8 Post-exercise state 9 C1290925

Posterior
type: Class
subclass of: Units
comment: 1 M05862 2 Posterior 3 None 4 Posterior 5 255551008 6 Posterior 7 Posterior (qualifier value) 8 Posterior 9 C0205095

Posterior part of abdomen
type: Class
subclass of: Musculoskeletal function (Body region)
comment: 1 M01871 2 Posterior part of abdomen 3 None 4 Posterior part of abdomen 5 46033001 6 Posterior midline of abdomen 7 Posterior midline of abdomen (body structure) 8 Lumbar Region 9 C0024090

Posterior tibial pulse
type: Class
subclass of: Cardiovascular system function (Body measurement)
comment: 1 M00219 2 Posterior tibial pulse 3 None 4 Posterior tibial pulse 5 421568004 6 Posterior tibial pulse 7 Posterior tibial pulse, function (observable entity) 8 Posterior tibial pulse 9 C1720310

Postural drop in blood pressure
type: Class
subclass of: Cardiovascular system function (Body measurement)
comment: 1 M00127 2 Postural drop in blood pressure 3 None 4 Postural drop in blood pressure 5 271648003 6 Postural drop in blood pressure 7 Postural drop in blood pressure (finding) 8 Postural drop in blood pressure 9 C0428894

Postural exercises
type: Class
subclass of: Aerobic Exercise
comment: 1 M00363 2 Postural exercises 3 None 4 Postural exercises 5 229067001 6 Postural exercises 7 Postural exercises (regime/therapy) 8 Postural exercises 9 C0150716

Potential capabilities
type: Class
subclass of: Questionnaire
comment: 1 MD05230 2 Potential capabilities 3 None 4 Potential capabilities 5 32082000 6 Competence 7 Competence (finding) 8 Capability 9 C2698977

Pouch
type: Class
subclass of: Device
comment: 1 M03474 2 Pouch 3 Pouch Dosing Unit 4 Pouch 5 733012005 6 Pouch 7 Pouch (unit of presentation) 8 Pouch (unit of presentation) 9 C4319584
alternative label: Pouch Dosing Unit

Pound
type: Class
subclass of: Units
comment: 1 M03761 2 Pound 3 lb Pounds lbs 4 Pound 5 258693003 6 pound 7 pounds (qualifier value) 8 pound 9 C0439219
alternative label: Pounds
alternative label: lb
alternative label: lbs

Pound per Square Inch
type: Class
subclass of: Units
comment: 1 M04312 2 Pound per Square Inch 3 pounds/square inch Pounds per square inch lb/sq. in psi 4 Pound per Square Inch 5 259015003 6 Pounds/square inch 7 Pounds/square inch (qualifier value) 8 Pounds/square inch 9 C0439472
alternative label: psi
alternative label: Pounds per square inch
alternative label: lb/sq. in
alternative label: pounds/square inch

Pouting exercises
type: Class
subclass of: Active exercise
comment: 1 M00273 2 Pouting exercises 3 None 4 Pouting exercises 5 229131006 6 Pouting exercises 7 Pouting exercises (regime/therapy) 8 Pouting exercises 9 C0454341

Power Assist
type: Class
subclass of: Device
comment: 1 MD02650 2 Power Assist 3 None 4 Power Assist 5 49062001 6 Device 7 Device (physical object) 8 Devices 9 C0699733

Power of all muscles of the body
type: Class
subclass of: Musculoskeletal function (Body measurement)
comment: 1 MD06050 2 Power of all muscles of the body 3 None 4 Power of all muscles of the body 5 366723006 6 Grade of muscle power - finding 7 Finding of grade of muscle power (finding) 8 Power of all muscles of the body 9 C2371223

Power of isolated muscles and muscle groups
type: Class
subclass of: Musculoskeletal function (Body measurement)
comment: 1 MD06044 2 Power of isolated muscles and muscle groups 3 None 4 Power of isolated muscles and muscle groups 5 366723006 6 Grade of muscle power - finding 7 Finding of grade of muscle power (finding) 8 Power of isolated muscles and muscle groups 9 C2371217

Power of muscles in lower half of the body
type: Class
subclass of: Musculoskeletal function (Body measurement)
comment: 1 MD06047 2 Power of muscles in lower half of the body 3 None 4 Power of muscles in lower half of the body 5 366723006 6 Grade of muscle power - finding 7 Finding of grade of muscle power (finding) 8 Power of muscles in lower half of the body 9 C2371220

Power of muscles of all limbs
type: Class
subclass of: Musculoskeletal function (Body measurement)
comment: 1 MD06048 2 Power of muscles of all limbs 3 None 4 Power of muscles of all limbs 5 366723006 6 Grade of muscle power - finding 7 Finding of grade of muscle power (finding) 8 Power of muscles of all limbs 9 C2371221

Power of muscles of one limb
type: Class
subclass of: Musculoskeletal function (Body measurement)
comment: 1 MD06045 2 Power of muscles of one limb 3 None 4 Power of muscles of one limb 5 366723006 6 Grade of muscle power - finding 7 Finding of grade of muscle power (finding) 8 Power of muscles of one limb 9 C2371218

Power of muscles of one side of the body
type: Class
subclass of: Musculoskeletal function (Body measurement)
comment: 1 MD06046 2 Power of muscles of one side of the body 3 None 4 Power of muscles of one side of the body 5 366723006 6 Grade of muscle power - finding 7 Finding of grade of muscle power (finding) 8 Power of muscles of one side of the body 9 C2371219

Power of muscles of the trunk
type: Class
subclass of: Musculoskeletal function (Body measurement)
comment: 1 MD06049 2 Power of muscles of the trunk 3 None 4 Power of muscles of the trunk 5 366723006 6 Grade of muscle power - finding 7 Finding of grade of muscle power (finding) 8 Power of muscles of the trunk 9 C2371222

Prader-Willi syndrome
type: Class
subclass of: Hospital information, examination/diagnosis/treatment data
comment: 1 MD00390 2 Prader-Willi syndrome 3 None 4 Prader-Willi syndrome 5 89392001 6 Prader-Willi syndrome 7 Prader-Willi syndrome (disorder) 8 Prader-Willi syndrome 9 C0032897

Pre-exercise state
type: Class
subclass of: Health Related Factors
comment: 1 M00257 2 Pre-exercise state 3 None 4 Pre-exercise state 5 128977007 6 Pre-exercise state 7 Pre-exercise state (finding) 8 Pre-exercise state 9 C1290924

Precipitation
type: Class
subclass of: Physical/Chemical Environment
comment: 1 MD06654 2 Precipitation 3 None 4 Precipitation 5 21738005 6 Precipitation 7 Precipitation, function (observable entity) 8 Precipitation 9 C0032932
comment: 1 MD06654 2 Precipitation 3 None 4 Precipitation 5 21738005 6 Precipitation 7 Precipitation, function (observable entity) 8 Precipitation 9 C2584299

Prefer not to say
type: Class
subclass of: Units
comment: 1 MD01922 2 Prefer not to say 3 None 4 Prefer not to say 5 286371003 6 Does not speak 7 Does not speak (finding) 8 Prefer not to say 9 C4697925

Preference of exercise
type: Class
subclass of: Exercise
comment: Exercise Preference of exercise Active exercise 1 M00373 2 Preference of exercise 3 None 4 Preference of exercise 5 225773000 6 Preferences 7 Preferences (qualifier value) 8 preference 9 C0558295

Premature infant
type: Class
subclass of: Classification of Patient
comment: 1 MD00228 2 Premature infant 3 None 4 Premature infant 5 395507008 6 Premature infant 7 Premature infant (finding) 8 Infant, Premature 9 C0021294

Preparing complex meals
type: Class
subclass of: Nutrient intake
comment: 1 MD06425 2 Preparing complex meals 3 None 4 Preparing complex meals 5 286491009 6 Prepares meal 7 Does prepare meal (finding) 8 Preparing complex meals 9 C2371495

Preparing meals
type: Class
subclass of: Nutrient intake
comment: 1 MD06423 2 Preparing meals 3 None 4 Preparing meals 5 129012003 6 Preparing meals 7 Preparing meals (observable entity) 8 Preparing meals 9 C1290962

Preparing simple meals
type: Class
subclass of: Nutrient intake
comment: 1 MD06424 2 Preparing simple meals 3 None 4 Preparing simple meals 5 286491009 6 Prepares meal 7 Does prepare meal (finding) 8 Preparing simple meals 9 C2371494

Preschool education
type: Class
subclass of: Individual Related Factors
comment: 1 MD06512 2 Preschool education 3 None 4 Preschool education 5 409073007 6 Education (procedure) 7 Education (procedure) 8 Preschool education 9 C0871861

Prescription drug
type: Class
subclass of: Hospital information, examination/diagnosis/treatment data
comment: 1 MD03303 2 Prescription drug 3 None 4 Prescription drug 5 33633005 6 Prescription of drug 7 Prescription of drug (procedure) 8 prescription durg 9 C0304227

Pressor Unit
type: Class
subclass of: Units
comment: 1 M05345 2 Pressor Unit 3 Pressor PRESSOR UNITS 4 Pressor Unit 5 767525000 6 unit 7 Unit (qualifier value) 8 Unit 9 C0439190
alternative label: PRESSOR UNITS
alternative label: Pressor

Pressure Biofeedback Unit
type: Class
subclass of: Units
comment: 1 MD04288 2 Pressure Biofeedback Unit 3 None 4 Pressure Biofeedback Unit 5 246137000 6 equipment 7 Equipment (attribute) 8 equipment 9 C0014672

Pretracheal Space
type: Class
subclass of: Digestive function (Body region)
comment: 1 M00929 2 Pretracheal Space 3 None 4 Pretracheal Space 5 44567001 6 Trachea 7 Tracheal structure (body structure) 8 Pretracheal space 9 C2986525

Preventive Dentistry
type: Class
subclass of: Classification of Hospital
comment: 1 MD00666 2 Preventive Dentistry 3 None 4 Preventive Dentistry 5 722163006 6 Dentistry 7 Dentistry (qualifier value) 8 Preventive Dentistry 9 C0033108

Primary
type: Class
subclass of: Units
subclass of: Hospital information, examination/diagnosis/treatment data
comment: Clinical+Disability Hospital information, examination/diagnosis/treatment data None 1 MD00466 2 Primary 3 None 4 Primary 5 63161005 6 Primary 7 Principal (qualifier value) 8 Primary 9 C0205225
comment: Units None None 1 MD00425 2 Primary 3 None 4 Primary 5 63161005 6 Primary 7 Principal (qualifier value) 8 Primary 9 C0205225

Primary Hypersomnia
type: Class
subclass of: Nervous system and Mental function (Symptom)
comment: 1 M02763 2 Primary Hypersomnia 3 None 4 Primary Hypersomnia 5 36124002 6 Primary hypersomnia 7 Primary hypersomnia (disorder) 8 Primary hypersomnia 9 C0033138

Primary care doctor
type: Class
subclass of: Classification of Patient
comment: 1 MD03986 2 Primary care doctor 3 None 4 Primary care doctor 5 309343006 6 Private doctor 7 Private doctor (occupation) 8 Primary care provider 9 C2735026

Primary immunization
type: Class
subclass of: Units
comment: 1 MD00968 2 Primary immunization 3 None 4 Primary immunization 5 359953009 6 Booster vaccination 7 Booster vaccination (procedure) 8 Booster 1 9 C3842581

Prior Smoker
type: Class
subclass of: Classification of Patient
comment: 1 M02147 2 Prior Smoker 3 None 4 Prior Smoker 5 8517006 6 ex-smoker 7 Ex-smoker (finding) 8 Ex-Smokers 9 C4555205

Problem Solving
type: Class
subclass of: Nervous system and Mental function (Body measurement)
comment: 1 MD05694 2 Problem Solving 3 None 4 Problem Solving 5 247581008 6 Problem solving 7 Problem solving (observable entity) 8 Problem solving 9 C0033211

Problems
type: Class
subclass of: Questionnaire
comment: 1 MD04463 2 problems 3 Problems 4 Problems 5 55607006 6 Problem 7 Problem (finding) 8 Problem 9 C0033213

Problems and Improvements
type: Class
subclass of: Questionnaire
comment: 1 MD04462 2 Problems and Improvements 3 None 4 Problems and Improvements 5 390771008 6 Improvement of status 7 Improvement of status (qualifier value) 8 Improvement 9 C2986411

Problems with performing tasks
type: Class
subclass of: Questionnaire
comment: 1 MD04575 2 Problems with performing tasks 3 None 4 Problems with performing tasks 5 266959008 6 Problems at work 7 Problems at work (finding) 8 Problems at work 9 C0425101

Procreation functions
type: Class
subclass of: Urogenital function (Body measurement)
comment: 1 MD06007 2 Procreation functions 3 None 4 Procreation functions 5 386216000 6 Delivery 7 Human parturition, function (observable entity) 8 Procreation functions 9 C2371181

Producing body language
type: Class
subclass of: Health Related Factors
comment: 1 MD06244 2 Producing body language 3 None 4 Producing body language 5 844005 6 Behavior finding 7 Behavior finding (finding) 8 Producing body language 9 C2371348

Producing drawings and photographs
type: Class
subclass of: Health Related Factors
comment: 1 MD06246 2 Producing drawings and photographs 3 None 4 Producing drawings and photographs 5 844005 6 Behavior finding 7 Behavior finding (finding) 8 Producing drawings and photographs 9 C2371350

Producing messages in formal sign language
type: Class
subclass of: Health Related Factors
comment: 1 MD06249 2 Producing messages in formal sign language 3 None 4 Producing messages in formal sign language 5 844005 6 Behavior finding 7 Behavior finding (finding) 8 Producing messages in formal sign language 9 C2371353

Producing nonverbal messages
type: Class
subclass of: Health Related Factors
comment: 1 MD06243 2 Producing nonverbal messages 3 None 4 Producing nonverbal messages 5 844005 6 Behavior finding 7 Behavior finding (finding) 8 Producing nonverbal messages 9 C2371347

Producing signs and symbols
type: Class
subclass of: Health Related Factors
comment: 1 MD06245 2 Producing signs and symbols 3 None 4 Producing signs and symbols 5 844005 6 Behavior finding 7 Behavior finding (finding) 8 Producing signs and symbols 9 C2371349

Production of blood
type: Class
subclass of: Functions of Blood System, Metabolic system and Endocrine system (Body measurement)
comment: 1 MD05854 2 Production of blood 3 None 4 Production of blood 5 178224005 6 blood cell production, function 7 Hematopoiesis, function (observable entity) 8 Production of blood 9 C0018951

Production of mucus
type: Class
subclass of: Respiratory function (Body measurement)
comment: 1 MD05891 2 Production of mucus 3 None 4 Production of mucus 5 49909006 6 Mucus 7 Mucus (substance) 8 Mucous body substance 9 C0026727

Production of tones
type: Class
subclass of: Voice and Speaking (Body measurement)
comment: 1 MD05827 2 Production of tones 3 None 4 Production of tones 5 278288005 6 vocalization 7 Vocalization (finding) 8 vocalization behavior 9 C2754830

Production of voice
type: Class
subclass of: Voice and Speaking (Body measurement)
comment: 1 MD05814 2 Production of voice 3 None 4 Production of voice 5 286328007 6 Produces voice 7 Does produce voice (finding) 8 Production of voice 9 C2370978

Products and technology for communication
type: Class
subclass of: Device
comment: 1 MD06583 2 Products and technology for communication 3 None 4 Products and technology for communication 5 272394005 6 Technique 7 Technique (qualifier value) 8 Products and technology for communication 9 C2371635

Products and technology for education
type: Class
subclass of: Device
comment: 1 MD06588 2 Products and technology for education 3 None 4 Products and technology for education 5 272394005 6 Technique 7 Technique (qualifier value) 8 Products and technology for education 9 C2371640

Products and technology for employment
type: Class
subclass of: Device
comment: 1 MD06593 2 Products and technology for employment 3 None 4 Products and technology for employment 5 272394005 6 Technique 7 Technique (qualifier value) 8 Products and technology for employment 9 C2371645

Products and technology for personal use in daily living
type: Class
subclass of: Device
comment: 1 MD06573 2 Products and technology for personal use in daily living 3 None 4 Products and technology for personal use in daily living 5 272394005 6 Technique 7 Technique (qualifier value) 8 Products and technology for personal use in daily living 9 C2371625

Products and technology for the practice of religion and spirituality
type: Class
subclass of: Device
comment: 1 MD06603 2 Products and technology for the practice of religion and spirituality 3 None 4 Products and technology for the practice of religion and spirituality 5 272394005 6 Technique 7 Technique (qualifier value) 8 Products and technology for the practice of religion and spirituality 9 C2371655

Products and technology of land development
type: Class
subclass of: Device
comment: 1 MD06622 2 Products and technology of land development 3 None 4 Products and technology of land development 5 272394005 6 Technique 7 Technique (qualifier value) 8 Products and technology of land development 9 C2371672

Products and technology of rural land development
type: Class
subclass of: Device
comment: 1 MD06623 2 Products and technology of rural land development 3 None 4 Products and technology of rural land development 5 272394005 6 Technique 7 Technique (qualifier value) 8 Products and technology of rural land development 9 C2371673

Products and technology of suburban land development
type: Class
subclass of: Device
comment: 1 MD06624 2 Products and technology of suburban land development 3 None 4 Products and technology of suburban land development 5 272394005 6 Technique 7 Technique (qualifier value) 8 Products and technology of suburban land development 9 C2371674

Products and technology of urban land development
type: Class
subclass of: Device
comment: 1 MD06625 2 Products and technology of urban land development 3 None 4 Products and technology of urban land development 5 272394005 6 Technique 7 Technique (qualifier value) 8 Products and technology of urban land development 9 C2371675

Products or substances for personal consumption
type: Class
subclass of: Equipment
comment: 1 MD06567 2 Products or substances for personal consumption 3 None 4 Products or substances for personal consumption 5 105590001 6 Substance 7 Substance (substance) 8 Products or substances for personal consumption 9 C2371622

Progressive
type: Class
subclass of: Hospital information, examination/diagnosis/treatment data
comment: 1 MD00456 2 Progressive 3 None 4 Progressive 5 255314001 6 Progressive 7 Progressive (qualifier value) 8 Progressive 9 C0205329

Progressive weight loss
type: Class
subclass of: Hospital information, examination/diagnosis/treatment data
comment: 1 M01621 2 Progressive weight loss 3 None 4 Progressive weight loss 5 161832001 6 Progressive weight loss 7 Weight decreasing (finding) 8 Progressive weight loss 9 C1262477

Prone Bridge
type: Class
subclass of: Muscle Strengthening Exercise
comment: 1 MD04302 2 Prone Bridge 3 None 4 Prone Bridge 5 256235009 6 Exercise 7 Exercise (observable entity) 8 Exercise 9 C0015259

Property
type: Class
subclass of: Units
comment: 1 MD02421 2 Property 3 None 4 Property 5 370130000 6 Property 7 Property (attribute) 8 Property 9 C0871161
comment: 1 MD02421-1 2 Property 3 None 4 Property 5 370130000 6 Property 7 Property (attribute) 8 Property 9 C1264636
comment: 1 MD02421-2 2 Property 3 None 4 Property 5 118598001 6 Property 7 Property (qualifier value) 8 Property 9 C0871161
comment: 1 MD02421-3 2 Property 3 None 4 Property 5 118598001 6 Property 7 Property (qualifier value) 8 Property 9 C1264636

Proprioceptive function
type: Class
subclass of: Sensory function, Pain and Skin function (Body measurement)
comment: 1 MD05783 2 Proprioceptive function 3 None 4 Proprioceptive function 5 405181001 6 Sensory function status: proprioception 7 Sensory function status: proprioception (observable entity) 8 Proprioceptive function 9 C2370956

Prostate
type: Class
subclass of: Urogenital function (Body region)
comment: 1 MD07006 2 Prostate 3 None 4 Prostate 5 41216001 6 Prostate 7 Prostatic structure (body structure) 8 Prostate 9 C0033572

Prosthetic Limb Users
type: Class
subclass of: Classification of Patient
comment: 1 MD04759 2 Prosthetic Limb Users 3 None 4 Prosthetic Limb Users 5 74444006 6 Limb prosthesis 7 Limb prosthesis, device (physical object) 8 limb prosthetic user 9 C0920130

Prosthetic Limb Users Survey of Mobility
type: Class
subclass of: Tool
comment: 1 MD04762 2 Prosthetic Limb Users Survey of Mobility 3 None 4 Prosthetic Limb Users Survey of Mobility 5 273249006 6 Assessment scales 7 Assessment scales (assessment scale) 8 Assessment scales 9 C0450973

Prosthetic rehabilitation
type: Class
subclass of: Musculoskeletal function (Therapy)
comment: 1 M00629 2 Prosthetic rehabilitation 3 None 4 Prosthetic rehabilitation 5 226050009 6 Prosthetic rehabilitation 7 Prosthetic rehabilitation (regime/therapy) 8 Prosthetic rehabilitation 9 C0556028

Prosthodontics
type: Class
subclass of: Classification of Hospital
comment: 1 MD00658 2 Prosthodontics 3 None 4 Prosthodontics 5 408460008 6 Prosthodontics 7 Prosthodontics (qualifier value) 8 Prosthodontic specialty 9 C0033590

Protective functions of the skin
type: Class
subclass of: Sensory function, Pain and Skin function (Body measurement)
comment: 1 MD06105 2 Protective functions of the skin 3 None 4 Protective functions of the skin 5 225424005 6 Protection procedure 7 Protection procedure (procedure) 8 Protective functions of the skin 9 C2371269

Protein metabolism
type: Class
subclass of: Functions of Blood System, Metabolic system and Endocrine system (Body measurement)
comment: 1 MD05951 2 Protein metabolism 3 None 4 Protein metabolism 5 47722004 6 metabolism 7 General metabolic function (observable entity) 8 Protein metabolism 9 C0597299

Proximal third of esophagus
type: Class
subclass of: Digestive function (Body region)
comment: 1 M02295 2 Proximal third of esophagus 3 Proximal third of oesophagus 4 Proximal third of esophagus 5 54738009 6 Proximal third of esophagus 7 Structure of upper third of esophagus (body structure) 8 Proximal third of esophagus 9 C0227187
alternative label: Proximal third of oesophagus

Psoriatic arthropathies
type: Class
subclass of: Musculoskeletal function (Symptom)
comment: 1 MD00527 2 Psoriatic arthropathies 3 None 4 Psoriatic arthropathies 5 399269003 6 Arthropathy 7 Arthropathy (disorder) 8 Arthritis, Psoriatic 9 C0003872

Psychiatirc long-term Care Hospital
type: Class
subclass of: Classification of Hospital
comment: 1 MD00131 2 Psychiatirc long-term Care Hospital 3 None 4 Psychiatirc long-term Care Hospital 5 390808007 6 Mental health care 7 Mental health care (regime/therapy) 8 Long-term care hospital (LTCH) 9 C3845101

Psychiatric hospital
type: Class
subclass of: Classification of Hospital
comment: 1 MD00128 2 Psychiatric hospital 3 None 4 Psychiatric hospital 5 62480006 6 Psychiatric hospital 7 Psychiatric hospital (environment) 8 Psychiatirc hospital 9 C0020021

Psychiatric patient
type: Class
subclass of: Classification of Patient
comment: 1 MD00176 2 Psychiatric patient 3 None 4 Psychiatric patient 5 405777008 6 Psychiatric in-patient 7 Psychiatric in-patient (finding) 8 Psychiatry Specialty 9 C0033873

Psychic stability
type: Class
subclass of: Nervous system and Mental function (Body measurement)
comment: 1 MD05622 2 Psychic stability 3 None 4 Psychic stability 5 36456004 6 Mental state 7 Mental state finding (finding) 8 Psychic stability 9 C2370863

Psychomotor control
type: Class
subclass of: Nervous system and Mental function (Body measurement)
comment: 1 MD05661 2 Psychomotor control 3 None 4 Psychomotor control 5 230460005 6 Psychomotor status 7 Complex partial status epilepticus (disorder) 8 Psychomotor control 9 C2370879

Psychomotor functions
type: Class
subclass of: Nervous system and Mental function (Body measurement)
comment: 1 MD05660 2 Psychomotor functions 3 None 4 Psychomotor functions 5 65401001 6 Psychomotor development, function 7 Psychomotor development, function (observable entity) 8 Psychomotor functions 9 C0033923

Psychotherapy
type: Class
subclass of: Nervous system and Mental function (Therapy)
comment: 1 M00603 2 Psychotherapy 3 Psychotherapies 4 Psychotherapy 5 75516001 6 Psychotherapy 7 Psychotherapy (regime/therapy) 8 Psychotherapy 9 C0033968
alternative label: Psychotherapies

Psychotherapy - cognitive
type: Class
subclass of: Nervous system and Mental function (Therapy)
comment: 1 M00828 2 Psychotherapy - cognitive 3 None 4 Psychotherapy - cognitive 5 183383008 6 Psychotherapy - cognitive 7 Psychotherapy - cognitive (regime/therapy) 8 Cognitive Therapy 9 C0009244

Pubertal functions
type: Class
subclass of: Functions of Blood System, Metabolic system and Endocrine system (Body measurement)
comment: 1 MD05970 2 Pubertal functions 3 None 4 Pubertal functions 5 419960003 6 Pubertal 7 Pubertal (finding) 8 Pubertal functions 9 C2371941

Pubic Area
type: Class
subclass of: Musculoskeletal function (Body region)
comment: 1 M01705 2 Pubic Area 3 Pubic part of abdomen, Pubic region structure, Pubic region 4 Pubic Area 5 11708003 6 Pubic region 7 Hypogastric region structure (body structure) 8 Entire pubic region 9 C1279158
alternative label: Pubic region structure
alternative label: Pubic region
alternative label: Pubic part of abdomen

Pubic hair
type: Class
subclass of: Sensory function, Pain and Skin function (Body region)
comment: 1 MD07126 2 Pubic hair 3 None 4 Pubic hair 5 256893008 6 Entire pubic hair 7 Entire hair of pubis (body structure) 8 Pubic hair 9 C0221988

Public economic entitlements
type: Class
subclass of: Individual Related Factors
comment: 1 MD06537 2 Public economic entitlements 3 None 4 Public economic entitlements 5 224942004 6 Entitlements, legal, financial 7 Entitlements, legal, financial (qualifier value) 8 Public economic entitlements 9 C2371598

Puff Dosing Unit
type: Class
subclass of: Units
comment: 1 M05073 2 Puff Dosing Unit 3 Puff unit dose Puff - unit of product usage Puff puffs 4 Puff Dosing Unit 5 415215001 6 Puff 7 Puff - unit of product usage (qualifier value) 8 Puff 9 C1533107
alternative label: Puff unit dose
alternative label: puffs
alternative label: Puff
alternative label: Puff - unit of product usage

Pulling
type: Class
subclass of: Health Related Factors
comment: 1 MD06323 2 Pulling 3 None 4 Pulling 5 303370007 6 pull 7 Does pull (finding) 8 Pulling 9 C2584320

Pulmonary Tuberculosis
type: Class
subclass of: Digestive function (Symptom)
comment: 1 MD00818 2 Pulmonary Tuberculosis 3 None 4 Pulmonary Tuberculosis 5 154283005 6 Pulmonary tuberculosis 7 Pulmonary tuberculosis (disorder) 8 Tuberculosis, Pulmonary 9 C0041327

Pulmonary alveolar proteinosis
type: Class
subclass of: Functions of Blood System, Metabolic system and Endocrine system (Symptom)
comment: 1 MD00504 2 Pulmonary alveolar proteinosis 3 None 4 Pulmonary alveolar proteinosis 5 10501004 6 Pulmonary alveolar proteinosis 7 Pulmonary alveolar proteinosis (disorder) 8 Pulmonary Alveolar Proteinosis 9 C0034050

Pulmonary valve
type: Class
subclass of: Respiratory function (Body region)
comment: 1 MD00364 2 Pulmonary valve 3 None 4 Pulmonary valve 5 39057004 6 Pulmonary valve 7 Pulmonary valve structure (body structure) 8 Pulmonary valve structure 9 C0034086

Pulmonary ventilation rate
type: Class
subclass of: Respiratory function (Body measurement)
comment: 1 M05894 2 Pulmonary ventilation rate 3 None 4 Pulmonary ventilation rate 5 86290005 6 Respiratory rate 7 Respiratory rate (observable entity) 8 Pulmonary Ventilation 9 C0035213

Pulse deficit
type: Class
subclass of: Cardiovascular system function (Symptom)
comment: 1 M00187 2 Pulse deficit 3 deficit pulse 4 Pulse deficit 5 34624004 6 Pulse deficit 7 Pulse deficit (finding) 8 Pulse deficit 9 C0237313
alternative label: deficit pulse

Pulse fast
type: Class
subclass of: Cardiovascular system function (Symptom)
comment: 1 M01491 2 Pulse fast 3 fast pulse 4 Pulse fast 5 86651002 6 Pulse fast 7 Pulse fast (finding) 8 Tachycardia 9 C0039231
alternative label: fast pulse

Pulse irregular
type: Class
subclass of: Cardiovascular system function (Symptom)
comment: 1 M02186 2 Pulse irregular 3 None 4 Pulse irregular 5 61086009 6 Pulse irregular 7 Pulse irregular (finding) 8 Pulse irregular 9 C0392684

Pulse rate stable
type: Class
subclass of: Cardiovascular system function (Body measurement)
comment: 1 M00197 2 Pulse rate stable 3 None 4 Pulse rate stable 5 301148008 6 Pulse rate stable 7 Pulse rate stable (finding) 8 Pulse rate stable 9 C0577837

Pulse regular
type: Class
subclass of: Cardiovascular system function (Body measurement)
comment: 1 M00198 2 Pulse regular 3 None 4 Pulse regular 5 271636001 6 Pulse regular 7 Pulse regular (finding) 8 Pulse regular 9 C0425565

Pulse regularly irregular
type: Class
subclass of: Cardiovascular system function (Symptom)
comment: 1 M00188 2 Pulse regularly irregular 3 None 4 Pulse regularly irregular 5 271638000 6 Pulse regularly irregular 7 Pulse regularly irregular (finding) 8 Pulse regularly irregular 9 C0425568

Pulse slow
type: Class
subclass of: Cardiovascular system function (Symptom)
comment: 1 M02841 2 Pulse slow 3 None 4 Pulse slow 5 42177007 6 Pulse slow 7 Pulse slow (finding) 8 Pulse slow (finding) 9 C2230138

Pulsed electromagnetic energy therapy
type: Class
subclass of: Musculoskeletal function (Therapy)
comment: 1 M00619 2 Pulsed electromagnetic energy therapy 3 None 4 Pulsed electromagnetic energy therapy 5 229556008 6 Pulsed electromagnetic energy therapy 7 Pulsed electromagnetic energy therapy (regime/therapy) 8 Pulsed electromagnetic energy therapy 9 C0556897

Pulseless
type: Class
subclass of: Cardiovascular system function (Symptom)
comment: 1 M02080 2 Pulseless 3 Pulselessness, PULSE ABSENCE 4 Pulseless 5 54518005 6 Pulseless 7 Absent pulse (finding) 8 Pulseless 9 C0277899
alternative label: PULSE ABSENCE
alternative label: Pulselessness

Pupil constriction observed
type: Class
subclass of: Sensory function, Pain and Skin function (Symptom)
comment: 1 M02698 2 Pupil constriction observed 3 None 4 Pupil constriction observed 5 301939004 6 Constricted pupil 7 Constricted pupil (finding) 8 Constricted pupil 9 C0728710

Pupil dilation
type: Class
subclass of: Hospital information, examination/diagnosis/treatment data
comment: 1 M00531 2 Pupil dilation 3 Pupil dilated pupillary dilatation 4 Pupil dilation 5 37125009 6 Pupil dilation 7 Dilated pupil (finding) 8 Pupil dilation 9 C0026961
alternative label: Pupil dilated
alternative label: pupillary dilatation

Purdue pegboard test
type: Class
subclass of: Tool
comment: 1 MD04163 2 Purdue pegboard test 3 None 4 Purdue pegboard test 5 40317000 6 Purdue pegboard test 7 Purdue pegboard test (procedure) 8 Purdue pegboard test 9 C0204462
comment: 1 MD04164 2 Purdue pegboard test 3 None 4 Purdue pegboard test 5 40317000 6 Purdue pegboard test 7 Purdue pegboard test (procedure) 8 Purdue pegboard test 9 C0204462

PurePulse
type: Class
subclass of: Cardiovascular system function (Body measurement)
comment: 1 MD01774 2 PurePulse 3 None 4 PurePulse 5 8499008 6 Pulse 7 Pulse, function (observable entity) 8 Physiologic pulse 9 C0391850

Push-ups while sitting on a chair
type: Class
subclass of: Muscle Strengthening Exercise
comment: 1 MD02875 2 Push-ups while sitting on a chair 3 None 4 Push-ups while sitting on a chair 5 256235009 6 Exercise 7 Exercise (observable entity) 8 Exercise 9 C0015259

PushTracker
type: Class
subclass of: Device
comment: 1 MD01938 2 PushTracker 3 None 4 PushTracker 5 246137000 6 Equipment 7 Equipment (attribute) 8 Equipment 9 C0014672

PushTracker Battery
type: Class
subclass of: Device
comment: 1 MD01940 2 PushTracker Battery 3 None 4 PushTracker Battery 5 65053001 6 Electrical battery 7 Electrical battery, device (physical object) 8 Electrical battery 9 C0337088 Electrical battery

Pushes today
type: Class
subclass of: Units
comment: 1 MD01913 2 Pushes today 3 None 4 Pushes today 5 303365000 6 Pushed 7 Does push (finding) 8 Does push (finding) 9 C0580841

Pushing
type: Class
subclass of: Health Related Factors
comment: 1 MD06324 2 push 3 pushing 4 Pushing 5 420620005 6 Push 7 Push - dosing instruction imperative (qualifier value) 8 Pushing 9 C2584302

Pushing with lower extremities
type: Class
subclass of: Health Related Factors
comment: 1 MD06311 2 Pushing with lower extremities 3 None 4 Pushing with lower extremities 5 61685007 6 Lower extremity 7 Lower limb structure (body structure) 8 Pushing with lower extremities 9 C2371405

Putting down objects
type: Class
subclass of: Health Related Factors
comment: 1 MD06307 2 Putting down objects 3 None 4 Putting down objects 5 272734009 6 Object 7 Object (attribute) 8 Putting down objects 9 C2371401

Putting on clothes
type: Class
subclass of: Health Related Factors
comment: 1 MD06394 2 Putting on clothes 3 None 4 Putting on clothes 5 272180002 6 Clothes 7 Garment (physical object) 8 Putting on clothes 9 C1998794
alternative label: putting

Putting on footwear
type: Class
subclass of: Health Related Factors
comment: 1 MD06396 2 Putting on footwear 3 None 4 Putting on footwear 5 88063004 6 Footwear 7 Footwear (physical object) 8 Putting on footwear 9 C2584318

Putting the bag on the shelf at eye level
type: Class
subclass of: Health Related Factors
comment: 1 MD04517 2 Putting the bag on the shelf at eye level 3 None 4 Putting the bag on the shelf at eye level 5 844005 6 Behavior finding 7 Behavior finding (finding) 8 Behavior 9 C0004927

Pyrexia
type: Class
subclass of: Hospital information, examination/diagnosis/treatment data
comment: 1 M01021 2 Pyrexia 3 Pyrexial Pyrexias 4 Pyrexia 5 386661006 6 Pyrexia 7 Fever (finding) 8 Fever 9 C0015967
alternative label: Pyrexias
alternative label: Pyrexial

Qualitative platelet defect
type: Class
subclass of: Hospital information, examination/diagnosis/treatment data
comment: 1 MD00303 2 Qualitative platelet 3 None 4 Qualitative platelet defect 5 267532001 6 Qualitative platelet difect 7 Qualitative platelet disorder (disorder) 8 Qualitative platelet deficiency 9 C0235604

Quality Assessment Q
type: Class
subclass of: Questionnaire
comment: 1 MD05561 2 Quality Assessment Q 3 None 4 Quality Assessment Q 5 386053000 6 Assessment 7 Evaluation procedure (procedure) 8 Evaluation 9 C0220825

Quality of consciousness
type: Class
subclass of: Nervous system and Mental function (Body measurement)
comment: 1 MD05601 2 Quality of consciousness 3 None 4 Quality of consciousness 5 106167005 6 Consciousness 7 Consciousness related finding (finding) 8 Quality of consciousness 9 C2370997

Quality of performance
type: Class
subclass of: Questionnaire
comment: 1 MD05592 2 Quality of performance 3 None 4 Quality of performance 5 224404000 6 Quality of work 7 Quality of work (observable entity) 8 Quality of work 9 C0557391

Quality of psychomotor functions
type: Class
subclass of: Nervous system and Mental function (Body measurement)
comment: 1 MD05662 2 Quality of psychomotor functions 3 None 4 Quality of psychomotor functions 5 230460005 6 Psychomotor status 7 Complex partial status epilepticus (disorder) 8 Quality of psychomotor functions 9 C2370880

Quality of sleep
type: Class
subclass of: Individual Related Factors
comment: 1 M00031 2 Quality of sleep 3 None 4 Quality of sleep 5 248254009 6 Quality of sleep 7 Quality of sleep (observable entity) 8 Quality of sleep 9 C0424563

Quality of vision
type: Class
subclass of: Sensory function, Pain and Skin function (Body measurement)
comment: 1 MD05739 2 Quality of vision 3 None 4 Quality of vision 5 246646005 6 quality of visual image 7 Quality of visual image (observable entity) 8 Quality of vision 9 C2370931

Quality of voice
type: Class
subclass of: Voice and Speaking (Body measurement)
comment: 1 MD05815 2 Quality of voice 3 None 4 Quality of voice 5 289188004 6 Finding of quality of voice 7 Finding of quality of voice (finding) 8 Quality of voice 9 C0042943

Quantity Sufficient
type: Class
subclass of: Units
comment: 1 M05244 2 Quantity Sufficient 3 None 4 Quantity Sufficient 5 767525000 6 unit 7 Unit (qualifier value) 8 Unit 9 C0439178
alternative label: quantum sufficiat

Questionable performance
type: Class
subclass of: Questionnaire
comment: 1 MD05595 2 Questionable performance 3 None 4 Questionable performance 5 398166005 6 Performed 7 Performed (qualifier value) 8 Performance 9 C0597198

Quetelet index
type: Class
subclass of: Units
comment: 1 M00436 2 Quetelet index 3 None 4 Quetelet index 5 60621009 6 Quetelet index 7 Body mass index (observable entity) 8 Quetelet index 9 C1305855

Quick DASH
type: Class
subclass of: Units
comment: 1 MD04254 2 Quick DASH 3 None 4 Quick DASH 5 445648000 6 Quick disabilities of the arm shoulder and hand outcome measure score 7 Quick disabilities of the arm shoulder and hand outcome measure score (observable entity) 8 QuickDash outcome measure 9 C4720848

http://www.semanticweb.org/user/ontologies/2023/10/untitled-ontology-5#R
type: Class
subclass of: Units
comment: 1 M03188 2 R 3 None 4 R 5 257974004 6 R 7 Upper case Roman letter R (qualifier value) 8 Upper case Roman letter R 9 C0439117
comment: 1 M03188-1 2 R 3 None 4 R 5 257974004 6 R 7 Upper case Roman letter R (qualifier value) 8 Lower case are 9 C0439142
comment: 1 M03188-2 2 R 3 None 4 R 5 257974004 6 R 7 Upper case Roman letter R (qualifier value) 8 Tumor staging descriptor r 9 C1704239
comment: 1 M03188-3 2 R 3 None 4 R 5 421188008 6 r 7 Tumor staging descriptor r (tumor staging) 8 Upper case Roman letter R 9 C0439117
comment: 1 M03188-4 2 R 3 None 4 R 5 421188008 6 r 7 Tumor staging descriptor r (tumor staging) 8 Lower case are 9 C0439142
comment: 1 M03188-5 2 R 3 None 4 R 5 421188008 6 r 7 Tumor staging descriptor r (tumor staging) 8 Tumor staging descriptor r 9 C1704239
comment: 1 M03188-6 2 R 3 None 4 R 5 420274006 6 r 7 Lower case Roman letter r (qualifier value) 8 Upper case Roman letter R 9 C0439117
comment: 1 M03188-7 2 R 3 None 4 R 5 420274006 6 r 7 Lower case Roman letter r (qualifier value) 8 Lower case are 9 C0439142
comment: 1 M03188-8 2 R 3 None 4 R 5 420274006 6 r 7 Lower case Roman letter r (qualifier value) 8 Tumor staging descriptor r 9 C1704239

RAPID EYE MOVEMENT SLEEP BEHAVIOR DIS
type: Class
subclass of: Nervous system and Mental function (Symptom)
comment: 1 M02719 2 RAPID EYE MOVEMENT SLEEP BEHAVIOR DIS 3 Rapid Eye Movement Sleep Behavior Disorder, Rapid eye movement sleep behaviour disorder, REM sleep behavior disorder, BEHAVIOR DIS RAPID EYE MOVEMENT SLEEP, BEHAVIOR DIS REM, behavior disorders rem sleep, REM BEHAVIOR DIS, REM Behavior Disorder, REM Behavior Disorders, rem behavior sleep disorder, REM sleep behavior dis, REM Sleep Behavior Disorder REM sleep behaviour disorder, REM sleep disorder 4 RAPID EYE MOVEMENT SLEEP BEHAVIOR DIS 5 415238003 6 Rapid eye movement sleep behavior disorder 7 Rapid eye movement sleep behavior disorder (disorder) 8 REM Sleep Behavior Disorder 9 C0751772
alternative label: REM sleep behavior disorder
alternative label: BEHAVIOR DIS REM
alternative label: behavior disorders rem sleep
alternative label: REM Sleep Behavior Disorder
alternative label: rem behavior sleep disorder
alternative label: BEHAVIOR DIS RAPID EYE MOVEMENT SLEEP
alternative label: REM Behavior Disorder
alternative label: REM BEHAVIOR DIS
alternative label: REM Behavior Disorders
alternative label: REM sleep disorder
alternative label: Rapid eye movement sleep behaviour disorder
alternative label: REM sleep behavior dis
alternative label: REM sleep behaviour disorder

REFLEX ABNORM
type: Class
subclass of: Musculoskeletal function (Symptom)
comment: 1 M01312 2 REFLEX ABNORM 3 reflex abnormal REFLEXES ABNORM reflexes abnormal 4 REFLEX ABNORM 5 46670006 6 Abnormal reflex 7 Abnormal reflex (finding) 8 Abnormal reflex 9 C0034933
alternative label: REFLEXES ABNORM
alternative label: reflex abnormal
alternative label: reflexes abnormal

REM sleep
type: Class
subclass of: Individual Related Factors
comment: 1 M00036 2 REM sleep 3 None 4 REM sleep 5 89129007 6 REM sleep 7 Rapid eye movement sleep, function (observable entity) 8 Sleep, REM 9 C0037322

RESPIRATION RATE DECREASED
type: Class
subclass of: Respiratory function (Body measurement)
comment: 1 M01878 2 RESPIRATION RATE DECREASED 3 None 4 RESPIRATION RATE DECREASED 5 86290005 6 Respiratory rate 7 Respiratory rate (observable entity) 8 Slow respiration 9 C0231837

RESPIRATORY RATE DECREASED
type: Class
subclass of: Respiratory function (Body measurement)
comment: 1 M01879 2 RESPIRATORY RATE DECREASED 3 None 4 RESPIRATORY RATE DECREASED 5 86290005 6 Respiratory rate 7 Respiratory rate (observable entity) 8 Slow respiration 9 C0231837

RPM
type: Class
subclass of: Units
comment: 1 MD01104 2 RPM 3 None 4 RPM 5 304618008 6 rpm 7 Revolutions per minute (qualifier value) 8 Revolutions per minute 9 C0582523

Race walking
type: Class
subclass of: Sport
comment: 1 M00420 2 Race walking 3 None 4 Race walking 5 25923005 6 Walking 7 Kayak, device (physical object) 8 Walking (activity) 9 C0080331

Racket Ball
type: Class
subclass of: Sport
comment: 1 M01299 2 Racket Ball 3 Racketball 4 Racket Ball 5 415577004 6 Sport 7 Sport (qualifier value) 8 Racquetball 9 C0034511
comment: 1 M01299-1 2 Racket Ball 3 Racketball 4 Racket Ball 5 256235009 6 exercise 7 Exercise (observable entity) 8 Racquetball 9 C0034511
alternative label: Racquetball
alternative label: Racketball

Radial
type: Class
subclass of: Musculoskeletal function (Body region)
comment: 1 MD04003 2 Radial 3 None 4 Radial 5 261173001 6 Radial 7 Radial (qualifier value) 8 Radial 9 C0442038

Radial abduction
type: Class
subclass of: Musculoskeletal function (Body measurement)
comment: 1 MD04002 2 Radial abduction 3 None 4 Radial abduction 5 60074003 6 Abduction 7 Abduction, function (observable entity) 8 Abduction, function 9 C0231456
comment: 1 MD04005 2 Radial abduction 3 None 4 Radial abduction 5 298969003 6 Range of wrist abduction 7 Range of wrist abduction (observable entity) 8 Range of wrist abduction 9 C0575740

Radial pulse
type: Class
subclass of: Cardiovascular system function (Body measurement)
comment: 1 M00216 2 Radial pulse 3 pulse radial, pulse radials, pulses radial 4 Radial pulse 5 65452004 6 Radial pulse 7 Radial pulse, function (observable entity) 8 Radial pulse, function 9 C0232142
alternative label: pulse radial

Radiant heat therapy
type: Class
subclass of: Hospital information, examination/diagnosis/treatment data
comment: 1 M01782 2 Radiant heat therapy 3 None 4 Radiant heat therapy 5 169421008 6 Radiant heat therapy 7 Infrared radiation therapy (regime/therapy) 8 Radiant heat therapy 9 C0204032

Radiating pain in a dermatome
type: Class
subclass of: Sensory function, Pain and Skin function (Symptom)
comment: 1 MD05808 2 Radiating pain in a dermatome 3 None 4 Radiating pain in a dermatome 5 9972008 6 Radiating pain 7 Radiating pain (finding) 8 Radiating pain in a dermatome 9 C2370972

Radiating pain in a segment or region
type: Class
subclass of: Sensory function, Pain and Skin function (Symptom)
comment: 1 MD05809 2 Radiating pain in a segment or region 3 None 4 Radiating pain in a segment or region 5 9972008 6 Radiating pain 7 Radiating pain (finding) 8 Radiating pain in a segment or region 9 C2370973

Radiation half-value thickness unit
type: Class
subclass of: Units
comment: 1 M03185 2 Radiation half-value thickness unit 3 None 4 Radiation half-value thickness unit 5 282714001 6 Radiation half-value thickness unit 7 Radiation half-value thickness unit (qualifier value) 8 Radiation half-value thickness unit 9 C0560556

Raft
type: Class
subclass of: Sport
comment: 1 M02105 2 Raft 3 Rafting 4 Raft 5 86118007 6 Raft 7 Raft, device (physical object) 8 Raft 9 C0336849
alternative label: Rafting

Raise your arms and legs in a lying position
type: Class
subclass of: Health Related Factors
comment: 1 MD02795 2 Raise your arms and legs in a lying position 3 None 4 Raise your arms and legs in a lying position 5 256235009 6 exercise 7 Exercise (observable entity) 8 Exercise 9 C0015259

Range of Motion Test
type: Class
subclass of: Questionnaire
comment: 1 MD04471 2 Range of Motion Test 3 None 4 Range of Motion Test 5 69212005 6 Range of motion testing 7 Range of motion testing (procedure) 8 Range of motion testing 9 C0204061

Range of emotion
type: Class
subclass of: Nervous system and Mental function (Body measurement)
comment: 1 MD05668 2 Range of emotion 3 None 4 Range of emotion 5 1193647000 6 Range of emotion 7 Range of emotion (observable entity) 8 Range of emotion 9 C2370885

Rapid eye movement sleep
type: Class
subclass of: Individual Related Factors
comment: 1 M01388 2 Rapid eye movement sleep 3 rem Sleep, rem sleeping, sleep rem, REM sleep 4 Rapid eye movement sleep 5 89129007 6 Rapid eye movement sleep 7 Rapid eye movement sleep, function (observable entity) 8 Sleep, REM 9 C0037322
alternative label: sleep rem
alternative label: rem sleeping

Rapid fall of fever
type: Class
subclass of: Immune system function (Symptom)
comment: 1 M00166 2 Rapid fall of fever 3 Fast fall of fever 4 Rapid fall of fever 5 271754008 6 Rapid fall of fever 7 Rapid fall of fever (finding) 8 Rapid fall of fever 9 C0424765
alternative label: Fast fall of fever

Rapid respiration
type: Class
subclass of: Respiratory function (Symptom)
comment: 1 M01863 2 Rapid respiration 3 increased respiratory rate rapid respirations RESPIRATION RATE INCREASED RESPIRATORY RATE INCREASED Rapid breathing 4 Rapid respiration 5 271823003 6 Rapid respiration 7 Tachypnea (finding) 8 Rapid respiration 9 C0231835
alternative label: increased respiratory rate
alternative label: RESPIRATORY RATE INCREASED
alternative label: rapid respirations
alternative label: Rapid breathing
alternative label: RESPIRATION RATE INCREASED

Rash
type: Class
subclass of: Sensory function, Pain and Skin function (Symptom)
comment: 1 M00553 2 Rash 3 Rashses 4 Rash 5 1806006 6 Rash 7 Eruption (morphologic abnormalty) 8 Rash 9 C0302295
comment: 1 M00553-1 2 Rash 3 Rashses 4 Rash 5 271807003 6 Rash 7 Eruption of skin (disorder) 8 Rash 9 C0015230
comment: 1 M00553-2 2 Rash 3 Rashses 4 Rash 5 271807003 6 Rash 7 Eruption of skin (disorder) 8 Rash 9 C0302295
comment: 1 M00553-3 2 Rash 3 Rashses 4 Rash 5 1806006 6 Rash 7 Eruption (morphologic abnormality) 8 Rash 9 C0015230
alternative label: Rashes

Rash and other nonspecific skin eruption
type: Class
subclass of: Sensory function, Pain and Skin function (Symptom)
comment: 1 M00964 2 Rash and other nonspecific skin eruption 3 None 4 Rash and other nonspecific skin eruption 5 271807003 6 Skin eruption 7 Eruption of skin (disorder) 8 Eruption of skin present 9 C5395697

Re-performance chart
type: Class
subclass of: Questionnaire
comment: 1 MD04578 2 Re-performance chart 3 None 4 Re-performance chart 5 398166005 6 Performed 7 Performed (qualifier value) 8 Performance 9 C0597198

Re-satisfaction level
type: Class
subclass of: Questionnaire
comment: 1 MD04579 2 Re-satisfaction level 3 None 4 Re-satisfaction level 5 405153007 6 Personal satisfaction 7 Personal wellbeing status (observable entity) 8 satisfaction 9 C0242428

Reaching
type: Class
subclass of: Health Related Factors
comment: 1 MD06325 2 Reaching 3 None 4 Reaching 5 82679008 6 Reaches 7 Does reach (finding) 8 Reaching 9 C2584321

Reading
type: Class
subclass of: Health Related Factors
comment: 1 MD06175 2 Reading 3 None 4 Reading 5 50360004 6 Reading 7 Reading (observable entity) 8 Reading 9 C0034754

Recent sleep
type: Class
subclass of: Individual Related Factors
comment: 1 MD01783 2 Recent sleep 3 None 4 Recent sleep 5 258158006 6 Sleep 7 Sleep, function (observable entity) 8 Sleep 9 C0037313

Reception of body language
type: Class
subclass of: Nervous system and Mental function (Body measurement)
comment: 1 MD05702 2 Reception of body language 3 None 4 Reception of body language 5 61909002 6 Language 7 Language, function (observable entity) 8 Reception of language 9 C2370899

Reception of language
type: Class
subclass of: Nervous system and Mental function (Body measurement)
comment: 1 MD05698 2 Reception of language 3 None 4 Reception of language 5 61909002 6 Language 7 Language, function (observable entity) 8 Reception of language 9 C2370899

Reception of sign language
type: Class
subclass of: Nervous system and Mental function (Body measurement)
comment: 1 MD05701 2 Reception of sign language 3 None 4 Reception of sign language 5 61909002 6 Language 7 Language, function (observable entity) 8 Reception of sign language 9 C2370897

Reception of spoken language
type: Class
subclass of: Nervous system and Mental function (Body measurement)
comment: 1 MD05699 2 Reception of spoken language 3 None 4 Reception of spoken language 5 61909002 6 Language 7 Language, function (observable entity) 8 Reception of spoken language 9 C2370895

Reception of written language
type: Class
subclass of: Nervous system and Mental function (Body measurement)
comment: 1 MD05700 2 Reception of written language 3 None 4 Reception of written language 5 61909002 6 Language 7 Language, function (observable entity) 8 Reception of written language 9 C2370896

Reciprocal ohm
type: Class
subclass of: Units
comment: 1 M05089 2 Reciprocal ohm 3 None 4 Reciprocal ohm 5 767525000 6 unit 7 Unit (qualifier value) 8 Unit 9 C0439166

Recovery time
type: Class
subclass of: Time
comment: 1 MD01877 2 Recovery time 3 None 4 Recovery time 5 429157007 6 Heart rate recovery time 7 Heart rate recovery time (observable entity) 8 Heart rate recovery time 9 C1997846

Recreation and leisure
type: Class
subclass of: Individual Related Factors
comment: 1 MD06549 2 Recreation and leisure 3 None 4 Recreation and leisure 5 405081003 6 Leisure behavior 7 Leisure behavior (observable entity) 8 Recreation and leisure 9 C2371611

Rectosigmoid Region
type: Class
subclass of: Digestive function (Body region)
comment: 1 M00933 2 Rectosigmoid Region 3 Rectum and Sigmoid Colon, Structure of retroorbital region 4 Rectosigmoid Region 5 81922002 6 Rectosigmoid 7 Rectosigmoid structure (body structure) 8 Rectosigmoid Region 9 C1709868
alternative label: Structure of retroorbital region
alternative label: Rectum and Sigmoid Colon

Red Blood Cell
type: Class
subclass of: Functions of Blood System, Metabolic system and Endocrine system (Body measurement)
comment: 1 MD03060 2 Red Blood Cell 3 None 4 Red Blood Cell 5 41898006 6 Red Blood Cell 7 Erythrocyte (cell) 8 Red blood cell 9 C0014792

Red skin
type: Class
subclass of: Sensory function, Pain and Skin function (Symptom)
comment: 1 M01546 2 Red skin 3 redness of skin, redness skin, reddened skin 4 Red skin 5 70819003 6 Erythema 7 Erythema (morphologic abnormality) 8 Erythema 9 C0041834
alternative label: redness of skin
alternative label: redness skin
alternative label: reddened skin

Reddit
type: Class
subclass of: Units
comment: 1 M05763 2 Reddit 3 None 4 Reddit 5 413568008 6 Application - unit of product usage (qualifier value) 7 Application - unit of product usage (qualifier value) 8 Application dose 9 C1533134

Reference
type: Class
subclass of: Units
comment: 1 MD04663 2 Reference 3 None 4 Reference 5 440379008 6 Referral to 7 Referral to (observable entity) 8 Referring 9 C0205543

Reference left
type: Class
subclass of: Units
comment: 1 MD04665 2 Reference left 3 None 4 Reference left 5 7771000 6 Left 7 Left (qualifier value) 8 Left 9 C0205091

Reference right
type: Class
subclass of: Units
comment: 1 MD04662 2 Reference right 3 None 4 Reference right 5 24028007 6 Right 7 Right (qualifier value) 8 Right 9 C0205090

Referral
type: Class
subclass of: Hospital Administration
comment: 1 MD00222 2 Referral 3 None 4 Referral 5 3457005 6 Referral 7 Patient referral (procedure) 8 Patient referral 9 C0034927

Referral fee
type: Class
subclass of: Hospital Administration
comment: 1 MD00172 2 Referral fee 3 None 4 Referral fee 5 308590000 6 Payment for service procedure 7 Payment for service procedure (procedure) 8 Fees, Medical 9 C0015754

Reflexes generated by noxious stimuli
type: Class
subclass of: Nervous system and Mental function (Body measurement)
comment: 1 MD06072 2 Reflexes generated by noxious stimuli 3 None 4 Reflexes generated by noxious stimuli 5 106146005 6 Reflexes 7 Reflex finding (finding) 8 Reflexes generated by noxious stimuli 9 C2371242

Reflexes generated by other exteroceptive stimuli
type: Class
subclass of: Nervous system and Mental function (Body measurement)
comment: 1 MD06073 2 Reflexes generated by other exteroceptive stimuli 3 None 4 Reflexes generated by other exteroceptive stimuli 5 106146005 6 Reflexes 7 Reflex finding (finding) 8 Reflexes generated by other exteroceptive stimuli 9 C2371243

Refrigerator
type: Class
subclass of: Equipment
comment: 1 MD05386 2 Refrigerator 3 None 4 Refrigerator 5 21546008 6 Refrigerator 7 Refrigerator, device (physical object) 8 Refrigerator 9 C0034958

Regio lateralis
type: Class
subclass of: Hospital information, examination/diagnosis/treatment data
comment: 1 M01377 2 Regio lateralis 3 None 4 Regio lateralis 5 58602004 6 Flank 7 Flank structure (body structure) 8 Flank (surface region) 9 C0230171

Regio lumbalis
type: Class
subclass of: Musculoskeletal function (Body region)
comment: 1 M01883 2 Regio lumbalis 3 None 4 Regio lumbalis 5 1017208001 6 Abdominal lumbar region 7 Structure of abdominal lumbar region (body structure) 8 Lumbar Region 9 C0024090

Regio plantaris
type: Class
subclass of: Musculoskeletal function (Body region)
comment: 1 M02061 2 Regio plantaris 3 None 4 Regio plantaris 5 25593008 6 plantaris 7 Plantaris muscle structure (body structure) 8 Entire plantaris muscle 9 C1305348

Regio pubica
type: Class
subclass of: Musculoskeletal function (Body region)
comment: 1 M01693 2 Regio pubica 3 None 4 Regio pubica 5 66040006 6 Pubis 7 Bone structure of pubis (body structure) 8 Bone structure of pubis 9 C0034014

Regional
type: Class
subclass of: Hospital information, examination/diagnosis/treatment data
comment: 1 MD00412 2 Regional 3 None 4 Regional 5 410674003 6 Regional 7 Regional (qualifier value) 8 Regional 9 C0205147

Registered
type: Class
subclass of: Health Related Factors
comment: 1 MD00555 2 Registered 3 None 4 Registered 5 229053005 6 Registers 7 Registers (qualifier value) 8 Registration 9 C1514821

Registered Cancer Patient
type: Class
subclass of: Classification of Patient
comment: 1 MD00462 2 Registered Cancer Patient 3 None 4 Registered Cancer Patient 5 307927003 6 Patient registered 7 Patient registered (finding) 8 Patient registered 9 C0585825

Regulating behaviours within interactions
type: Class
subclass of: Individual Related Factors
comment: 1 MD06474 2 Regulating behaviours within interactions 3 None 4 Regulating behaviours within interactions 5 844005 6 Behavior finding 7 Behavior finding (finding) 8 Regulating behaviours within interactions 9 C2371544

Regulating defecation
type: Class
subclass of: Health Related Factors
comment: 1 MD06389 2 Regulating defecation 3 None 4 Regulating defecation 5 111989001 6 Defecation 7 Defecation (observable entity) 8 Regulating defecation 9 C2371465

Regulating urination
type: Class
subclass of: Health Related Factors
comment: 1 MD06388 2 Regulating urination 3 None 4 Regulating urination 5 364197005 6 Pattern of urination 7 Pattern of urination (observable entity) 8 Regulating urination 9 C2371464

Regulation of emotion
type: Class
subclass of: Nervous system and Mental function (Body measurement)
comment: 1 MD05667 2 Regulation of emotion 3 None 4 Regulation of emotion 5 285854004 6 Emotion 7 Emotion (observable entity) 8 Regulation of emotion 9 C2370884

Regurgitating
type: Class
subclass of: Digestive function (Symptom)
comment: 1 MD05921 2 Regurgitating 3 None 4 Regurgitating 5 263854006 6 regurgitation 7 Regurgitation - mechanism (qualifier value) 8 Regurgitating 9 C0232606

Rehabilitation
type: Class
subclass of: Musculoskeletal function (Therapy)
comment: 1 M01322 2 Rehabilitation 3 Rehab REHABIL Rehabilitation care Rehabilitation treatment Rehabilitation treatments rehabilitations rehabilitative therapy rehabilitation treatment rehabilitation Functional rehabilitation Rehabilitation therapy care rehabilitation 4 Rehabilitation 5 52052004 6 Rehabilitation 7 Rehabilitation therapy (regime/therapy) 8 Rehabilitation therapy 9 C0034991
comment: 1 M01322-1 2 Rehabilitation 3 Rehab REHABIL Rehabilitation care Rehabilitation treatment Rehabilitation treatments rehabilitations rehabilitative therapy rehabilitation treatment rehabilitation Functional rehabilitation Rehabilitation therapy care rehabilitation" 4 Rehabilitation 5 394602003 6 Rehabilitation 7 Rehabilitation - specialty (qualifier value) 8 Rehabilitation therapy 9 C0034991
alternative label: Rehab
alternative label: REHABIL
alternative label: Rehabilitation treatments
alternative label: rehabilitations
alternative label: Functional rehabilitation
alternative label: care rehabilitation
alternative label: Rehabilitation care
alternative label: Rehabilitation therapy
alternative label: therapy rehabilitation
alternative label: treatment rehabilitation
alternative label: Rehabilitation treatment
alternative label: rehabilitative

Rehabilitation Medicine
type: Class
subclass of: Classification of Hospital
comment: 1 MD00650 2 Rehabilitation Medicine 3 None 4 Rehabilitation Medicine 5 722424008 6 Physical medicine and rehabilitation service 7 Physical medicine and rehabilitation service (qualifier value) 8 Physical and Rehabilitation Medicine 9 C0031813

Rehabilitation Medicine of Korean Medicine
type: Class
subclass of: Classification of Hospital
comment: 1 MD00674 2 Rehabilitation Medicine of Korean Medicine 3 None 4 Rehabilitation Medicine of Korean Medicine 5 722424008 6 Physical medicine and rehabilitation service 7 Physical medicine and rehabilitation service (qualifier value) 8 Physical and Rehabilitation Medicine 9 C0031813

Rehabilitation exercise care
type: Class
subclass of: Musculoskeletal function (Therapy)
comment: 1 M02778 2 Rehabilitation exercise care 3 None 4 Rehabilitation exercise care 5 108305003 6 Rehabilitation exercise care 7 Physical rehabilitation therapy procedure (regime/therapy) 8 Rehabilitation exercise care 9 C1266827

Rehabilitation treatments and procedures
type: Class
subclass of: Musculoskeletal function (Therapy)
comment: 1 M01327 2 Rehabilitation treatments and procedures 3 None 4 Rehabilitation treatments and procedures 5 52052004 6 Rehabilitation treatments and procedures 7 Rehabilitation therapy (regime/therapy) 8 Rehabilitation treatments and procedures 9 C0034991

Rehearsing
type: Class
subclass of: Health Related Factors
comment: 1 MD06138 2 Rehearsing 3 None 4 Rehearsing 5 844005 6 Behavior finding 7 Behavior finding (finding) 8 Rehearsing 9 C2371287

Relapsing
type: Class
subclass of: Hospital information, examination/diagnosis/treatment data
comment: 1 MD00435 2 Relapsing 3 None 4 Relapsing 5 263855007 6 Relapse 7 Relapse phase (qualifier value) 8 Relapse 9 C0035020

Relating with equals
type: Class
subclass of: Individual Related Factors
comment: 1 MD06484 2 Relating with equals 3 None 4 Relating with equals 5 262094002 6 Related 7 Related (finding) 8 Relating with equals 9 C2371555

Relating with persons in authority
type: Class
subclass of: Individual Related Factors
comment: 1 MD06482 2 Relating with persons in authority 3 None 4 Relating with persons in authority 5 262094002 6 Related 7 Related (finding) 8 Relating with persons in authority 9 C2371553

Relating with strangers
type: Class
subclass of: Individual Related Factors
comment: 1 MD06480 2 Relating with strangers 3 None 4 Relating with strangers 5 262094002 6 Related 7 Related (finding) 8 Relating with strangers 9 C2371551

Relating with subordinates
type: Class
subclass of: Individual Related Factors
comment: 1 MD06483 2 Relating with subordinates 3 None 4 Relating with subordinates 5 262094002 6 Related 7 Related (finding) 8 Relating with subordinates 9 C2371554

Relatively dangerous
type: Class
subclass of: Questionnaire
comment: 1 MD04988 2 Relatively dangerous 3 None 4 Relatively dangerous 5 246137000 6 equipment 7 Equipment (attribute) 8 equipment 9 C0014672

Relatively safe
type: Class
subclass of: Questionnaire
comment: 1 MD04989 2 Relatively safe 3 None 4 Relatively safe 5 246137000 6 equipment 7 Equipment (attribute) 8 equipment 9 C0014672

Relaxation exercise
type: Class
subclass of: Aerobic Exercise
comment: 1 M00364 2 Relaxation exercise 3 exercises relaxation 4 Relaxation exercise 5 11609002 6 Relaxation exercise 7 Relaxation exercise (regime/therapy) 8 Relaxation exercise 9 C0203993
alternative label: exercises relaxation

Relaxation therapy
type: Class
subclass of: Musculoskeletal function (Therapy)
comment: 1 M00587 2 Relaxation therapy 3 None 4 Relaxation therapy 5 64299003 6 Relaxation therapy 7 Relaxation training therapy (regime/therapy) 8 Relaxation therapy 9 C0282333

Relaxation training therapy
type: Class
subclass of: Nervous system and Mental function (Therapy)
comment: 1 M02092 2 Relaxation training therapy 3 RELAXATION THER relaxation therapies Relaxation training RT - Relaxation training 4 Relaxation training therapy 5 64299003 6 Relaxation training therapy 7 Relaxation training therapy (regime/therapy) 8 Relaxation training therapy 9 C0282333
alternative label: RELAXATION THER
alternative label: Relaxation training
alternative label: RT - Relaxation training
alternative label: THER RELAXATION
alternative label: therapy relaxation
alternative label: relaxation therapies

Releasing
type: Class
subclass of: Health Related Factors
comment: 1 MD06319 2 release 3 Released 4 Releasing 5 68776005 6 Released 7 Released (qualifier value) 8 Releasing 9 C1283071

Religion and spirituality
type: Class
subclass of: Individual Related Factors
comment: 1 MD06558 2 Religion and spirituality 3 None 4 Religion and spirituality 5 1400009 6 Spiritual or religious belief 7 Spiritual or religious belief (religion/philosophy) 8 Religion and spirituality 9 C0681164

Religious corporation
type: Class
subclass of: Hospital Administration
comment: 1 MD00621 2 Religious corporation 3 None 4 Religious corporation 5 62458008 6 religious 7 Has religious belief (finding) 8 corporation 9 C0683758

Remark
type: Class
subclass of: Units
comment: 1 MD04087 2 Remark 3 None 4 Remark 5 281298000 6 Reference range comments 7 Reference range comments (qualifier value) 8 Reference range comments 9 C0460091

Remittent fever
type: Class
subclass of: Immune system function (Symptom)
comment: 1 M00163 2 Remittent fever 3 None 4 Remittent fever 5 63993003 6 Remittent fever 7 Remittent fever (finding) 8 Remittent fever 9 C0239575

Rendu-Osler-Weber disease
type: Class
subclass of: Functions of Blood System, Metabolic system and Endocrine system (Symptom)
comment: 1 MD00524 2 Rendu-Osler-Weber disease 3 None 4 Rendu-Osler-Weber disease 5 21877004 6 Osler-Rendu-Weber disease 7 Osler hemorrhagic telangiectasia syndrome (disorder) 8 Osler-Rendu-Weber Disease Gene Anomaly Detection Reagents 9 C4729037

Renting a place to live
type: Class
subclass of: Health Related Factors
comment: 1 MD06413 2 Renting a place to live 3 None 4 Renting a place to live 5 264362003 6 Home 7 Home (environment) 8 Renting a place to live 9 C2371484

Repair capability
type: Class
subclass of: Questionnaire
comment: 1 MD05137 2 Repair capability 3 None 4 Repair capability 5 32082000 6 Competence 7 Competence (finding) 8 Capability 9 C2698977

Repair functions of the skin
type: Class
subclass of: Sensory function, Pain and Skin function (Body measurement)
comment: 1 MD06106 2 Repair functions of the skin 3 None 4 Repair functions of the skin 5 72456008 6 Repair of skin 7 Repair of skin (procedure) 8 Repair functions of the skin 9 C2371270

Repeat
type: Class
subclass of: Units
comment: 1 MD02653 2 Repeat 3 None 4 Repeat 5 27582007 6 Repeat 7 Repeat (qualifier value) 8 Repeat 9 C0205341

Replacement equipment
type: Class
subclass of: Equipment
comment: 1 MD04790 2 Replacement equipment 3 None 4 Replacement equipment 5 246137000 6 equipment 7 Equipment (attribute) 8 equipment 9 C0014672

Required or not required No
type: Class
subclass of: Questionnaire
comment: 1 MD05342 2 Required or not required No 3 None 4 Required or not required No 5 373067005 6 No 7 No (qualifier value) 8 No 9 C1298908

Required or not required yes
type: Class
subclass of: Questionnaire
comment: 1 MD05346 2 Required or not required yes 3 None 4 Required or not required yes 5 373066001 6 Yes 7 Yes (qualifier value) 8 Yes 9 C1298907

Requires hand stability and aiming ability
type: Class
subclass of: Questionnaire
comment: 1 MD05100 2 Requires hand stability and aiming ability 3 None 4 Requires hand stability and aiming ability 5 273389003 6 Daily activities questionnaire 7 Daily activities questionnaire (assessment scale) 8 questionnaire 9 C0034394

Requires more than a four-point operation
type: Class
subclass of: Questionnaire
comment: 1 MD05139 2 Requires more than a four-point operation 3 None 4 Requires more than a four-point operation 5 273389003 6 Daily activities questionnaire 7 Daily activities questionnaire (assessment scale) 8 questionnaire 9 C0034394

Requires some hearing
type: Class
subclass of: Questionnaire
comment: 1 MD05110 2 Requires some hearing 3 None 4 Requires some hearing 5 273389003 6 Daily activities questionnaire 7 Daily activities questionnaire (assessment scale) 8 questionnaire 9 C0034394

Requires the ability to create documents or reports in a form
type: Class
subclass of: Questionnaire
comment: 1 MD05136 2 Requires the ability to create documents or reports in a form 3 None 4 Requires the ability to create documents or reports in a form 5 273389003 6 Daily activities questionnaire 7 Daily activities questionnaire (assessment scale) 8 questionnaire 9 C0034394

Requires the ability to read simple instructions and write them in words or sentences
type: Class
subclass of: Questionnaire
comment: 1 MD05135 2 Requires the ability to read simple instructions and write them in words or sentences 3 None 4 Requires the ability to read simple instructions and write them in words or sentences 5 273389003 6 Daily activities questionnaire 7 Daily activities questionnaire (assessment scale) 8 questionnaire 9 C0034394

Resistive exercise
type: Class
subclass of: Muscle Strengthening Exercise
comment: 1 M00379 2 Resistive exercise 3 exercises resistive 4 Resistive exercise 5 40454005 6 Resistive exercise 7 Resistive exercise (regime/therapy) 8 Resistive exercise 9 C0203991
alternative label: exercises resistive

Respect and warmth in relationships
type: Class
subclass of: Individual Related Factors
comment: 1 MD06462 2 Respect and warmth in relationships 3 None 4 Respect and warmth in relationships 5 272151006 6 Relationships 7 Relationships (qualifier value) 8 Respect and warmth in relationships 9 C2371533

Respiration
type: Class
subclass of: Respiratory function (Body measurement)
comment: 1 MD02409 2 Respiration 3 respiratory 4 Respiration 5 719983008 6 Respiration 7 Breathing process (qualifier value) 8 Respiration 9 C0035203
alternative label: respiratory

Respiration functions
type: Class
subclass of: Respiratory function (Body measurement)
comment: 1 MD05872 2 Respiration functions 3 None 4 Respiration functions 5 301282008 6 Finding of respiration 7 Finding of respiration (finding) 8 Respiration functions 9 C2371098

Respiratory disorders
type: Class
subclass of: Body functions of disability
comment: 1 MD00087 2 Respiratory disorders 3 None 4 Respiratory disorders 5 50043002 6 Respiratory disorder 7 Disorder of respiratory system (disorder) 8 Respiratory disorders 9 C0035204

Respiratory distress of newborn
type: Class
subclass of: Respiratory function (Symptom)
comment: 1 MD00357 2 Respiratory distress of newborn 3 None 4 Respiratory distress of newborn 5 1179627006 6 Neonatal respiratory distress 7 Neonatal respiratory distress (finding 8 Respiratory Distress Syndrome, Newborn 9 C0035220

Respiratory muscle functions
type: Class
subclass of: Respiratory function (Body measurement)
comment: 1 MD05878 2 Respiratory muscle functions 3 None 4 Respiratory muscle functions 5 301282008 6 Finding of respiration 7 Finding of respiration (finding) 8 Respiratory muscle functions 9 C2371102

Responsiveness
type: Class
subclass of: Health Related Factors
comment: 1 MD01764 2 Responsiveness 3 None 4 Responsiveness 5 35209006 6 Sensitivity 7 Sensitivity (finding) 8 Reactivity reduced 9 C0457239

Resting heart rate
type: Class
subclass of: Cardiovascular system function (Body measurement)
comment: 1 MD01751 2 Resting heart rate 3 None 4 Resting heart rate 5 444981005 6 Resting heart rate 7 Resting heart rate (observable entity) 8 Resting heart rate 9 C1821417

Restoration of muscle strength needed in daily life
type: Class
subclass of: Hospital information, examination/diagnosis/treatment data
comment: 1 MD02917 2 Restoration of muscle strength needed in daily life 3 None 4 Restoration of muscle strength needed in daily life 5 226029000 6 Exercises 7 Exercises (regime/therapy) 8 Recovery - action 9 C0237820

Results of Evaluation of Existing Basic Daily Life Behavior
type: Class
subclass of: Questionnaire
comment: 1 MD05173 2 Results of Evaluation of Existing Basic Daily Life Behavior 3 None 4 Results of Evaluation of Existing Basic Daily Life Behavior 5 363109007 6 Evaluation of test results 7 Evaluation of test results (procedure) 8 Evaluation of test results 9 C1285276

Retention - symptom
type: Class
subclass of: Urogenital function (Symptom)
comment: 1 M01652 2 Retention - symptom 3 None 4 Retention - symptom 5 36850000 6 Retention 7 Retention (morphologic abnormality) 8 Urinary retention 9 C0080274

Retention of urine
type: Class
subclass of: Urogenital function (Symptom)
comment: 1 M00514 2 Retention of urine 3 None 4 Retention of urine 5 267064002 6 Retention of urine 7 Retention of urine (disorder) 8 Retention of urine 9 C0080274

Retinitis pigmentosa
type: Class
subclass of: Sensory function, Pain and Skin function (Symptom)
comment: 1 MD00484 2 Retinitis pigmentosa 3 None 4 Retinitis pigmentosa 5 28835009 6 Retinitis pigmentosa 7 Retinitis pigmentosa (disorder) 8 Retinitis pigmentosa 9 C0035334

Retrieval and processing of memory
type: Class
subclass of: Nervous system and Mental function (Body measurement)
comment: 1 MD05656 2 Retrieval and processing of memory 3 None 4 Retrieval and processing of memory 5 303116000 6 Memory function 7 Memory function (observable entity) 8 Retrieval and processing of memory 9 C2371929

Retrobulbar area
type: Class
subclass of: Musculoskeletal function (Body region)
comment: 1 M02072 2 Retrobulbar area 3 Retro-Orbital Region, Retroorbital region 4 Retrobulbar area 5 33428000 6 Retrobulbar area 7 Structure of retroorbital region (body structure) 8 Retrobulbar area 9 C0230065
alternative label: Retro-Orbital Region
alternative label: Retroorbital region

Retroperitoneum
type: Class
subclass of: Digestive function (Symptom)
comment: 1 M00950 2 Retroperitoneum 3 Retroperitoneal Space Retroperitoneal Spaces Retroperitoneal Retroperitoneal structure retroperitoneal structures Retroperitoneal compartment Retroperitoneal Cavity 4 Retroperitoneum 5 82849001 6 Retroperitoneum 7 Retroperitoneal compartment structure (body structure) 8 Retroperitoneum 9 C0035359
alternative label: Retroperitoneal
alternative label: Retroperitoneal compartment
alternative label: Retroperitoneal structure
alternative label: Retroperitoneal Space
alternative label: Retroperitoneal Cavity
alternative label: Retroperitoneal Spaces
alternative label: retroperitoneal structures

Revolution per Minute
type: Class
subclass of: Units
comment: 1 M04692 2 Revolution per Minute 3 revolution/minute r/min 4 Revolution per Minute 5 304618008 6 Revolutions per minute 7 Revolutions per minute (qualifier value) 8 revolutions per minute 9 C0582523

Rheumatology
type: Class
subclass of: Classification of Hospital
comment: 1 MD00686 2 Rheumatology 3 None 4 Rheumatology 5 394810000 6 Rheumatology 7 Rheumatology (qualifier value) 8 Rheumatology specialty 9 C0035452

Rhombencephalic Sleep
type: Class
subclass of: Individual Related Factors
comment: 1 M01390 2 Rhombencephalic Sleep 3 None 4 Rhombencephalic Sleep 5 89129007 6 REM sleep 7 Rapid eye movement sleep, function (observable entity) 8 Sleep, REM 9 C0037322

Rhythm of speech
type: Class
subclass of: Voice and Speaking (Body measurement)
comment: 1 MD05821 2 Rhythm of speech 3 None 4 Rhythm of speech 5 37129003 6 speech rhythm 7 Speech rhythm (observable entity) 8 Rhythm of speech 9 C0233723

Rickets
type: Class
subclass of: Hospital information, examination/diagnosis/treatment data
comment: 1 MD00479 2 Rickets 3 None 4 Rickets 5 41345002 6 Rickets 7 Rickets (disorder) 8 Rickets 9 C0035579

Rides a bicycle
type: Class
subclass of: Sport
comment: 1 M01243 2 Rides a bicycle 3 Riding a bicycle 4 Rides a bicycle 5 300648001 6 Rides a bicycle 7 Does ride a bicycle (finding) 8 Rides a bicycle 9 C0577368
alternative label: Riding a bicycle

Riding animals for transportation
type: Class
subclass of: Health Related Factors
comment: 1 MD06367 2 Riding animals for transportation 3 None 4 Riding animals for transportation 5 1137434003 6 Has access to transportation 7 Has access to transportation (finding) 8 Riding animals for transportation 9 C2371448

Right Hypochondriac Region
type: Class
subclass of: Musculoskeletal function (Body region)
comment: 1 M00974 2 Right Hypochondriac Region 3 Right hypochondriac region structure Right hypochondriac part of abdomen Right hypochondrium 4 Right Hypochondriac Region 5 133946002 6 Right hypochondriac region 7 Right hypochondriac region structure (body structure) 8 Right hypochondriac region 9 C0738590

Right Inguinal Region
type: Class
subclass of: Sensory function, Pain and Skin function (Body region)
comment: 1 M01499 2 Right Inguinal Region 3 Right inguinal part of abdomen, Right inguinal region structure 4 Right Inguinal Region 5 37117007 6 Right inguinal region 7 Right inguinal region structure (body structure) 8 Right inguinal region 9 C0230318
alternative label: Right inguinal region structure
alternative label: Right inguinal part of abdomen

Right Lumbar Region
type: Class
subclass of: Musculoskeletal function (Body region)
comment: 1 M01793 2 Right Lumbar Region 3 None 4 Right Lumbar Region 5 1017211000 6 Right lumbar back region 7 Structure of right lumbar region of back (body structure) 8 Right Lumbar Region 9 C1297911

Right hypochondriac region
type: Class
subclass of: Musculoskeletal function (Body region)
comment: 1 M02307 2 Right Hypochondriac Region 3 Right hypochondriac region structure, Right hypochondriac part of abdomen, Right hypochondrium 4 Right hypochondriac region 5 133946002 6 Right hypochondriac region 7 Right hypochondriac region structure (body structure) 8 Right hypochondriac region structure 9 C0738590
alternative label: Right hypochondriac part of abdomen
alternative label: Right hypochondriac region structure
alternative label: Right hypochondrium

Right iliac fossa viewed surgically
type: Class
subclass of: Musculoskeletal function (Body region)
comment: 1 M02323 2 Right iliac fossa viewed surgically 3 None 4 Right iliac fossa viewed surgically 5 43963000 6 Right iliac fossa 7 Structure of right iliac fossa (body structure) 8 Right iliac fossa 9 C0446497

Right iliac region
type: Class
subclass of: Musculoskeletal function (Body region)
comment: 1 M02320 2 Right iliac region 3 None 4 Right iliac region 5 34281002 6 Structure of iliacus muscle 7 Structure of iliacus muscle (body structure) 8 Structure of iliacus muscle 9 C0224418

Right lumbar region
type: Class
subclass of: Limb
comment: 1 M02431 2 Right Lumbar Region 3 Right lumbar region 4 Right lumbar region 5 1017211000 6 Right lumbar back region 7 Structure of right lumbar region of back (body structure) 8 Right Lumbar Region 9 C1297911

Rigid
type: Class
subclass of: Units
comment: 1 MD01925 2 Rigid 3 None 4 Rigid 5 261026009 6 Rigid 7 Rigid (qualifier value) 8 Rigid Behavior 9 C0231517

Ring Dosing Unit
type: Class
subclass of: Units
comment: 1 M05395 2 Ring Dosing Unit 3 None 4 Ring Dosing Unit 5 767525000 6 unit 7 Unit (qualifier value) 8 Ring Dosing Unit 9 C1882954
alternative label: Ring

Ring Finger
type: Class
subclass of: Musculoskeletal function (Body region)
comment: 1 MD04051 2 Ring Finger 3 None 4 Ring Finger 5 82002001 6 Ring finger 7 Ring finger structure (body structure) 8 Ring finger 9 C0230398

Ringing in ears or tinnitus
type: Class
subclass of: Sensory function, Pain and Skin function (Body measurement)
comment: 1 MD05772 2 Ringing in ears or tinnitus 3 None 4 Ringing in ears or tinnitus 5 25906001 6 Disorder of ear 7 Disorder of ear (disorder) 8 Ringing in ears or tinnitus 9 C2370948

Rising phase of fever
type: Class
subclass of: Units
comment: 1 M00167 2 Rising phase of fever 3 None 4 Rising phase of fever 5 248432005 6 Rising phase of fever 7 Rising phase of fever (finding) 8 Rising phase of fever 9 C0424760

Road biking
type: Class
subclass of: Sport
comment: 1 MD00998 2 Road biking 3 None 4 Road biking 5 300648001 6 rides a bicycle 7 Does ride a bicycle (finding) 8 Does ride a bicycle 9 C0577368

Rock climbing
type: Class
subclass of: Sport
comment: 1 M00423 2 Rock climbing 3 None 4 Rock climbing 5 284097000 6 Climbs 7 Does climb (finding) 8 Activity, mountain climbing, rock climbing and wall climbing 9 C2712401
comment: 1 M00423-1 2 Rock climbing 3 None 4 Rock climbing 5 111055000 6 Mountain climbing 7 Mountain climbing (qualifier value) 8 Mountain climbing 9 C0336963
comment: 1 M00423-2 2 Rock climbing 3 None 4 Rock climbing 5 284097000 6 climbs 7 Does climb (finding) 8 climbing 9 C2584300

Roentgen
type: Class
subclass of: Units
comment: 1 M04588 2 Roentgen 3 roentgens R - roentgen 4 Roentgen 5 282720000 6 roentgen 7 roentgen (qualifier value) 8 roentgen 9 C0560562
alternative label: R - roentgen
alternative label: roentgens

Roller skiing
type: Class
subclass of: Sport
comment: 1 MD01060 2 Roller skiing 3 None 4 Roller skiing 5 45033006 6 skiing 7 Skiing (qualifier value) 8 Skiing (recreational activity) 9 C0037264
alternative label: roller skating

Rolling over
type: Class
subclass of: Health Related Factors
comment: 1 MD06283 2 Rolling over 3 None 4 Rolling over 5 282634009 6 Rolls over 7 Does roll over (finding) 8 Rolling over 9 C2584292

Romantic relationships
type: Class
subclass of: Individual Related Factors
comment: 1 MD06502 2 Intimate relationships 3 None 4 Intimate relationships 5 272151006 6 Relationships 7 Relationships (qualifier value) 8 Intimate relationships 9 C2584308

Rope jumping
type: Class
subclass of: Sport
comment: 1 M00424 2 Rope jumping 3 jump rope, Jumping rope, Jump rope 4 Rope jumping 5 9251003 6 Jumping 7 Jumping (observable entity) 8 Jumping rope (activity) 9 C2712409
alternative label: jump rope
alternative label: Jump rope
alternative label: Jumping rope

Rounds
type: Class
subclass of: Units
comment: 1 MD02401 2 Rounds 3 None 4 Rounds 5 767525000 6 unit 7 Unit (qualifier value) 8 unit 9 C0439148

Route
type: Class
subclass of: Units
comment: 1 MD01892 2 Route 3 None 4 Route 5 288524001 6 Courses 7 Courses (qualifier value) 8 Route 9 C0449444

Route of Drug Administration
type: Class
subclass of: Hospital information, examination/diagnosis/treatment data
comment: 1 MD00890 2 Route of Drug Administration 3 None 4 Route of Drug Administration 5 18629005 6 Administration of drug or medicament 7 Administration of drug or medicament (procedure) 8 Administration, Oral 9 C0001563

Rowing
type: Class
subclass of: Active exercise
comment: 1 M00336 2 Rowing 3 None 4 Rowing 5 21249000 6 Rowing boat 7 Rowboat, device (physical object) 8 Activity, rowing, canoeing, kayaking, rafting and tubing 9 C2712393

Rowing machine
type: Class
subclass of: Sport
comment: 1 MD01042 2 Rowing machine 3 Rowing machines 4 Rowing machine 5 21249000 6 Rowing boat 7 Rowboat, device (physical object) 8 Rowing machine 9 C2721288
alternative label: Rowing machines

Rubinstein-Taybi syndrome
type: Class
subclass of: Sensory function, Pain and Skin function (Symptom)
comment: 1 MD00535 2 Rubinstein-Taybi syndrome 3 None 4 Rubinstein-Taybi syndrome 5 45582004 6 Rubinstein-Taybi syndrome 7 Rubinstein-Taybi syndrome (disorder) 8 Rubinstein-Taybi syndrome 9 C0035934

Rugby
type: Class
subclass of: Sport
comment: 1 M00426 2 Rugby 3 Rugby football, Rugbies 4 Rugby 5 415356001 6 Rugby 7 Rugby (qualifier value) 8 Rugby 9 C0035945
alternative label: Rugbies
alternative label: Rugby football

RunKeeper
type: Class
subclass of: Units
comment: 1 M05764 2 RunKeeper 3 None 4 RunKeeper 5 413568008 6 Application - unit of product usage (qualifier value) 7 Application - unit of product usage (qualifier value) 8 Application dose 9 C1533134

Run Cadence
type: Class
subclass of: Units
comment: 1 MD02397 2 Run Cadence 3 None 4 Run Cadence 5 260698009 6 Method of cycling 7 Method of cycling (attribute) 8 cadence 9 C4716180

Running in circles training
type: Class
subclass of: Aerobic Exercise
comment: 1 M00338 2 Running in circles training 3 None 4 Running in circles training 5 229169001 6 Running in circles training 7 Running in circles training (regime/therapy) 8 Running in circles (regime/therapy 9 C0454379

Running on sand
type: Class
subclass of: Sport
comment: 1 MD01045 2 Running on sand 3 None 4 Running on sand 5 418060005 6 running 7 Running (observable entity) 8 Running (physical activity) 9 C0035953

Running straight training
type: Class
subclass of: Aerobic Exercise
comment: 1 M00339 2 Running straight training 3 None 4 Running straight training 5 229167004 6 Running straight training 7 Running straight training (regime/therapy) 8 Running straight training 9 C0454376

Runtastic Squats Trainer
type: Class
subclass of: Units
comment: 1 M05765 2 Runtastic Squats Trainer 3 None 4 Runtastic Squats Trainer 5 413568008 6 Application - unit of product usage (qualifier value) 7 Application - unit of product usage (qualifier value) 8 Application dose 9 C1533134

http://www.semanticweb.org/user/ontologies/2023/10/untitled-ontology-5#S
type: Class
subclass of: Units
comment: 1 M03402 2 S 3 None 4 S 5 257975003 6 S 7 Upper case Roman letter S (qualifier value) 8 Upper case Roman letter S 9 C0439118
comment: 1 M03402-1 2 S 3 None 4 S 5 257975003 6 S 7 Upper case Roman letter S (qualifier value) 8 Lower case Roman letter s 9 C1704767

SCP
type: Class
subclass of: Units
comment: 1 M05321 2 SCP 3 None 4 SCP 5 767525000 6 unit 7 Unit (qualifier value) 8 Unit 9 C0439180

SI joint
type: Class
subclass of: Musculoskeletal function (Body region)
comment: 1 MD04842 2 SI joint 3 None 4 SI joint 5 39723000 6 Sacroiliac joint 7 Sacroiliac joint structure (body structure) 8 SI joint 9 C5453012

SMOKE INHAL INJ
type: Class
subclass of: Sub-Cultural Level
comment: Lifestyle Sub-Cultural Level None 1 M01401 2 INHAL INJ SMOKE 3 INJ SMOKE INHAL 4 SMOKE INHAL INJ 5 426936004 6 Smoke inhalation injury 7 Smoke inhalation injury (disorder) 8 Smoke inhalation injury 9 C0037367

SPPB
type: Class
subclass of: Cardiovascular system function (Body measurement)
comment: 1 MD03104 2 SPPB 3 None 4 SPPB 5 714283000 6 Short Physical Performance Battery 7 Short Physical Performance Battery (assessment scale) 8 Short Physical Performance Battery 9 C4075461

SPUTUM BLOODY
type: Class
subclass of: Respiratory function (Symptom)
comment: 1 M01115 2 SPUTUM BLOODY 3 spitting up blood 4 SPUTUM BLOODY 5 270031000 6 Sputum: contains blood 7 Sputum: contains blood (finding) 8 Sputum: contains blood 9 C0555114
alternative label: spit up blood
alternative label: spitting up blood

Sachet
type: Class
subclass of: Units
comment: 1 M03571 2 Sachet 3 Sachet Dosing Unit 4 Sachet 5 426148002 6 Sachet 7 Sachet - unit of product usage (qualifier value) 8 Sachet Dosing Unit 9 C2348127
comment: 1 M03571-1 2 Sachet 3 Sachet Dosing Unit 4 Sachet 5 426148002 6 Sachet 7 Sachet - unit of product usage (qualifier value) 8 Sachet (unit of presentation) 9 C4319662
comment: 1 M03571-2 2 Sachet 3 Sachet Dosing Unit 4 Sachet 5 733013000 6 Sachet 7 Sachet (unit of presentation) 8 Sachet Dosing Unit 9 C2348127
comment: 1 M03571-3 2 Sachet 3 Sachet Dosing Unit 4 Sachet 5 733013000 6 Sachet 7 Sachet (unit of presentation) 8 Sachet (unit of presentation) 9 C4319662
alternative label: Sachet Dosing Unit

Sacrum
type: Class
subclass of: Musculoskeletal function (Body region)
comment: 1 M00970 2 Sacrum 3 Sacrums, Sacral vertebral column, Sacrums, Sacral bone, Sacral Spine, Sacral, S Spine 4 Sacrum 5 699698002 6 Sacrum 7 Structure of sacral vertebral column (body structure) 8 Bone structure of sacrum 9 C3669209
alternative label: Sacral Spine
alternative label: Sacrums
alternative label: Sacral
alternative label: Sacral vertebral column
alternative label: S Spine
alternative label: Sacral bone

Safe performance
type: Class
subclass of: Questionnaire
comment: 1 MD05571 2 Safe performance 3 None 4 Safe performance 5 398166005 6 Performed 7 Performed (qualifier value) 8 Performance 9 C0597198

Safety
type: Class
subclass of: Questionnaire
comment: 1 MD04986 2 Safety 3 Safety S 4 Safety 5 246137000 6 equipment 7 Equipment (attribute) 8 equipment 9 C0014672
comment: 1 MD05568 2 Safety 3 Safety S 4 Safety 5 260888001 6 Safety device 7 Safety device (attribute) 8 Safety 9 C0036043

Sailing
type: Class
subclass of: Sport
comment: 1 M00428 2 Sailing 3 sail 4 Sailing 5 102400000 6 Sailing 7 Sailing (qualifier value) 8 Sailing 9 C0522727
alternative label: sail

Samples
type: Class
subclass of: Units
comment: 1 MD02392 2 Samples 3 None 4 Samples 5 767525000 6 Unit 7 Unit (qualifier value) 8 Unit 9 C0439148

Sasang Constitutional Medicine
type: Class
subclass of: Classification of Hospital
comment: 1 MD00675 2 Sasang Constitutional Medicine 3 None 4 Sasang Constitutional Medicine 5 773412008 6 Traditional medicine 7 Traditional medicine (regime/therapy) 8 Sasang Constitutional Medicine 9 C5392982

Saturday
type: Class
subclass of: Day
comment: 1 MD01990 2 Saturday 3 None 4 Saturday 5 307151009 6 Saturday 7 Saturday (qualifier value) 8 Saturday 9 C0585030

Scared
type: Class
subclass of: Nervous system and Mental function (Symptom)
comment: 1 M05829 2 Scared 3 None 4 Scared 5 1402001 6 Scared 7 Fear (finding) 8 Scared 9 C0015726

Schizencephaly
type: Class
subclass of: Nervous system and Mental function (Symptom)
comment: 1 MD00532 2 Schizencephaly 3 None 4 Schizencephaly 5 253159001 6 Schizencephaly 7 Schizencephaly (disorder) 8 Schizencephaly 9 C0266484

School education
type: Class
subclass of: Individual Related Factors
comment: 1 MD06513 2 School education 3 None 4 School education 5 409073007 6 Education (procedure) 7 Education (procedure) 8 School education 9 C2584312

Scoop
type: Class
subclass of: Units
comment: 1 M05079 2 Scoop 3 Scoops Scoopful Scoop measurement Scoop - unit of product usage Scoopful Dosing Unit 4 Scoop 5 415505006 6 Scoop 7 Scoop - unit of product usage (qualifier value) 8 Scoop 9 C0183177
comment: 1 M05079-1 2 Scoop 3 Scoops Scoopful Scoop measurement Scoop - unit of product usage Scoopful Dosing Unit 4 Scoop 5 415505006 6 Scoop 7 Scoop - unit of product usage (qualifier value) 8 Scoop 9 C1706491
comment: 1 M05079-2 2 Scoop 3 Scoops Scoopful Scoop measurement Scoop - unit of product usage Scoopful Dosing Unit 4 Scoop 5 705706008 6 Scoop 7 Scoop (physical object) 8 Scoop 9 C0183177
comment: 1 M05079-3 2 Scoop 3 Scoops Scoopful Scoop measurement Scoop - unit of product usage Scoopful Dosing Unit 4 Scoop 5 705706008 6 Scoop 7 Scoop (physical object) 8 Scoop 9 C1706491
alternative label: Scoopful
alternative label: Scoop measurement
alternative label: Scoops
alternative label: Scoopful Dosing Unit

Screening of Activities of daily living
type: Class
subclass of: Questionnaire
comment: 1 MD05333 2 Screening of Activities of daily living 3 Screening of instrumental Activities of daily living 4 Screening of Activities of daily living 5 360156006 6 Screening 7 Screening - procedure intent (qualifier value) 8 Screening 9 C1305399
alternative label: Screening of instrumental Activities of daily living

Screening program
type: Class
subclass of: Hospital Administration
comment: 1 MD00820 2 Screening program 3 None 4 Screening program 5 360156006 6 Screening 7 Screening - procedure intent (qualifier value) 8 Screening procedure 9 C0220908

Scuba diving
type: Class
subclass of: Sport
comment: 1 MD01010 2 Scuba diving 3 None 4 Scuba diving 5 75335000 6 Scuba diving 7 Scuba diving (qualifier value) 8 Scuba diving 9 C0240984

Seasonal variation
type: Class
subclass of: Physical/Chemical Environment
comment: 1 MD06656 2 Seasonal variation 3 None 4 Seasonal variation 5 21864008 6 Seasonal 7 Seasonal course (qualifier value) 8 Seasonal variation 9 C2584332

Seated
type: Class
subclass of: Health Related Factors
comment: 1 MD03227 2 Seated 3 None 4 Seated 5 301998005 6 Ability to move 7 Ability to move (observable entity) 8 Ability to move 9 C0344382

Seated Marching
type: Class
subclass of: Aerobic Exercise
comment: 1 MD02905 2 Seated Marching 3 None 4 Seated Marching 5 256235009 6 Exercise 7 Exercise (observable entity) 8 Exercise 9 C0015259

Sebaceous gland activity
type: Class
subclass of: Sensory function, Pain and Skin function (Body measurement)
comment: 1 M01955 2 Sebaceous gland activity 3 None 4 Sebaceous gland activity 5 53701004 6 Sebaceous gland activity 7 Sebaceous gland activity, function (observable entity) 8 Sebaceous gland activity 9 C0232436

Sebaceous gland secretion
type: Class
subclass of: Sensory function, Pain and Skin function (Body measurement)
comment: 1 M01956 2 Sebaceous gland secretion 3 None 4 Sebaceous gland secretion 5 53701004 6 Sebaceous gland secretion 7 Sebaceous gland activity, function (observable entity) 8 Sebaceous gland secretion 9 C0232436

Sebaceous glands
type: Class
subclass of: Sensory function, Pain and Skin function (Body region)
comment: 1 MD07114 2 Sebaceous glands 3 None 4 Sebaceous glands 5 1028005 6 Sebaceous gland 7 Sebaceous gland structure (body structure) 8 Sebaceous glands 9 C0036505

Sebum secretion
type: Class
subclass of: Sensory function, Pain and Skin function (Symptom)
comment: 1 M00243 2 Sebum secretion 3 None 4 Sebum secretion 5 53701004 6 Sebum secretion 7 Sebaceous gland activity, function (observable entity) 8 Sebaceous gland activity 9 C0232436

Second
type: Class
subclass of: Time patterns
comment: 1 M04469 2 Second 3 Seconds secs seconds sec 4 Second 5 81170007 6 Second 7 Second (qualifier value) 8 Second 9 C0205436
alternative label: seconds
alternative label: secs
alternative label: sec

Second hand cigarette smoke
type: Class
subclass of: Sub-Cultural Level
comment: Lifestyle Sub-Cultural Level None 1 M00112 2 Second hand cigarette smoke 3 None 4 Second hand cigarette smoke 5 102409004 6 Second hand cigarette smoke 7 Second hand cigarette smoke (substance) 8 Second hand cigarette smoke 9 C0522733

Secondary
type: Class
subclass of: Units
comment: 1 MD00590 2 Secondary 3 None 4 Secondary 5 2603003 6 Secondary 7 Secondary (qualifier value) 8 Secondary to 9 C0175668

Secondary immunization
type: Class
subclass of: Units
comment: 1 MD00969 2 Secondary immunization 3 None 4 Secondary immunization 5 359953009 6 Booster vaccination 7 Booster vaccination (procedure) 8 Booster 2 9 C3842580

Secretion
type: Class
subclass of: Urogenital function (Symptom)
comment: 1 MD00789 2 Secretion 3 None 4 Secretion 5 3318003 6 vaginal secretion 7 Vaginal secretion (substance) 8 vaginal secretion 9 C0392908

Seeing functions
type: Class
subclass of: Sensory function, Pain and Skin function (Body measurement)
comment: 1 MD05730 2 Seeing functions 3 None 4 Seeing functions 5 281004000 6 Visual function 7 Visual function (observable entity) 8 Seeing functions 9 C0042789

Seeking employment
type: Class
subclass of: Individual Related Factors
comment: 1 MD06520 2 Seeking employment 3 None 4 Seeking employment 5 302768007 6 Employment finding 7 Employment finding (finding) 8 Seeking employment 9 C0557369

Segment of palm
type: Class
subclass of: Sensory function, Pain and Skin function (Body region)
comment: 1 M01958 2 Segment of palm 3 Subdivision of palm, Palm subdivision 4 Segment of palm 5 21547004 6 palm 7 Palm (region) structure (body structure) 8 Palm of hand 9 C0817662
alternative label: Subdivision of palm
alternative label: Palm subdivision

Seizure
type: Class
subclass of: Nervous system and Mental function (Symptom)
comment: 1 M00515 2 Seizure 3 seizured, sz 4 Seizure 5 91175000 6 Seizure 7 Seizure (finding) 8 Seizures 9 C0036572
alternative label: sz
alternative label: seizure d
alternative label: SZ

Selection of training required items
type: Class
subclass of: Questionnaire
comment: 1 MD05201 2 Selection of training required items 3 None 4 Selection of training required items 5 701085006 6 Social-behavior assistive training device 7 Social-behavior assistive training device (physical object) 8 Social-behavior assistive training device 9 C3876619

Self-test
type: Class
subclass of: Tool
comment: 1 MD00201 2 Self-test 3 None 4 Self-test 5 272393004 6 Tests 7 Tests (qualifier value) 8 Tests (qualifier value) 9 C0392366

Self employment
type: Class
subclass of: Individual Related Factors
comment: 1 MD06526 2 Self employment 3 None 4 Self employment 5 224363007 6 Employment 7 Employed (finding) 8 Self-employed 9 C0425092

Semicircular canals
type: Class
subclass of: Sensory function, Pain and Skin function (Body region)
comment: 1 MD06882 2 Semicircular canals 3 None 4 Semicircular canals 5 117590005 6 ear structure 7 Ear structure (body structure) 8 Semicircular canals 9 C0036622

Send an email
type: Class
subclass of: Health Related Factors
comment: 1 MD05464 2 Send an email 3 None 4 Send an email 5 445678009 6 Email report 7 Email report (record artifact) 8 Email 9 C0013849

Sensation of abdominal cramp
type: Class
subclass of: Digestive function (Body measurement)
comment: 1 MD05944 2 Sensation of abdominal cramp 3 None 4 Sensation of abdominal cramp 5 55300003 6 cramp 7 Cramp (finding) 8 Abdominal Cramps 9 C0000729

Sensation of falling
type: Class
subclass of: Sensory function, Pain and Skin function (Body measurement)
comment: 1 MD05774 2 Sensation of falling 3 None 4 Sensation of falling 5 249989007 6 Sensation of falling 7 Sensation of falling (finding) 8 Sensation of falling 9 C0427116

Sensation of muscle spasm
type: Class
subclass of: Musculoskeletal function (Symptom)
comment: 1 MD06099 2 Sensation of muscle spasm 3 None 4 Sensation of muscle spasm 5 277426005 6 Sensation of movement 7 Sensation of movement (finding) 8 Sensation of muscle spasm 9 C2371261

Sensation of muscle stiffness
type: Class
subclass of: Musculoskeletal function (Body measurement)
comment: 1 MD06098 2 Sensation of muscle stiffness 3 None 4 Sensation of muscle stiffness 5 277426005 6 Sensation of movement 7 Sensation of movement (finding) 8 Sensation of muscle stiffness 9 C2371260

Sensation of nausea
type: Class
subclass of: Digestive function (Symptom)
comment: 1 MD05942 2 Sensation of nausea 3 None 4 Sensation of nausea 5 422587007 6 nausea 7 Nausea (finding) 8 Sensation of nausea 9 C2371136

Sensation of pain
type: Class
subclass of: Sensory function, Pain and Skin function (Symptom)
comment: 1 MD05793 2 Sensation of pain 3 None 4 Sensation of pain 5 421833007 6 Finding of pain sense 7 Finding of pain sense (finding) 8 Sensation of pain 9 C3714605

Sensation related to the skin
type: Class
subclass of: Sensory function, Pain and Skin function (Body measurement)
comment: 1 MD06108 2 Sensation related to the skin 3 None 4 Sensation related to the skin 5 297971001 6 Finding of sensation of skin 7 Finding of sensation of skin (finding) 8 Sensation related to the skin 9 C2371272

Sensations associated with cardiovascular and respiratory functions
type: Class
subclass of: Cardiovascular system function (Body measurement)
comment: 1 MD05903 2 Sensations associated with cardiovascular and respiratory functions 3 None 4 Sensations associated with cardiovascular and respiratory functions 5 272144002 6 Sensation 7 Sensation quality (qualifier value) 8 Sensations associated with cardiovascular and respiratory functions 9 C2371109

Sensations associated with genital and reproductive functions
type: Class
subclass of: Urogenital function (Body measurement)
comment: 1 MD06014 2 Sensations associated with genital and reproductive functions 3 None 4 Sensations associated with genital and reproductive functions 5 272144002 6 sensation 7 Sensation quality (qualifier value) 8 Sensations associated with genital and reproductive functions 9 C2371187

Sensations associated with genital functions
type: Class
subclass of: Urogenital function (Body measurement)
comment: 1 MD06018 2 Sensations associated with genital functions 3 None 4 Sensations associated with genital functions 5 300479008 6 Genital finding 7 Genital finding (finding) 8 Genital finding 9 C0577203

Sensations associated with hearing and vestibular function
type: Class
subclass of: Sensory function, Pain and Skin function (Body measurement)
comment: 1 MD05771 2 Sensations associated with hearing and vestibular function 3 None 4 Sensations associated with hearing and vestibular function 5 247331000 6 Ear sensations 7 Ear sensations (observable entity) 8 Sensations associated with hearing and vestibular function 9 C2370947

Sensations associated with menopause
type: Class
subclass of: Urogenital function (Body measurement)
comment: 1 MD06017 2 Sensations associated with menopause 3 None 4 Sensations associated with menopause 5 276477006 6 Menopause finding 7 Menopause finding (finding) 8 Menopause finding 9 C0455962

Sensations associated with sexual intercourse
type: Class
subclass of: Urogenital function (Body measurement)
comment: 1 MD06015 2 Sensations associated with sexual intercourse 3 None 4 Sensations associated with sexual intercourse 5 70256003 6 SI - sexual intercourse 7 Finding of sexual intercourse (finding) 8 Sexual intercourse - finding 9 C1314687

Sensations associated with the digestive system
type: Class
subclass of: Digestive function (Body measurement)
comment: 1 MD05941 2 Sensations associated with the digestive system 3 None 4 Sensations associated with the digestive system 5 272144002 6 sensation 7 Sensation quality (qualifier value) 8 Sensations associated with the digestive system 9 C2371135

Sensations associated with the eye and adjoining structures
type: Class
subclass of: Sensory function, Pain and Skin function (Body measurement)
comment: 1 MD05755 2 Sensations associated with the eye and adjoining structures 3 None 4 Sensations associated with the eye and adjoining structures 5 301910004 6 finding of sensation of eye 7 Finding of sensation of eye (finding) 8 Sensations associated with the eye and adjoining structures 9 C2370938

Sensations associated with the menstrual cycle
type: Class
subclass of: Urogenital function (Body measurement)
comment: 1 MD06016 2 Sensations associated with the menstrual cycle 3 None 4 Sensations associated with the menstrual cycle 5 276319003 6 menstruation finding 7 Finding of menstrual bleeding (finding) 8 Finding of menstrual bleeding 9 C0567305

Sensations associated with urinary functions
type: Class
subclass of: Urogenital function (Symptom)
comment: 1 MD05990 2 Sensations associated with urinary functions 3 None 4 Sensations associated with urinary functions 5 364189003 6 Sensation of bladder 7 Sensation of bladder (observable entity) 8 Sensations associated with urinary functions 9 C2371168

Sensations related to muscles and movement functions
type: Class
subclass of: Musculoskeletal function (Body measurement)
comment: 1 MD06097 2 Sensations related to muscles and movement functions 3 None 4 Sensations related to muscles and movement functions 5 277426005 6 Sensation of movement 7 Sensation of movement (finding) 8 Sensations related to muscles and movement functions 9 C2371259

Sensitivity to a noxious stimulus
type: Class
subclass of: Sensory function, Pain and Skin function (Body measurement)
comment: 1 MD05789 2 Sensitivity to a noxious stimulus 3 None 4 Sensitivity to a noxious stimulus 5 35209006 6 sensitivity 7 Sensitivity (finding) 8 Sensitivity to a noxious stimulus 9 C2370962

Sensitivity to pressure
type: Class
subclass of: Sensory function, Pain and Skin function (Body measurement)
comment: 1 MD05788 2 Sensitivity to pressure 3 None 4 Sensitivity to pressure 5 397645001 6 pressure sense 7 Baresthesia, function (observable entity) 8 Sensitivity to pressure 9 C2370961

Sensitivity to temperature
type: Class
subclass of: Sensory function, Pain and Skin function (Body measurement)
comment: 1 MD05786 2 Sensitivity to temperature 3 None 4 Sensitivity to temperature 5 299902004 6 Finding of temperature sense 7 Finding of temperature sense (finding) 8 Sensitivity to temperature 9 C2370959

Sensitivity to vibration
type: Class
subclass of: Sensory function, Pain and Skin function (Body measurement)
comment: 1 MD05787 2 Sensitivity to vibration 3 None 4 Sensitivity to vibration 5 299932007 6 Finding of vibration sense 7 Finding of vibration sense (finding) 8 Sensitivity to vibration 9 C2370960

Sensory functions related to temperature and other stimuli
type: Class
subclass of: Sensory function, Pain and Skin function (Body measurement)
comment: 1 MD05785 2 Sensory functions related to temperature and other stimuli 3 None 4 Sensory functions related to temperature and other stimuli 5 106148006 6 sensory function status: proprioception 7 Sensory function (observable entity) 8 Sensory functions related to temperature and other stimuli 9 C2370958

Serious danger
type: Class
subclass of: Questionnaire
comment: 1 MD05574 2 Serious danger 3 None 4 Serious danger 5 15508007 6 High risk of 7 High risk of (contextual qualifier) (qualifier value) 8 Serious Risk 9 C4684773

Services for the production of consumer goods
type: Class
subclass of: Public Policy Factors
comment: 1 MD06711 2 Services for the production of consumer goods 3 None 4 Services for the production of consumer goods 5 224930009 6 services 7 Services (qualifier value) 8 Services for the production of consumer goods 9 C2371743

Settled in mood
type: Class
subclass of: Nervous system and Mental function (Body measurement)
comment: 1 M02631 2 Settled in mood 3 None 4 Settled in mood 5 225658008 6 Settled in mood 7 Mood stable (finding) 8 Mood stable 9 C0558223

Severe deficit
type: Class
subclass of: Units
comment: 1 MD04489 2 Severe deficit 3 None 4 Severe deficit 5 246199000 6 Deficiency 7 Deficiency (attribute) 8 Deficit 9 C2987487

Severe leg strain
type: Class
subclass of: Musculoskeletal function (Symptom)
comment: 1 MD05069 2 Severe leg strain 3 None 4 Severe leg strain 5 285391000 6 Strain of muscle of lower limb 7 Strain of muscle of lower limb (disorder) 8 Strain of muscle of lower limb 9 C0563280

Severe physical activity
type: Class
subclass of: Aerobic Exercise
comment: 1 MD00039 2 Severe physical activity 3 None 4 Severe physical activity 5 68130003 6 Physical activity 7 Physical activity (observable entity) 8 Physical activity 9 C0026606

Severe vertigo
type: Class
subclass of: Nervous system and Mental function (Symptom)
comment: 1 M00524 2 Severe vertigo 3 vertigo severe 4 Severe vertigo 5 103298005 6 Severe vertigo 7 Severe vertigo (finding) 8 Severe vertigo 9 C0522365
alternative label: vertigo severe

Sexual functions
type: Class
subclass of: Urogenital function (Body measurement)
comment: 1 MD05992 2 Sexual functions 3 None 4 Sexual functions 5 76859005 6 Sexual function 7 Sexual function (observable entity) 8 Sexual functions 9 C0278092

Sexual psychotherapy
type: Class
subclass of: Urogenital function (Therapy)
comment: 1 M00613 2 Sexual psychotherapy 3 None 4 Sexual psychotherapy 5 63386006 6 Sexual psychotherapy 7 Sexual psychotherapy (regime/therapy) 8 Sexual psychotherapy 9 C0204567

Sexual relationships
type: Class
subclass of: Individual Related Factors
comment: 1 MD06505 2 Sexual relationships 3 None 4 Sexual relationships 5 228467001 6 Casual sexual relationship 7 Casual sexual relationship (finding) 8 Sexual relationships 9 C2371571

Shaft of penis
type: Class
subclass of: Urogenital function (Body region)
comment: 1 MD07003 2 Shaft of penis 3 None 4 Shaft of penis 5 75279004 6 Shaft of penis 7 Corpus penis structure (body structure) 8 Shaft of penis 9 C0227936

Sharing attention
type: Class
subclass of: Nervous system and Mental function (Body measurement)
comment: 1 MD05650 2 Sharing attention 3 None 4 Sharing attention 5 6769007 6 Attention 7 Attention function (observable entity) 8 Sharing attention 9 C2370876

Sharp
type: Class
subclass of: Sensory function, Pain and Skin function (Symptom)
comment: 1 MD04079 2 Sharp 3 None 4 Sharp 5 410707003 6 Sharp 7 Sharp sensation quality (qualifier value) 8 Sharp 9 C1444775

Shift
type: Class
subclass of: Health Related Factors
comment: 1 MD02086 2 Shift 3 None 4 Shift 5 9546005 6 Shift 7 Shift (morphologic abnormality) 8 Shift 9 C0333051
comment: 1 MD02086-1 2 Shift 3 None 4 Shift 5 255324009 6 Movement 7 Movement (observable entity) 8 Shift 9 C0333051

Shifting attention
type: Class
subclass of: Nervous system and Mental function (Body measurement)
comment: 1 MD05648 2 Shifting attention 3 None 4 Shifting attention 5 6769007 6 Attention 7 Attention function (observable entity) 8 Shifting attention 9 C2370875

Sholder Joint
type: Class
subclass of: Musculoskeletal function (Body region)
comment: 1 M02156 2 Sholder Joint 3 None 4 Sholder Joint 5 85537004 6 shoulder joint 7 Glenohumeral joint structure (body structure) 8 Joint structure of shoulder region 9 C0037009

Shopping
type: Class
subclass of: Health Related Factors
comment: 1 MD05234 2 Shopping 3 None 4 Shopping 5 129011005 6 Shopping 7 Shopping (observable entity) 8 Shopping 9 C0150768

Short-term memory
type: Class
subclass of: Nervous system and Mental function (Body measurement)
comment: 1 MD05654 2 Short-term memory 3 None 4 Short-term memory 5 363888004 6 Memory performance 7 Memory performance (observable entity) 8 Short-term memory 9 C0025265

Short Physical Performance Battery
type: Class
subclass of: Tool
comment: 1 MD03640 2 Short Physical Performance Battery 3 None 4 Short Physical Performance Battery 5 714341008 6 Assessment using Short Physical Performance Battery (procedure) 7 Assessment using Short Physical Performance Battery (procedure) 8 Assessment using Short Physical Performance Battery 9 C4075489

Short stature
type: Class
subclass of: Musculoskeletal function (Symptom)
comment: 1 MD00389 2 Short stature 3 None 4 Short stature 5 237836003 6 Short stature 7 Short stature disorder (disorder) 8 Dwarfism 9 C0013336

Shortness of breath dyspnea
type: Class
subclass of: Respiratory function (Symptom)
comment: 1 M00906 2 Shortness of breath dyspnea 3 None 4 Shortness of breath dyspnea 5 267036007 6 Shortness of breath 7 Dyspnea (finding) 8 Dyspnoea 9 C0013404

Shot
type: Class
subclass of: Units
comment: 1 M03600 2 Shot 3 Shot Dosing Unit 4 Shot 5 408102007 6 Unit dose 7 Unit dose (qualifier value) 8 Shot Dosing Unit 9 C0439148
alternative label: Shot Dosing Unit

Shoulder exercises
type: Class
subclass of: Limb
comment: 1 M00308 2 Shoulder exercises 3 exercise shoulder, exercise shoulders, exercises shoulder, exercises shoulders, shoulder exercise 4 Shoulder exercises 5 229112000 6 Shoulder exercises 7 Shoulder exercises (regime/therapy) 8 Shoulder exercises 9 C0454323
alternative label: exercises shoulders
alternative label: exercises shoulder
alternative label: shoulder exercise
alternative label: exercise shoulder
alternative label: exercise shoulders

Shoulder exercises in water
type: Class
subclass of: Active exercise
comment: 1 M00309 2 Shoulder exercises in water 3 None 4 Shoulder exercises in water 5 229181002 6 Shoulder exercises in water 7 Shoulder exercises in water (regime/therapy) 8 Shoulder exercises in water 9 C0454390

Shoulder girdle exercises
type: Class
subclass of: Active exercise
comment: 1 M00310 2 Shoulder girdle exercises 3 None 4 Shoulder girdle exercises 5 229110008 6 Shoulder girdle exercises 7 Shoulder girdle exercises (regime/therapy) 8 Shoulder girdle exercises 9 C0454321

Shoulder girdle exercises in water
type: Class
subclass of: Active exercise
comment: 1 M00311 2 Shoulder girdle exercises in water 3 None 4 Shoulder girdle exercises in water 5 229180001 6 Shoulder girdle exercises in water 7 Shoulder girdle exercises in water (regime/therapy) 8 Shoulder girdle exercises in water 9 C0454389

Shoulder pendular exercises
type: Class
subclass of: Active exercise
comment: 1 M00312 2 Shoulder pendular exercises 3 None 4 Shoulder pendular exercises 5 229113005 6 Shoulder pendular exercises 7 Shoulder pendular exercises (regime/therapy) 8 Shoulder pendular exercises 9 C0454324

Shoulder shrugging
type: Class
subclass of: Health Related Factors
comment: 1 M02404 2 Shoulder shrugging 3 shoulder shrug 4 Shoulder shrugging 5 229111007 6 Shoulder shrugging 7 Shoulder shrugging exercises (regime/therapy) 8 Shoulder shrugging exercises 9 C0454322
alternative label: shoulder shrug

Shoulder shrugging exercises
type: Class
subclass of: Active exercise
comment: 1 M00313 2 Shoulder shrugging exercises 3 None 4 Shoulder shrugging exercises 5 229111007 6 Shoulder shrugging exercises 7 Shoulder shrugging exercises (regime/therapy) 8 Shoulder shrugging exercises 9 C0454322

Shovelboard
type: Class
subclass of: Sport
comment: 1 M05876 2 Shovelboard 3 Shovel-board 4 Shovelboard 5 415577004 6 Sport 7 Sport (qualifier value) 8 Sports 9 C0038039
alternative label: Shovel-board

Shows the actions that the tester will perform first.
type: Class
subclass of: Questionnaire
comment: 1 MD04821 2 Shows the actions that the tester will perform first. 3 None 4 Shows the actions that the tester will perform first. 5 246137000 6 equipment 7 Equipment (attribute) 8 equipment 9 C0014672

Shuffleboard
type: Class
subclass of: Sport
comment: 1 M00429 2 Shuffleboard 3 Shuffle-board 4 Shuffleboard 5 415577004 6 Sport 7 Sport (qualifier value) 8 Sports 9 C0038039
alternative label: Shuffle-board

Sibling relationships
type: Class
subclass of: Individual Related Factors
comment: 1 MD06498 2 Sibling relationships 3 None 4 Sibling relationships 5 272151006 6 Relationships 7 Relationships (qualifier value) 8 Sibling relationships 9 C0037046

Siemens
type: Class
subclass of: Units
comment: 1 M05088 2 Siemens 3 Units Of Measure - Siemens 4 Siemens 5 767525000 6 unit 7 Unit (qualifier value) 8 Unit 9 C0439165
alternative label: Units Of Measure - Siemens

Simple calculation
type: Class
subclass of: Nervous system and Mental function (Body measurement)
comment: 1 MD05716 2 Simple calculation 3 None 4 Simple calculation 5 258090004 6 Calculated 7 Calculated (qualifier value) 8 Simple calculation 9 C2370909

Simple rotation
type: Class
subclass of: Musculoskeletal function (Body measurement)
comment: 1 MD04121 2 Simple rotation 3 None 4 Simple rotation 5 70433009 6 Rotation 7 Musculoskeletal rotation (observable entity) 8 Rotation 9 C0035868

Simulated
type: Class
subclass of: Health Related Factors
comment: 1 MD04192 2 Simulated 3 None 4 Simulated 5 844005 6 Behavior finding 7 Behavior finding (finding) 8 Behavior 9 C0004927

Singing
type: Class
subclass of: Health Related Factors
comment: 1 MD06242 2 Singing 3 None 4 Singing 5 57206007 6 Singing 7 Singing (observable entity) 8 Singing 9 C0234857

Single ventricle
type: Class
subclass of: Cardiovascular system function (Symptom)
comment: 1 MD00507 2 Single ventricle 3 None 4 Single ventricle 5 45503006 6 Single ventricle 7 Common ventricle (disorder) 8 Common ventricle 9 C0152424

Singultus
type: Class
subclass of: Musculoskeletal function (Symptom)
comment: 1 M01126 2 Singultus 3 None 4 Singultus 5 65958008 6 Singultus 7 Hiccoughs (finding) 8 Hiccoughs 9 C0019521

Sit-to-stand 10 times
type: Class
subclass of: Tool
comment: 1 MD03107 2 Sit-to-stand 10 times 3 None 4 Sit-to-stand 10 times 5 282870005 6 Ability to stand up (observable entity) 7 Ability to stand up (observable entity) 8 Able to stand from sitting 9 C5419663

Sit-to-stand 60 sec
type: Class
subclass of: Tool
comment: 1 MD03111 2 Sit-to-stand 60 sec 3 None 4 Sit-to-stand 60 sec 5 282882001 6 Able to stand from sitting (finding) 7 Able to stand from sitting (finding) 8 Able to stand from sitting 9 C0560799

Sit comfortably and breathe Gently relax joints and muscles
type: Class
subclass of: Conditioning exercise
comment: 1 MD02834 2 Sit comfortably and breathe Gently relax joints and muscles 3 None 4 Sit comfortably and breathe Gently relax joints and muscles 5 1259940003 6 yoga 7 Yoga medicine (qualifier value) 8 Yoga activity 9 C2979879

Sit down and spin your upper body
type: Class
subclass of: Conditioning exercise
comment: 1 MD02786 2 Sit down and spin your upper body 3 None 4 Sit down and spin your upper body 5 256235009 6 exercise 7 Exercise (observable entity) 8 Cool-Down Exercise 9 C3658227

Sit up exercise
type: Class
subclass of: Active exercise
comment: 1 M00365 2 Sit up exercise 3 None 4 Sit up exercise 5 229150006 6 Sit up exercise 7 Sit up exercise (regime/therapy) 8 Sit up exercise 9 C0454359

Sitting
type: Class
subclass of: Health Related Factors
comment: 1 MD06279 2 Sitting 3 None 4 Sitting 5 33586001 6 Sitting 7 Sitting position (finding) 8 Sitting 9 C0277814
comment: 1 MD06279-1 2 Sitting 3 None 4 Sitting 5 33586001 6 Sitting 7 Sitting position (finding) 8 Sitting 9 C2584297

Size of meal
type: Class
subclass of: Nutritional management
comment: 1 MD01432 2 Size of meal 3 None 4 Size of meal 5 769557005 6 meals 7 With meals (qualifier value) 8 Meal (occasion for eating) 9 C1998602

Skateboarding
type: Class
subclass of: Sport
comment: 1 M00430 2 Skateboarding 3 Skateboardings 4 Skateboarding 5 415577004 6 Sport 7 Sport (qualifier value) 8 Skateboarding (recreational activity) 9 C0037244
alternative label: Skateboardings

Skeletal muscle
type: Class
subclass of: Musculoskeletal function (Body region)
comment: 1 MD01813 2 Skeletal muscle 3 None 4 Skeletal muscle 5 127954009 6 Skeletal muscle 7 Skeletal muscle structure (body structure) 8 Skeletal muscle 9 C0242692

Ski jumping
type: Class
subclass of: Sport
comment: 1 M00432 2 Ski jumping 3 None 4 Ski jumping 5 52773007 6 Ski 7 Ski, device (physical object) 8 Ski lift 9 C0581454

Skillful performance
type: Class
subclass of: Questionnaire
comment: 1 MD05594 2 Skillful performance 3 None 4 Skillful performance 5 398166005 6 Performed 7 Performed (qualifier value) 8 Performance 9 C0597198

Skin
type: Class
subclass of: Sensory function, Pain and Skin function (Body region)
comment: 1 M00242 2 Skin 3 None 4 Skin 5 39937001 6 Skin 7 Skin structure (body structure) 8 Skin 9 C1123023

SkinVision
type: Class
subclass of: Units
comment: 1 M05766 2 SkinVision 3 None 4 SkinVision 5 413568008 6 Application - unit of product usage (qualifier value) 7 Application - unit of product usage (qualifier value) 8 Application dose 9 C1533134

Skin Rash
type: Class
subclass of: Sensory function, Pain and Skin function (Symptom)
comment: 1 M00967 2 Skin Rash 3 Skin rashes 4 Skin Rash 5 271807003 6 Skin rash 7 Eruption of skin (disorder) 8 Eruption of skin present 9 C5395697
alternative label: Skin rashes

Skin contact work
type: Class
subclass of: Questionnaire
comment: 1 MD05007 2 Skin contact work 3 None 4 Skin contact work 5 261041009 6 Working 7 Working, function (observable entity) 8 work 9 C0043227

Skin of head and neck region
type: Class
subclass of: Sensory function, Pain and Skin function (Body region)
comment: 1 MD07104 2 Skin of head and neck region 3 None 4 Skin of head and neck region 5 58308009 6 Skin of head and neck 7 Skin structure of head and/or neck (body structure) 8 Skin of head and neck region 9 C2371906

Skin of lower extremity
type: Class
subclass of: Sensory function, Pain and Skin function (Body region)
comment: 1 MD07108 2 Skin of lower extremity 3 None 4 Skin of lower extremity 5 371304004 6 Skin of lower extremity 7 Skin structure of lower limb (body structure) 8 Skin of lower extremity 9 C1266887

Skin of pelvic region
type: Class
subclass of: Sensory function, Pain and Skin function (Body region)
comment: 1 MD07107 2 Skin of pelvic region 3 None 4 Skin of pelvic region 5 181517009 6 Entire skin of pelvic region 7 Entire skin of pelvis (body structure) 8 Skin of pelvic region 9 C2371908

Skin of shoulder region
type: Class
subclass of: Sensory function, Pain and Skin function (Body region)
comment: 1 MD07105 2 Skin of shoulder region 3 None 4 Skin of shoulder region 5 76552005 6 Skin of shoulder 7 Skin structure of shoulder (body structure) 8 Skin of shoulder region 9 C2371907

Skin of trunk and back
type: Class
subclass of: Sensory function, Pain and Skin function (Body region)
comment: 1 MD07109 2 Skin of trunk and back 3 None 4 Skin of trunk and back 5 86381001 6 Skin of trunk 7 Skin structure of trunk (body structure) 8 Skin of trunk and back 9 C2584325
comment: 1 MD07109-1 2 Skin of trunk and back 3 None 4 Skin of trunk and back 5 66643007 6 Skin of back 7 Skin structure of back (body structure) 8 Skin of trunk and back 9 C2584325

Skin of upper extremity
type: Class
subclass of: Sensory function, Pain and Skin function (Body region)
comment: 1 MD07106 2 Skin of upper extremity 3 None 4 Skin of upper extremity 5 76552005 6 Entire skin of upper extremity 7 Skin structure of shoulder (body structure) 8 Skin of upper extremity 9 C0222201

Skin part
type: Class
subclass of: Sensory function, Pain and Skin function (Symptom)
comment: 1 M00549 2 Skin part 3 None 4 Skin part 5 119181002 6 Skin part 7 Skin part (body structure) 8 Skin part 9 C1268090

Skin temperature
type: Class
subclass of: Sensory function, Pain and Skin function (Body measurement)
comment: 1 M00173 2 Skin temperature 3 temperature skin, Temperature of skin, Skin Temperatures 4 Skin temperature 5 364537001 6 Skin temperature 7 Temperature of skin (observable entity) 8 Skin temperature 9 C0037294

Skipping rope
type: Class
subclass of: Equipment
comment: 1 M05871 2 Skipping rope 3 None 4 Skipping rope 5 256235009 6 Exercise 7 Exercise (observable entity) 8 Exercise 9 C0015259

Sledding
type: Class
subclass of: Sport
comment: 1 M00434 2 Sledding 3 None 4 Sledding 5 48818000 6 Sledding 7 Sledding (qualifier value) 8 Sledding 9 C0336980

Sleep-Disordered Breathing
type: Class
subclass of: Respiratory function (Symptom)
comment: 1 M01373 2 Sleep-Disordered Breathing 3 breathing disorder during sleeping sleep disordered breathing 4 Sleep-Disordered Breathing 5 73430006 6 SAS - Sleep apnea syndrome 7 Sleep apnea (disorder) 8 Sleep apnea syndrome 9 C0037315

Sleep-Related Bruxism
type: Class
subclass of: Sensory function, Pain and Skin function (Symptom)
comment: 1 M02197 2 Sleep-Related Bruxism 3 Sleep-Related Bruxisms, Sleep related bruxism 4 Sleep-Related Bruxism 5 274950005 6 Sleep-related bruxism 7 Sleep related bruxism (disorder) 8 Sleep-related bruxism 9 C0393774
comment: 1 M02198 2 Sleep-Related Bruxism 3 Sleep-Related Bruxisms 4 Sleep related bruxism 5 274950005 6 Sleep related bruxism 7 Sleep related bruxism (disorder) 8 Sleep related bruxism 9 C0393774
comment: 1 M02198-1 2 Sleep-Related Bruxism 3 Sleep-Related Bruxisms 4 Sleep related bruxism 5 274950005 6 Sleep related bruxism 7 Sleep related bruxism (disorder) 8 Sleep related bruxism 9 C0393774
comment: 1 M02198-2 2 Sleep-Related Bruxism 3 Sleep-Related Bruxisms 4 Sleep related bruxism 5 274950005 6 Sleep related bruxism 7 Sleep related bruxism (disorder) 8 Sleep related bruxism 9 C0393774
alternative label: Sleep-Related Bruxisms

Sleep-Related Neurogenic Tachypnea
type: Class
subclass of: Cardiovascular system function (Symptom)
comment: 1 M02713 2 Sleep Related Neurogenic Tachypnea 3 SLEEP RELAT NEUROGENIC TACHYPNEA, Sleep-Related Neurogenic Tachypneas, Sleep-related neurogenic tachypnoea 4 Sleep-Related Neurogenic Tachypnea 5 430390000 6 Sleep-related neurogenic tachypnea 7 Sleep-related neurogenic tachypnea (disorder) 8 Sleep-Related Neurogenic Tachypnea 9 C0751510

Sleep-Related Painful Erection
type: Class
subclass of: Urogenital function (Symptom)
comment: 1 M02206 2 Sleep-Related Painful Erection 3 SLEEP RELAT PAINFUL ERECTIONS 4 Sleep-Related Painful Erection 5 230498005 6 Sleep-related painful erections 7 Sleep-related painful erections (disorder) 8 Sleep-related painful erections 9 C0393776
alternative label: SLEEP RELAT PAINFUL ERECTIONS

Sleep-Related Painful Erections
type: Class
subclass of: Urogenital function (Symptom)
comment: 1 M02204 2 Sleep-Related Painful Erections 3 Sleep Related Painful Erections 4 Sleep-Related Painful Erections 5 230498005 6 Sleep-related painful erections 7 Sleep-related painful erections (disorder) 8 Sleep-related painful erections 9 C0393776

Sleep-onset association disorder
type: Class
subclass of: Activities of disability
comment: 1 M00053 2 Sleep-onset association disorder 3 None 4 Sleep-onset association disorder 5 426824009 6 Sleep-onset association disorder 7 Sleep-onset association disorder (disorder) 8 Sleep-onset association disorder 9 C1960519

Sleep-pattern disturbance
type: Class
subclass of: Nervous system and Mental function (Symptom)
comment: 1 M01694 2 Sleep pattern disturbance 3 Disturbed sleep pattern, Disturbed sleep patterns, Disturbed Nyctohemeral Rhythm, Disturbed Nyctohemeral Rhythms 4 Sleep-pattern disturbance 5 26677001 6 Disturbed sleep pattern 7 Sleep pattern disturbance (finding) 8 Disturbed sleep pattern 9 C0150079

Sleep-related dissociative disorder
type: Class
subclass of: Activities of disability
comment: 1 M00054 2 Sleep-related dissociative disorder 3 None 4 Sleep-related dissociative disorder 5 429571005 6 Sleep-related dissociative disorder 7 Sleep-related dissociative disorder (disorder) 8 Sleep-related dissociative disorder 9 C1997502

Sleep-related groaning
type: Class
subclass of: Voice and Speaking (Symptom)
comment: 1 M00079 2 Sleep-related groaning 3 None 4 Sleep-related groaning 5 429266002 6 Sleep-related groaning 7 Sleep-related groaning (disorder) 8 Sleep-related groaning 9 C1997918

Sleep-related head banging
type: Class
subclass of: Musculoskeletal function (Symptom)
comment: 1 M00080 2 Sleep-related head banging 3 None 4 Sleep-related head banging 5 230497000 6 Sleep-related head banging 7 Sleep-related head banging (disorder) 8 Sleep-related head banging 9 C0393775

Sleep-related neurogenic tachypnea
type: Class
subclass of: Digestive function (Symptom)
comment: 1 M00081 2 Sleep Related Neurogenic Tachypnea 3 Sleep-Related Neurogenic Tachypnea Sleep-Related Neurogenic Tachypneas Sleep-related neurogenic tachypnoea 4 Sleep-related neurogenic tachypnea 5 430390000 6 Sleep-related neurogenic tachypnea 7 Sleep-related neurogenic tachypnea (disorder) 8 Sleep-related neurogenic tachypnea 9 C0751510

Sleep-wake disorder
type: Class
subclass of: Musculoskeletal function (Symptom)
comment: 1 M02739 2 Sleep-wake disorder 3 None 4 Sleep-wake disorder 5 80495009 6 Sleep walking disorder 7 Sleep walking disorder (disorder) 8 Sleep Disorders 9 C0851578

SleepBot
type: Class
subclass of: Units
comment: 1 M05768 2 SleepBot 3 None 4 SleepBot 5 413568008 6 Application - unit of product usage (qualifier value) 7 Application - unit of product usage (qualifier value) 8 Application dose 9 C1533134

Sleep Apnea Syndromes
type: Class
subclass of: Respiratory function (Symptom)
comment: 1 M01365 2 Sleep Apnea Syndromes 3 Sleep apnoea SAS - Sleep apnea syndrome SAS - Sleep apnoea syndrome Sleep Apneas Sleep apnoea syndrome Syndrome sleep apnea Syndrome sleep apnoea Sleep apnea syndrome 4 Sleep Apnea Syndromes 5 73430006 6 Sleep apnea syndrome 7 Sleep apnea (disorder) 8 Sleep apnea syndrome 9 C0037315
alternative label: SAS - Sleep apnea syndrome
alternative label: Syndrome sleep apnea
alternative label: SAS - Sleep apnoea syndrome
alternative label: Syndrome sleep apnoea
alternative label: Sleep apnea syndrome
alternative label: Sleep Apneas
alternative label: Sleep apnoea syndrome
alternative label: Sleep apnoea

Sleep Cycle alarm clock
type: Class
subclass of: Units
comment: 1 M05767 2 Sleep Cycle alarm clock 3 None 4 Sleep Cycle alarm clock 5 413568008 6 Application - unit of product usage (qualifier value) 7 Application - unit of product usage (qualifier value) 8 Application dose 9 C1533134

Sleep EEG
type: Class
subclass of: Hospital information, examination/diagnosis/treatment data
comment: 1 M01756 2 Sleep EEG 3 eeg sleep eeg sleeping 4 Sleep EEG 5 18648009 6 Sleep EEG 7 Sleep electroencephalogram (procedure) 8 Sleep EEG 9 C0200101
alternative label: eeg sleeping
alternative label: eeg sleep

Sleep Hypopnea
type: Class
subclass of: Respiratory function (Symptom)
comment: 1 M01370 2 Sleep Hypopnea 3 Sleep Hypopneas 4 Sleep Hypopnea 5 73430006 6 Sleep hypopnea 7 Sleep apnea (disorder) 8 Sleep apnea syndrome 9 C0037315
alternative label: Sleep Hypopneas
alternative label: Sleep hypopnoea

Sleep Related Neurogenic Tachypnea
type: Class
subclass of: Cardiovascular system function (Symptom)
comment: 1 M02712 2 Sleep Related Neurogenic Tachypnea 3 Sleep-related neurogenic tachypnea, Sleep-Related Neurogenic Tachypnea, Sleep-Related Neurogenic Tachypneas, Sleep-related neurogenic tachypnoea 4 Sleep Related Neurogenic Tachypnea 5 430390000 6 Sleep-related neurogenic tachypnea 7 Sleep-related neurogenic tachypnea (disorder) 8 Sleep-Related Neurogenic Tachypnea 9 C0751510
alternative label: Sleep-related neurogenic tachypnoea
alternative label: Sleep-Related Neurogenic Tachypneas
alternative label: SLEEP RELAT NEUROGENIC TACHYPNEA

Sleep apnea recording
type: Class
subclass of: Hospital information, examination/diagnosis/treatment data
comment: 1 M01760 2 Sleep apnea recording 3 None 4 Sleep apnea recording 5 113026004 6 Sleep apnea recording 7 Sleep apnea recording (procedure) 8 Sleep apnea recording 9 C0200140
alternative label: Sleep apnoea recording

Sleep assessment
type: Class
subclass of: Tool
comment: 1 M00037 2 Sleep assessment 3 None 4 Sleep assessment 5 445221009 6 Assessment of sleep pattern 7 Assessment of sleep pattern (procedure) 8 Assessment of sleep pattern 9 C1160978

Sleep behavior observations
type: Class
subclass of: Sub-Cultural Level
comment: 1 M02489 2 Sleep behavior observations 3 None 4 Sleep behavior observations 5 247950007 6 Sleep behavior observations 7 Sleep behavior finding (finding) 8 Sleep behavior finding 9 C0474396
alternative label: Sleep behaviour observations

Sleep disorder
type: Class
subclass of: Activities of disability
comment: 1 M00042 2 Sleep disorder 3 Sleep Disorders 4 Sleep disorder 5 39898005 6 Sleep disorder 7 Sleep disorder (disorder) 8 Sleep Disorders 9 C0851578
alternative label: Sleep Disorders

Sleep disorder function test
type: Class
subclass of: Individual Related Factors
comment: 1 M00039 2 Sleep disorder function test 3 None 4 Sleep disorder function test 5 10563004 6 Sleep disorder function test 7 Sleep disorder function test (procedure) 8 Sleep disorder function test 9 C0200136

Sleep dysfunction with arousal disturbance
type: Class
subclass of: Activities of disability
comment: 1 M00052 2 Sleep dysfunction with arousal disturbance 3 None 4 Sleep dysfunction with arousal disturbance 5 442176004 6 Sleep dysfunction with arousal disturbance 7 Sleep dysfunction with arousal disturbance (disorder) 8 Sleep dysfunction with arousal disturbance 9 C0476212

Sleep electroencephalogram
type: Class
subclass of: Tool
comment: 1 M00040 2 Sleep electroencephalogram 3 None 4 Sleep electroencephalogram 5 18648009 6 Sleep electroencephalogram 7 Sleep electroencephalogram (procedure) 8 Sleep electroencephalogram 9 C0200101

Sleep hypoventilation
type: Class
subclass of: Activities of disability
comment: 1 M00075 2 Sleep hypoventilation 3 None 4 Sleep hypoventilation 5 443760008 6 Sleep hypoventilation 7 Sleep hypoventilation (disorder) 8 Sleep hypoventilation 9 C2732337

Sleep management
type: Class
subclass of: Tool
comment: 1 M00057 2 Sleep management 3 management sleep 4 Sleep management 5 395069004 6 Sleep management 7 Sleep management (procedure) 8 Sleep management 9 C1273382
alternative label: management sleep

Sleep pattern control management
type: Class
subclass of: Tool
comment: 1 M00059 2 Sleep pattern control management 3 None 4 Sleep pattern control management 5 410080005 6 Sleep pattern control management 7 Sleep pattern control management (procedure) 8 Sleep pattern control management 9 C1444224

Sleep pattern disturbance
type: Class
subclass of: Nervous system and Mental function (Symptom)
comment: 1 M00065 2 Sleep pattern disturbance 3 Sleep-pattern disturbance, Disturbed sleep pattern, Disturbed sleep patterns, Disturbed Nyctohemeral Rhythm, Disturbed Nyctohemeral Rhythms 4 Sleep pattern disturbance 5 26677001 6 Sleep pattern disturbance 7 Sleep pattern disturbance (finding) 8 Sleep pattern disturbance 9 C0150079
alternative label: Disturbed sleep pattern
alternative label: Disturbed Nyctohemeral Rhythms
alternative label: Disturbed sleep patterns
alternative label: Distrubed sleep pattern
alternative label: Disturbed Nyctohemeral Rhythm

Sleep pattern finding
type: Class
subclass of: Sub-Cultural Level
comment: Lifestyle Sub-Cultural Level None 1 M02493 2 Sleep pattern finding 3 sleep pattern, Sleep patterns, Sleep pattern, Sleeping pattern, patterns sleep, patterns sleeping, pattern sleep 4 Sleep pattern finding 5 401175000 6 Sleep pattern finding 7 Sleep pattern finding (finding) 8 Sleep behavior finding 9 C0474396
alternative label: sleep pattern
alternative label: Sleeping pattern
alternative label: patterns sleep
alternative label: Sleep patterns
alternative label: patterns sleeping
alternative label: pattern sleep

Sleep related hallucinations
type: Class
subclass of: Nervous system and Mental function (Symptom)
comment: 1 M00076 2 Sleep related hallucinations 3 None 4 Sleep related hallucinations 5 445112001 6 Sleep related hallucinations 7 Sleep related hallucinations (finding) 8 Sleep related hallucinations 9 C2919925

Sleep rhythm problem
type: Class
subclass of: Nervous system and Mental function (Symptom)
comment: 1 M02747 2 Sleep rhythm problem 3 None 4 Sleep rhythm problem 5 271794005 6 Disorder of sleep-wake cycle 7 Disorder of sleep-wake cycle (disorder) 8 Sleep Disorders, Circadian Rhythm 9 C0877792

Sleep talking
type: Class
subclass of: Nervous system and Mental function (Symptom)
comment: 1 M00077 2 Sleep talking 3 sleep talk 4 Sleep talking 5 36321004 6 Sleep talking 7 Sleeptalking (finding) 8 Sleep talking 9 C0542313
alternative label: sleep talk
alternative label: Sleeptalking

Sleeplessness
type: Class
subclass of: Nervous system and Mental function (Symptom)
comment: 1 M00066 2 Sleeplessness 3 None 4 Sleeplessness 5 193462001 6 Sleeplessness 7 Insomnia (disorder) 8 Sleeplessness 9 C0917801

Sleeps too much
type: Class
subclass of: Nervous system and Mental function (Symptom)
comment: 1 M02766 2 Sleeps too much 3 too much sleep 4 Sleeps too much 5 77692006 6 Sleeps too much 7 Hypersomnia (disorder) 8 Hypersomnia 9 C0917799
alternative label: too much sleep

Slow breathing
type: Class
subclass of: Respiratory function (Body measurement)
comment: 1 M01881 2 Slow breathing 3 BREATHING SLOWED, breathing slowing, slow breath 4 Slow breathing 5 86684002 6 Slow breathing 7 Slow respiration (finding) 8 Slow breathing 9 C0231837
alternative label: breathing slowing
alternative label: BREATHING SLOWED
alternative label: slowed breathing
alternative label: slow breath

Slow pulse
type: Class
subclass of: Cardiovascular system function (Symptom)
comment: 1 M00189 2 Slow pulse 3 None 4 Slow pulse 5 42177007 6 Pulse slow (finding) 7 Pulse slow (finding) 8 Pulse slow (finding) 9 C2230138

Slow respiration
type: Class
subclass of: Respiratory function (Symptom)
comment: 1 M00223 2 Slow respiration 3 None 4 Slow respiration 5 86684002 6 Slow respiration 7 Slow respiration (finding) 8 Slow respiration 9 C0231837

Small Calorie
type: Class
subclass of: Units
comment: 1 M05366 2 Small Calorie 3 None 4 Small Calorie 5 258790008 6 calorie 7 calorie (qualifier value) 8 calorie 9 C1879985

Small pupil
type: Class
subclass of: Sensory function, Pain and Skin function (Symptom)
comment: 1 M02699 2 Small pupil 3 None 4 Small pupil 5 301939004 6 Small pupil 7 Constricted pupil (finding) 8 Constricted pupil 9 C0728710

SmartDrive
type: Class
subclass of: Device
comment: 1 MD01939 2 SmartDrive 3 None 4 SmartDrive 5 246137000 6 Equipment 7 Equipment (attribute) 8 Equipment 9 C0014672

SmartDrive Battery
type: Class
subclass of: Device
comment: 1 MD01941 2 SmartDrive Battery 3 None 4 SmartDrive Battery 5 65053001 6 Electrical battery 7 Electrical battery, device (physical object) 8 Electrical battery 9 C0337088 Electrical battery

Smartphone
type: Class
subclass of: Device
comment: 1 MD05409 2 Smartphone 3 Phone 4 Smartphone 5 1187059002 6 Smartphone 7 Smartphone (physical object) 8 Smartphone 9 C3204335

Smelling
type: Class
subclass of: Health Related Factors
comment: 1 MD06120 2 Smelling 3 Smell function 4 Smelling 5 397686008 6 Smell 7 Sense of smell, function (observable entity) 8 Smelling 9 C0037361
alternative label: Smell function

Smiling exercises
type: Class
subclass of: Active exercise
comment: 1 M00274 2 Smiling exercises 3 None 4 Smiling exercises 5 229127000 6 Smiling exercises 7 Smiling exercises (regime/therapy) 8 Smiling exercises 9 C0454337

Smoke Inhalation Injury
type: Class
subclass of: Sub-Cultural Level
comment: 1 M01395 2 Smoke Inhalation Injury 3 Smoke Inhalation Injuries 4 Smoke Inhalation Injury 5 426936004 6 Smoke inhalation injury 7 Smoke inhalation injury (disorder) 8 Smoke inhalation injury 9 C0037367
comment: 1. M01395-1 2. Smoke Inhalation Injury 3. Smoke Inhalation Injuries 4.Smoke Inhalation Injury 5 426936004 6. Smoke inhalation injury 7. Smoke inhalation injury (disorder) 8. Smoke inhalation injury 9. C0037367
alternative label: Smoke Inhalation Injuries

Smoked before confirmation of pregnancy
type: Class
subclass of: Sub-Cultural Level
comment: 1 M00094 2 Smoked before confirmation of pregnancy 3 None 4 Smoked before confirmation of pregnancy 5 449345000 6 Smoked before confirmation of pregnancy 7 Smoked before confirmation of pregnancy (finding) 8 Smoked before confirmation of pregnancy 9 C3164698

Smokeless tobacco hyperkeratosis
type: Class
subclass of: Sensory function, Pain and Skin function (Symptom)
comment: 1 M02678 2 Smokeless tobacco hyperkeratosis 3 None 4 Smokeless tobacco hyperkeratosis 5 95269005 6 Smokeless tobacco hyperkeratosis 7 Smokeless tobacco keratosis (disorder) 8 Smokeless tobacco keratosis 9 C0685919

Smokeless tobacco keratosis
type: Class
subclass of: Sensory function, Pain and Skin function (Symptom)
comment: 1 M00090 2 Smokeless tobacco keratosis 3 None 4 Smokeless tobacco keratosis 5 95269005 6 Smokeless tobacco keratosis 7 Smokeless tobacco keratosis (disorder) 8 Smokeless tobacco keratosis 9 C0685919

Smoker
type: Class
subclass of: Sub-Cultural Level
comment: 1 M00103 2 Smoker 3 smokers 4 Smoker 5 77176002 6 Smoker 7 Smoker (finding) 8 Smoker 9 C0337664
alternative label: smokers

Smoker in the family
type: Class
subclass of: Characteristics of the individual
comment: 1 M00095 2 Smoker in the family 3 None 4 Smoker in the family 5 275105001 6 Smoker in the family 7 Smoker in the family (situation) 8 Smoker in the family 9 C0554998

Smoking
type: Class
subclass of: Sub-Cultural Level
comment: 1 M00083 2 Smoking 3 None 4 Smoking 5 77176002 6 Smoking 7 Smoker (finding) 8 Smoking 9 C0037369

Smoking Lifestyle Assessment Tool
type: Class
subclass of: Tool
comment: 1 MD03946 2 Smoking Lifestyle Assessment Tool 3 None 4 Smoking Lifestyle Assessment Tool 5 443781008 6 Assessment of lifestyle 7 Assessment of lifestyle (procedure) 8 Assessment of lifestyle 9 C0814436

Smoking disorder
type: Class
subclass of: Activities of disability
comment: 1 M00087 2 Smoking disorder 3 None 4 Smoking disorder 5 64572001 6 Disorder 7 Disease (disorder) 8 Disease 9 C0012634

Smoking history
type: Class
subclass of: Hospital information, examination/diagnosis/treatment data
comment: 1 M00093 2 Smoking history 3 None 4 Smoking history 5 443877004 6 Family history of smoking 7 Family history of smoking (situation) 8 Tobacco Smoking History 9 C1519384

Smoking status
type: Class
subclass of: Sub-Cultural Level
comment: 1 M00096 2 Smoking status 3 None 4 Smoking status 5 308512009 6 Smoking monitoring status (finding) 7 Smoking status at 4 weeks (observable entity) 8 Tobacco smoking status 9 C3496610

Snorkel diving
type: Class
subclass of: Sport
comment: 1 M02120 2 Snorkel diving 3 None 4 Snorkel diving 5 39599007 6 Snorkel diving 7 Snorkel diving (qualifier value) 8 Snorkel diving 9 C0336976

Snorkeling
type: Class
subclass of: Sport
comment: 1 M00435 2 Snorkeling 3 snowboard 4 Snorkeling 5 39599007 6 Snorkeling 7 Snorkel diving (qualifier value) 8 Snorkeling 9 C0336976

Snow Skiing
type: Class
subclass of: Sport
comment: 1 M01354 2 Snow Skiing 3 Snow Skiings 4 Snow Skiing 5 45033006 6 skiing 7 Skiing (qualifier value) 8 Skiing (recreational activity) 9 C0037264
alternative label: Snow Skiings

Snowboarding
type: Class
subclass of: Sport
comment: 1 M00341 2 Snowboarding 3 snowboard 4 Snowboarding 5 102393008 6 Snowboarding 7 Snowboarding (qualifier value) 8 Snowboarding (activity) 9 C1138838
alternative label: snow boarding
alternative label: snowboard

Snowmobile
type: Class
subclass of: Sport
comment: 1 MD01063 2 Snowmobile 3 None 4 Snowmobile 5 64174005 6 Snowmobile 7 Snowmobile, device (physical object) 8 Snowmobile 9 C0037387

Soccer
type: Class
subclass of: Sport
comment: 1 M00437 2 Soccer 3 None 4 Soccer 5 88289009 6 Soccer 7 Soccer (qualifier value) 8 Soccer 9 C0037393

Social History
type: Class
subclass of: Units
comment: 1 MD02968 2 Social History 3 None 4 Social History 5 160476009 6 Social history 7 Social / personal history observable (observable entity) 8 Social history 9 C0424945

Social Welfare Corporation
type: Class
subclass of: Hospital Administration
comment: 1 MD00622 2 Social Welfare Corporation 3 None 4 Social Welfare Corporation 5 699089001 6 Social wellbeing 7 Social wellbeing (observable entity) 8 corporation 9 C0683758

Social anxiety
type: Class
subclass of: Nervous system and Mental function (Symptom)
comment: 1 M05827 2 Social anxiety 3 Social fear 4 Social anxiety 5 25501002 6 Social phobia 7 Social phobia (disorder) 8 Social Anxiety 9 C0424166
alternative label: Social fear

Social cues in relationships
type: Class
subclass of: Individual Related Factors
comment: 1 MD06466 2 Social cues in relationships 3 None 4 Social cues in relationships 5 272151006 6 Relationships 7 Relationships (qualifier value) 8 Social cues in relationships 9 C2371537

Social network therapy
type: Class
subclass of: Nervous system and Mental function (Therapy)
comment: 1 M00634 2 Social network therapy 3 None 4 Social network therapy 5 38256005 6 Social network therapy 7 Social network therapy (regime/therapy) 8 Social network therapy 9 C0204565

Social psychotherapy
type: Class
subclass of: Nervous system and Mental function (Therapy)
comment: 1 M00614 2 Social psychotherapy 3 None 4 Social psychotherapy 5 90102008 6 Social psychotherapy 7 Social psychotherapy (regime/therapy) 8 Social psychotherapy 9 C0204577

Social security policies
type: Class
subclass of: Public Policy Factors
comment: 1 MD06785 2 Social security policies 3 None 4 Social security policies 5 276339004 6 environment 7 Environment (environment) 8 Social security policies 9 C2371810

Social security services
type: Class
subclass of: Public Policy Factors
comment: 1 MD06783 2 Social security services 3 None 4 Social security services 5 224930009 6 services 7 Services (qualifier value) 8 Social security services 9 C2371808

Social security systems
type: Class
subclass of: Public Policy Factors
comment: 1 MD06784 2 Social security systems 3 None 4 Social security systems 5 246333005 6 system 7 System (attribute) 8 Social security systems 9 C2371809

Social therapy
type: Class
subclass of: Nervous system and Mental function (Therapy)
comment: 1 M00632 2 Social therapy 3 None 4 Social therapy 5 243224001 6 Social therapy 7 Social therapy (regime/therapy) 8 Social therapy 9 C0740117

Social work treatments and procedures
type: Class
subclass of: Nervous system and Mental function (Symptom)
comment: 1 M02700 2 Social work treatments and procedures 3 None 4 Social work treatments and procedures 5 243224001 6 Social work/counseling care treatments and procedures 7 Social therapy (regime/therapy) 8 Social therapy 9 C0740117

Socializing
type: Class
subclass of: Individual Related Factors
comment: 1 MD06555 2 Socializing 3 None 4 Socializing 5 386442002 6 Socialization enhancement (procedure) 7 Socialization enhancement (procedure) 8 Socializing 9 C2371613

Societal attitudes
type: Class
subclass of: Individual Related Factors
comment: 1 MD06706 2 Societal attitudes 3 None 4 Societal attitudes 5 225464009 6 attitude 7 Attitude (observable entity) 8 Societal attitudes 9 C2371737

Sociotherapy
type: Class
subclass of: Nervous system and Mental function (Symptom)
comment: 1 M02703 2 Sociotherapy 3 None 4 Sociotherapy 5 243224001 6 Sociotherapy 7 Social therapy (regime/therapy) 8 Social therapy 9 C0740117

Sodium
type: Class
subclass of: Functions of Blood System, Metabolic system and Endocrine system (Body measurement)
comment: 1 MD03053 2 Sodium 3 None 4 Sodium 5 39972003 6 Sodium 7 Sodium (substance) 8 Sodium 9 C0037473

Softball
type: Class
subclass of: Sport
comment: 1 M00438 2 Softball 3 None 4 Softball 5 21471008 6 Baseball 7 Baseball (qualifier value) 8 Softball (sports activity) 9 C0037582

Soldier
type: Class
subclass of: Classification of Patient
comment: 1 MD00580 2 Soldier 3 None 4 Soldier 5 302314004 6 Military personnel 7 Military personnel (occupation) 8 Soldiers 9 C0524647

Solving complex problems
type: Class
subclass of: Health Related Factors
comment: 1 MD06189 2 Solving complex problems 3 None 4 Solving complex problems 5 365926000 6 Problem solving - finding 7 Finding of problem solving (finding) 8 Solving complex problems 9 C2371299

Solving problems
type: Class
subclass of: Health Related Factors
comment: 1 MD06187 2 Solving problems 3 None 4 Solving problems 5 365926000 6 Problem solving - finding 7 Finding of problem solving (finding) 8 Solving problems 9 C0033211

Solving simple problems
type: Class
subclass of: Health Related Factors
comment: 1 MD06188 2 Solving simple problems 3 None 4 Solving simple problems 5 365926000 6 Problem solving - finding 7 Finding of problem solving (finding) 8 Solving simple problems 9 C2371298

Some dangerous performance
type: Class
subclass of: Questionnaire
comment: 1 MD05572 2 Some dangerous performance 3 None 4 Some dangerous performance 5 398166005 6 Performed 7 Performed (qualifier value) 8 Performance 9 C0597198

Somniloquism
type: Class
subclass of: Voice and Speaking (Symptom)
comment: 1 M02613 2 Somniloquism 3 Somniloquy 4 Somniloquism 5 36321004 6 Somniloquism 7 Sleeptalking (finding) 8 Sleep Talking 9 C0542313
alternative label: Somniloquy

Sore Throat
type: Class
subclass of: Respiratory function (Symptom)
comment: 1 M02011 2 Sore Throat 3 sore symptom throat sore symptoms throat Sore throat symptom Sore Throats THROAT SORE Throat soreness SORETHROAT sore throat 4 Sore Throat 5 162397003 6 Sore throat 7 Pain in throat (finding) 8 Sore throat 9 C0242429

Sotos syndrome
type: Class
subclass of: Nervous system and Mental function (Symptom)
comment: 1 MD00536 2 Sotos syndrome 3 None 4 Sotos syndrome 5 75968004 6 Sotos syndrome 7 Sotos' syndrome (disorder) 8 Sotos' syndrome 9 C0175695

Sound
type: Class
subclass of: Physical/Chemical Environment
comment: 1 MD06670 2 Sound 3 None 4 Sound 5 68325009 6 Sound 7 Sound, device (physical object) 8 Sound 9 C0037709

Sound detection
type: Class
subclass of: Sensory function, Pain and Skin function (Body measurement)
comment: 1 MD05758 2 Sound detection 3 Sound discrimination 4 Sound detection 5 260373001 6 Detected 7 Detected (qualifier value) 8 Sound detection 9 C1327694
alternative label: Sound discrimination

Sound intensity
type: Class
subclass of: Physical/Chemical Environment
comment: 1 MD06671 2 Sound intensity 3 None 4 Sound intensity 5 184034005 6 Sound intensity 7 Sound intensity 8 Sound intensity 9 C2371706

Sound quality
type: Class
subclass of: Physical/Chemical Environment
comment: 1 MD06672 2 Sound quality 3 None 4 Sound quality 5 68325009 6 Sound 7 Sound, device (physical object) 8 Sound quality 9 C2371707

Spatium extraperitoneale
type: Class
subclass of: Digestive function (Body region)
comment: 1 M01348 2 Spatium extraperitoneale 3 None 4 Spatium extraperitoneale 5 83137009 6 Extraperitoneal space 7 Structure of extraperitoneal space (body structure) 8 Structure of extraperitoneal space 9 C0230197

Spatium retroperitoneale
type: Class
subclass of: Musculoskeletal function (Body region)
comment: 1 M02109 2 Spatium retroperitoneale 3 None 4 Spatium retroperitoneale 5 699600004 6 retroperitoneal space 7 Structure of retroperitoneal space (body structure) 8 Retroperitoneal Space 9 C0035359

Speaking
type: Class
subclass of: Health Related Factors
comment: 1 MD06240 2 Speaking 3 None 4 Speaking 5 87335007 6 Speaking 7 Speaking (observable entity) 8 Speaking 9 C0234856

Special corporation
type: Class
subclass of: Hospital Administration
comment: 1 MD00620 2 Special corporation 3 None 4 Special corporation 5 67995009 6 Special 7 Special (qualifier value) 8 corporation 9 C0683758

Special materials
type: Class
subclass of: Hospital information, examination/diagnosis/treatment data
comment: 1 MD00211 2 Special materials 3 None 4 Special materials 5 260769002 6 Material 7 Material (substance) 8 materials 9 C0520510
comment: 1 MD00211-1 2 Special materials 3 None 4 Special materials 5 276731003 6 Material 7 Material (attribute) 8 materials 9 C0520510

Specific abdominal exercises
type: Class
subclass of: Active exercise
comment: 1 M00318 2 Specific abdominal exercises 3 None 4 Specific abdominal exercises 5 229145000 6 Specific abdominal exercises 7 Specific abdominal exercises (regime/therapy) 8 Specific abdominal exercises 9 C0454355

Specific immune response
type: Class
subclass of: Immune system function (Body measurement)
comment: 1 MD05862 2 Specific immune response 3 None 4 Specific immune response 5 35024006 6 Immune response 7 Immune response, function (observable entity) 8 Specific immune response 9 C0683201

Specific spontaneous movements
type: Class
subclass of: Musculoskeletal function (Body measurement)
comment: 1 MD06086 2 Specific spontaneous movements 3 None 4 Specific spontaneous movements 5 255324009 6 Movement 7 Movement (observable entity) 8 Specific spontaneous movements 9 C2371950

Speech and language pathology care
type: Class
subclass of: Voice and Speaking (Therapy)
comment: 1 M02664 2 Speech and language pathology care 3 None 4 Speech and language pathology care 5 311555007 6 Speech and language pathology care 7 Speech and language therapy regime (regime/therapy) 8 Speech and language therapy regime 9 C0589155

Speech and language therapy
type: Class
subclass of: Voice and Speaking (Therapy)
comment: 1 M01411 2 Speech and language therapy 3 None 4 Speech and language therapy 5 5154007 6 Speech and language therapy 7 Speech therapy (regime/therapy) 8 Speech and language therapy 9 C0037831

Speech and language therapy regimes
type: Class
subclass of: Voice and Speaking (Therapy)
comment: 1 M00589 2 Speech and language therapy regimes 3 None 4 Speech and language therapy regimes 5 311555007 6 Speech and language therapy regime 7 Speech and language therapy regime (regime/therapy) 8 Speech and language therapy regime 9 C0589155

Speech and language therapy treatments and procedures
type: Class
subclass of: Voice and Speaking (Therapy)
comment: 1 M02665 2 Speech and language therapy treatments and procedures 3 None 4 Speech and language therapy treatments and procedures 5 5154007 6 Speech and language therapy 7 Speech therapy (regime/therapy) 8 Speech and language therapy regime 9 C0589155

Speech discrimination
type: Class
subclass of: Sensory function, Pain and Skin function (Body measurement)
comment: 1 MD05762 2 Speech discrimination 3 None 4 Speech discrimination 5 251361006 6 Speech discrimination score 7 Speech discrimination score (observable entity) 8 Speech discrimination 9 C0037820

Speech problem
type: Class
subclass of: Voice and Speaking (Symptom)
comment: 1 M00590 2 Speech problem 3 Speech prob. - symptom, Speech problem - symptom 4 Speech problem 5 267095009 6 Speech problem 7 Speech problem (finding) 8 Speech problem 9 C0395016
alternative label: Speech problem - symptom
alternative label: Speech prob. - symptom

Speech therapy
type: Class
subclass of: Voice and Speaking (Therapy)
comment: 1 M00588 2 Speech therapy 3 Speech promotion therapy Speech Therapies Speech therapy treatment SPEECH THER THER SPEECH 4 Speech therapy 5 5154007 6 Speech therapy 7 Speech therapy (regime/therapy) 8 Speech therapy 9 C0037831
alternative label: Speech promotion therapy
alternative label: Speech Therapies
alternative label: THER SPEECH
alternative label: SPEECH THER
alternative label: Speech therapy treatment

Speed Set
type: Class
subclass of: Units
comment: 1 MD02649 2 Speed Set 3 None 4 Speed Set 5 870597004 6 Speed 7 Distance per time (property) (qualifier value) 8 Speed (motion) 9 C0678536

Speed of speech
type: Class
subclass of: Voice and Speaking (Body measurement)
comment: 1 MD05822 2 Speed of speech 3 None 4 Speed of speech 5 106132005 6 speech finding 7 Speech finding (finding) 8 Speed of speech 9 C2370982

Sphenocavernous Region
type: Class
subclass of: Cardiovascular system function (Body region)
comment: 1 M00977 2 Sphenocavernous Region 3 None 4 Sphenocavernous Region 5 52530000 6 Body region 7 Body region structure (body structure) 8 Sphenocavernous Region 9 C1883074

Sphenoorbital Region
type: Class
subclass of: Musculoskeletal function (Body region)
comment: 1 M00983 2 Sphenoorbital Region 3 None 4 Sphenoorbital Region 5 52530000 6 Body region 7 Body region structure (body structure) 8 Sphenoorbital Region 9 C1883075

Spherical
type: Class
subclass of: Tool
comment: 1 MD04098 2 Spherical 3 None 4 Spherical 5 34258004 6 Spherical 7 Spherical shape (qualifier value) 8 Spherical 9 C0332501

Spherical Grasp
type: Class
subclass of: Health Related Factors
comment: 1 MD04097 2 Spherical Grasp 3 None 4 Spherical Grasp 5 242899004 6 Grasped with hand 7 Grasped with hand (event) 8 grasp 9 C0220843

Spinal
type: Class
subclass of: Structures of disability
comment: 1 MD00102 2 Spinal 3 spine 4 Spinal 5 2748008 6 Spinal cord 7 Spinal cord structure (body structure) 8 Spinal Cord 9 C0037925

Spinal cord and related structures
type: Class
subclass of: Nervous system and Mental function (Body region)
comment: 1 MD06840 2 Spinal cord and related structures 3 None 4 Spinal cord and related structures 5 2748008 6 spinal cord 7 Spinal cord structure (body structure) 8 Spinal cord and related structures 9 C2371852

Spinal nerves
type: Class
subclass of: Nervous system and Mental function (Body region)
comment: 1 MD06848 2 Spinal nerves 3 None 4 Spinal nerves 5 3169005 6 spinal nerve 7 Spinal nerve structure (body structure) 8 Spinal nerves 9 C0037941

Spirit drinker
type: Class
subclass of: Classification of Patient
comment: 1 M02315 2 Spirit drinker 3 None 4 Spirit drinker 5 160588008 6 Spirit drinker 7 Drinker of hard liquor (finding) 8 Drinker of hard liquor 9 C0425329

Spirituality
type: Class
subclass of: Individual Related Factors
comment: 1 MD06560 2 Spirituality 3 None 4 Spirituality 5 24121000087108 6 Indigenous spirituality 7 Indigenous spirituality (religion/philosophy) 8 Spirituality 9 C0237104

Spondyloepiphyseal dysplasia
type: Class
subclass of: Musculoskeletal function (Symptom)
comment: 1 MD00469 2 Spondyloepiphyseal dysplasia 3 None 4 Spondyloepiphyseal dysplasia 5 278713008 6 Spondyloepiphyseal dysplasia 7 Spondyloepiphyseal dysplasia congenita group (disorder) 8 Spondyloepiphyseal dysplasia, congenita 9 C2745959

Spondyloschisis
type: Class
subclass of: Nervous system and Mental function (Symptom)
comment: 1 MD00437 2 Spondyloschisis 3 None 4 Spondyloschisis 5 30028006 6 Spondyloschisis 7 Spondyloschisis (disorder) 8 Spondyloschisis 9 C0265680

Spontaneous movements
type: Class
subclass of: Musculoskeletal function (Body measurement)
comment: 1 MD06084 2 Spontaneous movements 3 None 4 Spontaneous movements 5 255324009 6 Movement 7 Movement (observable entity) 8 Spontaneous movements 9 C2371948

Sport
type: Class
comment: 1 M00380 2 Sport 3 sports, Sports, sported, sporting 4 Sport 5 415577004 6 Sport 7 Sport (qualifier value) 8 Sports 9 C0038039
alternative label: Sports
alternative label: sported
alternative label: sporting
alternative label: sports

Sport specific rehabilitation
type: Class
subclass of: Musculoskeletal function (Therapy)
comment: 1 M00622 2 Sport specific rehabilitation 3 None 4 Sport specific rehabilitation 5 229164006 6 Sport specific rehabilitation 7 Sport specific rehabilitation (regime/therapy) 8 Sport specific rehabilitation 9 C0454373

Sports activity
type: Class
subclass of: Sport
comment: 1 M01421 2 Sports activity 3 sports activities 4 Sports activity 5 14468000 6 Sports activity 7 Sports activity (observable entity) 8 Sports activity 9 C0038039
alternative label: sports activities

Spousal relationships
type: Class
subclass of: Individual Related Factors
comment: 1 MD06504 2 Spousal relationships 3 None 4 Spousal relationships 5 272151006 6 Relationships 7 Relationships (qualifier value) 8 Spousal relationships 9 C2371570

Spray
type: Class
subclass of: Units
comment: 1 M05247 2 Spray 3 sprays Spray Dosing Unit Spray - unit of product usage 4 Spray 5 419694003 6 Spray 7 Spray - unit of product usage (qualifier value) 8 Spray 9 C1704413
comment: 1 M05247-1 2 Spray 3 sprays Spray Dosing Unit Spray - unit of product usage 4 Spray 5 419694003 6 Spray 7 Spray - unit of product usage (qualifier value) 8 Spray 9 C4521772
comment: 1 M05247-2 2 Spray 3 sprays Spray Dosing Unit Spray - unit of product usage 4 Spray 5 738996007 6 Spray 7 Spray (administration method) 8 Spray 9 C1704413
comment: 1 M05247-3 2 Spray 3 sprays Spray Dosing Unit Spray - unit of product usage 4 Spray 5 738996007 6 Spray 7 Spray (administration method) 8 Spray 9 C4521772
alternative label: Spray Dosing Unit
alternative label: sprays
alternative label: Spray - unit of product usage

Square Centimeter
type: Class
subclass of: Units
comment: 1 M04331 2 Square Centimeter 3 sq. cm square centimetres square centimetre square centimeters sq. cm. SQ CM cm2 centimeter squared 4 Square Centimeter 5 259022006 6 Square centimeter 7 Square centimeter (qualifier value) 8 Square centimeter 9 C0439479
alternative label: square centimetres
alternative label: square centimeters
alternative label: SQ CM
alternative label: square centimetre
alternative label: centimeter squared
alternative label: sq. cm
alternative label: sq. cm.
alternative label: cm2

Square Foot
type: Class
subclass of: Units
comment: 1 M04655 2 Square Foot 3 foot squared ft2 4 Square Foot 5 282384009 6 Square foot 7 Square foot (qualifier value) 8 Square foot 9 C0560748
alternative label: ft2
alternative label: sq. ft
alternative label: SQ FT
alternative label: foot squared

Square Inch
type: Class
subclass of: Units
comment: 1 M04660 2 Square Inch 3 sq. in sq. inch 4 Square Inch 5 282383003 6 Square inch 7 Square inch (qualifier value) 8 Square inch 9 C0560749
alternative label: sq. in
alternative label: sq. inch

Square Meter
type: Class
subclass of: Units
comment: 1 M04460 2 Square Meter 3 sq. m Sq M 4 Square Meter 5 278077005 6 Square meter 7 Square meter (qualifier value) 8 Square meter 9 C0457242
alternative label: Sq M
alternative label: sq. m

Square Micrometer
type: Class
subclass of: Units
comment: 1 M05636 2 Square Micrometer 3 um2 4 Square Micrometer 5 25867400 6 Micrometer 7 Micrometer (qualifier value) 8 Square Micrometer 9 C2348407
alternative label: um2

Square Millimeter
type: Class
subclass of: Units
comment: 1 M04454 2 Square Millimeter 3 square millimetres square millimetre square millimeters 4 Square Millimeter 5 277472009 6 Square millimeter 7 Square millimeter (qualifier value) 8 Square millimeter 9 C0456786
alternative label: square millimetres
alternative label: square millimetre
alternative label: square millimeters

Squash
type: Class
subclass of: Sport
comment: 1 M00439 2 Squash 3 None 4 Squash 5 412065005 6 Squash 7 Squash (substance) 8 Squash 9 C0524880
comment: 1 M00439-1 2 Squash 3 None 4 Squash 5 412065005 6 Squash 7 Squash (substance)_parent가 vegetable 8 Squash 9 C0038076
comment: 1 M00439-2 2 Squash 3 None 4 Squash 5 415578009 6 Squash 7 Squash - court game (qualifier value) 8 Squash 9 C0038076
comment: 1 M00439-3 2 Squash 3 None 4 Squash 5 415578009 6 Squash 7 Squash - court game (qualifier value) 8 Squash 9 C0524880

Squat
type: Class
subclass of: Muscle Strengthening Exercise
comment: 1 MD03244 2 Squat 3 squatting 4 Squat 5 10904000 6 Squats 7 Orthostatic body position (finding) 8 Does squat (finding) 9 C0241236
comment: 1 MD03781 2 Squat 3 squatting 4 squat 5 282961006 6 Squats 7 Does squat (finding) 8 Does squat (finding) 9 C0241236
alternative label: Squatting
alternative label: squatting

Stability of a single joint
type: Class
subclass of: Musculoskeletal function (Body measurement)
comment: 1 MD06031 2 Stability of a single joint 3 None 4 Stability of a single joint 5 366716005 6 Stability of joint 7 Stability of joint (finding) 8 Stability of a single joint 9 C2371203

Stability of joint functions
type: Class
subclass of: Musculoskeletal function (Body measurement)
comment: 1 MD06030 2 Stability of joint functions 3 None 4 Stability of joint functions 5 366716005 6 Stability of joint 7 Stability of joint (finding) 8 Stability of joint functions 9 C2371207

Stability of joints generalized
type: Class
subclass of: Musculoskeletal function (Body measurement)
comment: 1 MD06033 2 Stability of joints generalized 3 None 4 Stability of joints generalized 5 366716005 6 Stability of joint 7 Stability of joint (finding) 8 Stability of joints generalized 9 C2371205

Stability of several joints
type: Class
subclass of: Musculoskeletal function (Body measurement)
comment: 1 MD06032 2 Stability of several joints 3 None 4 Stability of several joints 5 366716005 6 Stability of joint 7 Stability of joint (finding) 8 Stability of several joints 9 C2371204

Stabilizer
type: Class
subclass of: Equipment
comment: 1 MD04289 2 Stabilizer 3 None 4 Stabilizer 5 246137000 6 equipment 7 Equipment (attribute) 8 equipment 9 C0014672

Stacking
type: Class
subclass of: Health Related Factors
comment: 1 MD04680 2 Stacking 3 None 4 Stacking 5 844005 6 Behavior finding 7 Behavior finding (finding) 8 Behavior 9 C0004927

Stair-climbing machine
type: Class
subclass of: Sport
comment: 1 MD01068 2 Stair-climbing machine 3 None 4 Stair-climbing machine 5 129016000 6 Climbing stairs 7 Climbing stairs (observable entity) 8 Climbing stairs 9 C1290942

Stair machine
type: Class
subclass of: Equipment
comment: 1 M00440 2 Stair machine 3 None 4 Stair machine 5 61284002 6 Machine 7 Machine, device (physical object) 8 Stair (equipment) 9 C2825408

Stairs
type: Class
subclass of: Equipment
comment: Equipment/Device/Tool/Questionnaire Questionnaire None 1 MD02814 2 Stairs 3 None 4 stairs 5 229766003 6 stairs - location 7 Staircase - location (environment) 8 Staircase - location 9 C0562493
comment: Equipment/Device/Tool/Questionnaire Equipment None 1 MD04555 2 Stairs 3 None 4 Stairs 5 246137000 6 Equipment 7 Equipment (attribute) 8 Equipment 9 C0014672

Stand-up paddleboarding
type: Class
subclass of: Sport
comment: 1 MD01071 2 stand up paddleboarding 3 None 4 Stand-up paddleboarding 5 14468000 6 Sports 7 Sports activity (observable entity) 8 Sports 9 C0038039
comment: 1 MD01071-1 2 stand up paddleboarding 3 None 4 Stand-up paddleboarding 5 415577004 6 Sport 7 Sport (qualifier value) 8 Sports 9 C0038039

Stand and spread your feet shoulder-width apart
type: Class
subclass of: Questionnaire
comment: 1 MD04822 2 Stand and spread your feet shoulder-width apart 3 None 4 Stand and spread your feet shoulder-width apart 5 246137000 6 equipment 7 Equipment (attribute) 8 equipment 9 C0014672

Stand up from sitting
type: Class
subclass of: Health Related Factors
comment: 1 MD03228 2 Stand up from sitting 3 None 4 Stand up from sitting 5 282881008 6 ability to stand from sitting 7 Ability to stand from sitting (observable entity) 8 Ability to stand from sitting 9 C0560798

Standard Cubic Foot
type: Class
subclass of: Units
comment: 1 M05638 2 Standard Cubic Foot 3 scf 4 Standard Cubic Foot 5 767525000 6 Unit 7 Unit (qualifier value) 8 Standard Cubic Foot 9 C2348522
alternative label: scf

Standard Cubic Meter
type: Class
subclass of: Units
comment: 1 M05640 2 Standard Cubic Meter 3 None 4 Standard Cubic Meter 5 767525000 6 Unit 7 Unit (qualifier value) 8 Standard Cubic Foot 9 C2348522
alternative label: scm

Standing
type: Class
subclass of: Health Related Factors
comment: 1 MD06280 2 Standing 3 standing, stand, standing 4 Standing 5 10904000 6 Standing 7 Orthostatic body position (finding) 8 Standing 9 C0231472
alternative label: stand

Standing in a sitting position
type: Class
subclass of: Aerobic Exercise
comment: 1 MD02709 2 Standing in a sitting position 3 None 4 Standing in a sitting position 5 282887007 6 ability to pull to standing from sitting 7 Ability to pull to standing from sitting (observable entity) 8 Ability to pull to standing from sitting 9 C0560804

Standing up
type: Class
subclass of: Health Related Factors
comment: 1 MD03243 2 Standing up 3 stand up 4 Standing up 5 258148007 6 Standing up 7 Standing up (observable entity) 8 Standing up 9 C0444796
alternative label: stand up

Starting a conversation
type: Class
subclass of: Health Related Factors
comment: 1 MD06253 2 Starting a conversation 3 None 4 Starting a conversation 5 288642003 6 Initiates conversation 7 Does initiate conversation (finding) 8 Starting a conversation 9 C2371357

State of consciousness
type: Class
subclass of: Nervous system and Mental function (Body measurement)
comment: 1 MD05599 2 State of consciousness 3 None 4 State of consciousness 5 106167005 6 Consciousness 7 Consciousness related finding (finding) 8 State of consciousness 9 C0679009

State of drinking
type: Class
subclass of: Digestive function (Symptom)
comment: 1 M05727 2 State of drinking 3 None 4 State of drinking 5 30953006 6 Drinking 7 Drinking (observable entity) 8 Drinking function 9 C0684271

Stationary bike
type: Class
subclass of: Device
comment: 1 M00371 2 Stationary bike 3 Stationary biking 4 Stationary bike 5 70224005 6 Bike 7 Bicycle, device (physical object) 8 Stationary bike 9 C2712863
alternative label: Stationary biking

Statute Mile
type: Class
subclass of: Units
comment: 1 M03623 2 Statute Mile 3 None 4 Statute Mile 5 258678002 6 Mile 7 Mile (qualifier value) 8 Miles 9 C0439148

Steele-Richardson-Olszewski
type: Class
subclass of: Hospital information, examination/diagnosis/treatment data
comment: 1 MD00459 2 Steele-Richardson-Olszewski 3 None 4 Steele-Richardson-Olszewski 5 28978003 6 Progressive supranuclear ophthalmoplegia 7 Progressive supranuclear ophthalmoplegia (disorder) 8 Ophthalmoplegia, Progressive Supranuclear 9 C4551862

Stereotypies and motor perseveration
type: Class
subclass of: Musculoskeletal function (Body measurement)
comment: 1 MD06093 2 Stereotypies and motor perseveration 3 None 4 Stereotypies and motor perseveration 5 84328007 6 Stereotyped movement 7 Stereotyped routines (finding) 8 Stereotypies and motor perseveration 9 C2371255
comment: 1 MD06093-1 2 Stereotypies and motor perseveration 3 None 4 Stereotypies and motor perseveration 5 44515000 6 Perseveration 7 Perseveration (finding) 8 Stereotypies and motor perseveration 9 C2371255

Stiff neck
type: Class
subclass of: Musculoskeletal function (Symptom)
comment: 1 M00517 2 Stiff neck 3 None 4 Stiff neck 5 161882006 6 Stiff neck 7 Stiff neck (finding) 8 Stiff neck 9 C0151315

Stopped drinking alcohol
type: Class
subclass of: Sub-Cultural Level
comment: 1 M00020 2 Stopped drinking alcohol 3 None 4 Stopped drinking alcohol 5 160579004 6 Stopped drinking alcohol 7 Stopped drinking alcohol (finding) 8 Stopped drinking alcohol 9 C0425321

Storing daily necessities
type: Class
subclass of: Health Related Factors
comment: 1 MD06433 2 Storing daily necessities 3 None 4 Storing daily necessities 5 183364001 6 Use of aids for daily life ( 7 Use of aids for daily life (regime/therapy) 8 Storing daily necessities 9 C2371502

Strangers
type: Class
subclass of: Characteristics of the individual
comment: 1 MD06690 2 Strangers 3 None 4 Strangers 5 125676002 6 Person 7 Person (person) 8 Strangers 9 C2371722

Strava cycling
type: Class
subclass of: Units
comment: 1 M05769 2 Strava cycling 3 None 4 Strava cycling 5 413568008 6 Application - unit of product usage (qualifier value) 7 Application - unit of product usage (qualifier value) 8 Application dose 9 C1533134

Strength
type: Class
subclass of: Musculoskeletal function (Body measurement)
comment: Body measurement Musculoskeletal function None 1 MD04671 2 Strength 3 None 4 strength 5 411117005 6 Has strength 7 Has strength (attribute) 8 Has strength 9 C1445096
comment: Bodymeasurement Musculoskeletal function None 1 MD04140 2 Strength 3 None 4 Strength 5 411117005 6 Has strengt 7 Has strength (attribute) 8 STRENGTH (attribute) 9 C0808080

Strength training
type: Class
subclass of: Sport
comment: 1 MD01073 2 Strength training 3 strength_training_training 4 Strength training 5 386291006 6 Exercise promotion: strength training 7 Exercise promotion: strength training (procedure) 8 Exercise promotion: strength training 9 C1271034
alternative label: strength_training_training

Strengthening activity
type: Class
subclass of: Muscle Strengthening Exercise
comment: 1 M02372 2 Strengthening activity 3 None 4 Strengthening activity 5 6397004 6 Strengthening activity 7 Muscular strength development exercise (regime/therapy) 8 Muscular strength development exercise 9 C0452260

Stress
type: Class
subclass of: Nervous system and Mental function (Symptom)
comment: 1 MD00787 2 Stress 3 None 4 Stress 5 73595000 6 Stress 7 Stress (finding) 8 Stress 9 C0038435
comment: 1 MD00787-1 2 Stress 3 None 4 Stress 5 262188008 6 Stress 7 Stress (qualifier value) 8 Stress 9 C0038435

Stress Check by Azumio
type: Class
subclass of: Units
comment: 1 M05770 2 Stress Check by Azumio 3 None 4 Stress Check by Azumio 5 413568008 6 Application - unit of product usage (qualifier value) 7 Application - unit of product usage (qualifier value) 8 Application dose 9 C1533134

Stretch motor reflex
type: Class
subclass of: Nervous system and Mental function (Body measurement)
comment: 1 MD06071 2 Stretch motor reflex 3 None 4 Stretch motor reflex 5 63177006 6 Stretch reflex 7 Stretch reflex (observable entity) 8 Stretch motor reflex 9 C2371241

Stretch your arms forward or lift them above your shoulders
type: Class
subclass of: Questionnaire
comment: 1 MD05067 2 Stretch your arms forward or lift them above your shoulders 3 None 4 Stretch your arms forward or lift them above your shoulders 5 273389003 6 Daily activities questionnaire 7 Daily activities questionnaire (assessment scale) 8 questionnaire 9 C0034394

Stretching against the wall
type: Class
subclass of: Conditioning exercise
comment: 1 MD02789 2 Stretching against the wall 3 None 4 Stretching against the wall 5 122546009 6 stretching 7 Stretching procedure (procedure) 8 Stretching - action 9 C0581717

Stretching exercises
type: Class
subclass of: Aerobic Exercise
comment: 1 M00360 2 Stretching exercises 3 stretch exercise 4 Stretching exercises 5 229070002 6 Stretching exercises 7 Stretching exercises (regime/therapy) 8 Stretching exercises 9 C0600080
alternative label: stretch exercise

Stretching procedure
type: Class
subclass of: Aerobic Exercise
comment: 1 M02675 2 Stretching procedure 3 None 4 Stretching procedure 5 122546009 6 Stretching procedure 7 Stretching procedure (procedure) 8 Stretching exercises 9 C0600080

Stride Set
type: Class
subclass of: Aerobic Exercise
comment: 1 MD02647 2 Stride Set 3 None 4 Stride Set 5 418060005 6 running 7 Running (observable entity) 8 Running (physical activity) 9 C0035953

Strip
type: Class
subclass of: Device
comment: 1 M03462 2 Strip 3 Strip Dosing Unit 4 Strip 5 408097009 6 Strip 7 Strip (physical object) 8 strip medical device 9 C1321564
comment: 1 M03462-1 2 Strip 3 Strip Dosing Unit 4 Strip 5 408097009 6 Strip 7 Strip (physical object) 8 Strip 9 C3241918
comment: 1 M03462-10 2 Strip 3 Strip Dosing Unit 4 Strip 5 733018009 6 Strip 7 Strip (unit of presentation) 8 Strip 9 C4319668
comment: 1 M03462-11 2 Strip 3 Strip Dosing Unit 4 Strip 5 733018009 6 Strip 7 Strip (unit of presentation) 8 Strip 9 C4722389
comment: 1 M03462-12 2 Strip 3 Strip Dosing Unit 4 Strip 5 758679000 6 Strip 7 Strip (basic dose form) 8 Strip 9 C1321564
comment: 1 M03462-13 2 Strip 3 Strip Dosing Unit 4 Strip 5 758679000 6 Strip 7 Strip (basic dose form) 8 Strip 9 C3241918
comment: 1 M03462-14 2 Strip 3 Strip Dosing Unit 4 Strip 5 758679000 6 Strip 7 Strip (basic dose form) 8 Strip 9 C4319668
comment: 1 M03462-15 2 Strip 3 Strip Dosing Unit 4 Strip 5 758679000 6 Strip 7 Strip (basic dose form) 8 Strip 9 C4722389
comment: 1 M03462-2 2 Strip 3 Strip Dosing Unit 4 Strip 5 408097009 6 Strip 7 Strip (physical object) 8 Strip 9 C4319668
comment: 1 M03462-3 2 Strip 3 Strip Dosing Unit 4 Strip 5 408097009 6 Strip 7 Strip (physical object) 8 Strip 9 C4722389
comment: 1 M03462-4 2 Strip 3 Strip Dosing Unit 4 Strip 5 1671000175104 6 Strip 7 Strip - unit of product usage (qualifier value) 8 Strip 9 C1321564
comment: 1 M03462-5 2 Strip 3 Strip Dosing Unit 4 Strip 5 1671000175104 6 Strip 7 Strip - unit of product usage (qualifier value) 8 Strip 9 C3241918
comment: 1 M03462-6 2 Strip 3 Strip Dosing Unit 4 Strip 5 1671000175104 6 Strip 7 Strip - unit of product usage (qualifier value) 8 Strip 9 C4319668
comment: 1 M03462-7 2 Strip 3 Strip Dosing Unit 4 Strip 5 1671000175104 6 Strip 7 Strip - unit of product usage (qualifier value) 8 Strip 9 C4722389
comment: 1 M03462-8 2 Strip 3 Strip Dosing Unit 4 Strip 5 733018009 6 Strip 7 Strip (unit of presentation) 8 Strip 9 C1321564
comment: 1 M03462-9 2 Strip 3 Strip Dosing Unit 4 Strip 5 733018009 6 Strip 7 Strip (unit of presentation) 8 Strip 9 C3241918
alternative label: Strip Dosing Unit

Stroke recovery exercise for leg
type: Class
subclass of: Limb
comment: 1 MD02898 2 Stroke recovery exercise for leg 3 None 4 Stroke recovery exercise for leg 5 229152003 6 leg exercises 7 Lower limb exercises (regime/therapy) 8 Lower limb exercises 9 C0454361

Stroke rehab exercise for arms
type: Class
subclass of: Limb
comment: 1 MD02913 2 Storke rehab exercise for arms 3 None 4 Stroke rehab exercise for arms 5 229109003 6 Arm exercises 7 Upper limb exercises (regime/therapy) 8 Upper limb exercises 9 C0454320

Stroke rehabilitation
type: Class
subclass of: Cardiovascular system function (Therapy)
comment: 1 M00630 2 Stroke rehabilitation 3 "rehabilitation stroke rehabilitation strokes" 4 Stroke rehabilitation 5 2517002 6 Stroke rehabilitation 7 Stroke rehabilitation (regime/therapy) 8 Stroke rehabilitation 9 C0204097
alternative label: rehabilitation stroke
alternative label: rehabilitation strokes

Structure of ankle and foot
type: Class
subclass of: Musculoskeletal function (Body region)
comment: 1 MD07073 2 Structure of ankle and foot 3 None 4 Structure of ankle and foot 5 410773000 6 Structure of ankle and/or foot 7 Structure of fascia of lower leg (body structure) 8 Structure of ankle and foot 9 C1690938

Structure of areas of skin
type: Class
subclass of: Sensory function, Pain and Skin function (Body region)
comment: 1 MD07103 2 Structure of areas of skin 3 None 4 Structure of areas of skin 5 39937001 6 Skin structure 7 Skin structure (body structure) 8 Structure of areas of skin 9 C2371905

Structure of axillary fossa
type: Class
subclass of: Musculoskeletal function (Body region)
comment: 1 M01232 2 Structure of axillary fossa 3 Axillary fossa, Fossa axillaris, Underarm 4 Structure of axillary fossa 5 422543003 6 Structure of axillary fossa 7 Structure of axillary fossa (body structure) 8 Structure of axillary fossa 9 C0004454
alternative label: Underarm
alternative label: Axillary fossa
alternative label: Fossa axillaris

Structure of brain
type: Class
subclass of: Nervous system and Mental function (Body region)
comment: 1 MD06820 2 Structure of brain 3 brain 4 Structure of brain 5 12738006 6 brain 7 Brain structure (body structure) 8 Structure of brain 9 C0006104
alternative label: brain

Structure of brain stem
type: Class
subclass of: Nervous system and Mental function (Body region)
comment: 1 MD06832 2 Structure of brain stem 3 None 4 Structure of brain stem 5 15926001 6 brain stem 7 Brainstem structure (body structure) 8 Structure of brain stem 9 C2371847

Structure of cardiovascular system
type: Class
subclass of: Cardiovascular system function (Body region)
comment: 1 MD06922 2 Structure of cardiovascular system 3 None 4 Structure of cardiovascular system 5 113257007 6 Structure of cardiovascular system 7 Structure of cardiovascular system (body structure) 8 Structure of cardiovascular system 9 C0007226

Structure of cerebellum
type: Class
subclass of: Nervous system and Mental function (Body region)
comment: 1 MD06831 2 Structure of cerebellum 3 None 4 Structure of cerebellum 5 113305005 6 cerebellum 7 Cerebellar structure (body structure) 8 Structure of cerebellum 9 C2371846

Structure of cortical lobes
type: Class
subclass of: Nervous system and Mental function (Body region)
comment: 1 MD06821 2 Structure of cortical lobes 3 None 4 Structure of cortical lobes 5 90597002 6 lobe of brain 7 Structure of lobe of brain (body structure) 8 Structure of cortical lobes 9 C2371842

Structure of cranial nerves
type: Class
subclass of: Nervous system and Mental function (Body region)
comment: 1 MD06837 2 Structure of cranial nerves 3 None 4 Structure of cranial nerves 5 25238003 6 crainal nerve 7 Cranial nerve structure (body structure) 8 Structure of cranial nerves 9 C0010268

Structure of endocrine glands
type: Class
subclass of: Functions of Blood System, Metabolic system and Endocrine system (Body region)
comment: 1 MD06969 2 Structure of endocrine glands 3 Endocrine gland functions 4 Structure of endocrine glands 5 387910009 6 endocrine gland structure 7 Endocrine gland structure (body structure) 8 Structure of endocrine glands 9 C0014133
alternative label: Endocrine gland functions

Structure of external ear
type: Class
subclass of: Sensory function, Pain and Skin function (Body region)
comment: 1 MD06872 2 Structure of external ear 3 None 4 Structure of external ear 5 28347008 6 external ear 7 External ear structure (body structure) 8 Structure of external ear 9 C0013453

Structure of extraperitoneal space
type: Class
subclass of: Musculoskeletal function (Body region)
comment: 1 M01332 2 Structure of extraperitoneal space 3 Extraperitoneal Space 4 Structure of extraperitoneal space 5 83137009 6 Structure of extraperitoneal space 7 Structure of extraperitoneal space (body structure) 8 Structure of extraperitoneal space 9 C0230197
alternative label: Extraperitoneal Space

Structure of eye socket
type: Class
subclass of: Sensory function, Pain and Skin function (Body region)
comment: 1 MD06856 2 Structure of eye socket 3 None 4 Structure of eye socket 5 81745001 6 eye structure 7 Structure of eye proper (body structure) 8 Structure of eye socket 9 C2371860

Structure of eyeball
type: Class
subclass of: Sensory function, Pain and Skin function (Body region)
comment: 1 MD06857 2 Structure of eyeball 3 None 4 Structure of eyeball 5 81745001 6 eyeball 7 Structure of eye proper (body structure) 8 Structure of eyeball 9 C0015392

Structure of forearm
type: Class
subclass of: Musculoskeletal function (Body region)
comment: 1 MD07035 2 Structure of forearm 3 None 4 Structure of forearm 5 14975008 6 Forearm 7 Forearm structure (body structure) 8 Structure of forearm 9 C0016536

Structure of gall bladder and ducts
type: Class
subclass of: Digestive function (Body region)
comment: 1 MD06968 2 Structure of gall bladder and ducts 3 None 4 Structure of gall bladder and ducts 5 28231008 6 gall bladder 7 Gallbladder structure (body structure) 8 Structure of gall bladder and ducts 9 C2371036

Structure of hair
type: Class
subclass of: Sensory function, Pain and Skin function (Body region)
comment: 1 MD07122 2 Structure of hair 3 Functions of hair 4 Structure of hair 5 361702001 6 Hair structure (body structure) 7 Entire hair (body structure) 8 Structure of hair 9 C0018494
alternative label: Functions of hair

Structure of hand
type: Class
subclass of: Musculoskeletal function (Body region)
comment: 1 MD07042 2 Structure of hand 3 None 4 Structure of hand 5 85562004 6 Hand 7 Hand structure (body structure) 8 Structure of hand 9 C3714557

Structure of head and neck region
type: Class
subclass of: Musculoskeletal function (Body region)
comment: 1 MD07011 2 Structure of head and neck region 3 None 4 Structure of head and neck region 5 361355005 6 Entire head and neck 7 Entire head and neck (body structure) 8 Structure of head and neck region 9 C2371056

Structure of immune system
type: Class
subclass of: Immune system function (Body region)
comment: 1 MD06933 2 Structure of immune system 3 None 4 Structure of immune system 5 116003000 6 Structure of immune system 7 Structure of immune system (body structure) 8 Structure of immune system 9 C0020962

Structure of inner ear
type: Class
subclass of: Sensory function, Pain and Skin function (Body region)
comment: 1 MD06879 2 Structure of inner ear 3 None 4 Structure of inner ear 5 22945000 6 inner ear 7 Inner ear structure (body structure) 8 Structure of inner ear 9 C0022889

Structure of intestine
type: Class
subclass of: Digestive function (Body region)
comment: 1 MD06961 2 Structure of intestine 3 None 4 Structure of intestine 5 113276009 6 intestine 7 Intestinal structure (body structure) 8 Structure of intestine 9 C0021853

Structure of larynx
type: Class
subclass of: Respiratory function (Body region)
comment: 1 MD06916 2 Structure of larynx 3 None 4 Structure of larynx 5 4596009 6 larynx 7 Laryngeal structure (body structure) 8 Structure of larynx 9 C0023078

Structure of lateral region of abdomen
type: Class
subclass of: Hospital information, examination/diagnosis/treatment data
comment: 1 M01403 2 Structure of lateral region of abdomen 3 None 4 Structure of lateral region of abdomen 5 84281001 6 Structure of lateral region of abdomen 7 Structure of lateral region of abdomen (body structure) 8 Structure of lateral region of abdomen 9 C0230171

Structure of lips
type: Class
subclass of: Digestive function (Body region)
comment: 1 MD06905 2 Structure of lips 3 None 4 Structure of lips 5 48477009 6 lip 7 Lip structure (body structure) 8 Structure of lips 9 C0023759

Structure of liver
type: Class
subclass of: Digestive function (Body region)
comment: 1 MD06967 2 Structure of liver 3 None 4 Structure of liver 5 10200004 6 liver 7 Liver structure (body structure) 8 Structure of liver 9 C0023884

Structure of lower third of esophagus
type: Class
subclass of: Digestive function (Body region)
comment: 1 M01807 2 Structure of lower third of esophagus 3 Structure of lower third of oesophagus 4 Structure of lower third of esophagus 5 67173009 6 Structure of lower third of esophagus 7 Structure of lower third of esophagus (body structure) 8 Structure of lower third of esophagus 9 C0227191
alternative label: Structure of lower third of oesophagus

Structure of mediastinum
type: Class
subclass of: Musculoskeletal function (Body region)
comment: 1 M01912 2 Structure of mediastinum 3 None 4 Structure of mediastinum 5 72410000 6 Structure of mediastinum 7 Mediastinal structure (body structure) 8 Structure of mediastinum 9 C0025066

Structure of meninges
type: Class
subclass of: Nervous system and Mental function (Body region)
comment: 1 MD06851 2 Structure of meninges 3 None 4 Structure of meninges 5 1231004 6 meninges 7 Meninges structure (body structure) 8 Structure of meninges 9 C0025285

Structure of midbrain
type: Class
subclass of: Nervous system and Mental function (Body region)
comment: 1 MD06828 2 Structure of midbrain 3 None 4 Structure of midbrain 5 61962009 6 midbrain 7 Midbrain structure (body structure) 8 Structure of midbrain 9 C0025462

Structure of middle ear
type: Class
subclass of: Sensory function, Pain and Skin function (Body region)
comment: 1 MD06873 2 Structure of middle ear 3 None 4 Structure of middle ear 5 25342003 6 middle ear 7 Middle ear structure (body structure) 8 Structure of middle ear 9 C0013455

Structure of middle third of esophagus
type: Class
subclass of: Digestive function (Body region)
comment: 1 M01942 2 Structure of middle third of esophagus 3 None 4 Structure of middle third of esophagus 5 19000002 6 Structure of middle third of esophagus 7 Structure of middle third of esophagus (body structure) 8 Structure of middle third of esophagus 9 C0227189
alternative label: Structure of middle third of oesophagus

Structure of mouth
type: Class
subclass of: Digestive function (Body region)
comment: 1 MD06894 2 Structure of mouth 3 None 4 Structure of mouth 5 123851003 6 mouth 7 Mouth region structure (body structure) 8 Structure of mouth 9 C0230028

Structure of nose
type: Class
subclass of: Sensory function, Pain and Skin function (Body region)
comment: 1 MD06888 2 Structure of nose 3 None 4 Structure of nose 5 45206002 6 nose 7 Nasal structure (body structure) 8 Structure of nose 9 C0028429

Structure of oesophagus
type: Class
subclass of: Digestive function (Body region)
comment: 1 MD06959 2 Structure of oesophagus 3 None 4 Structure of oesophagus 5 32849002 6 oesophagus 7 Esophageal structure (body structure) 8 Structure of oesophagus 9 C0014876

Structure of palate
type: Class
subclass of: Digestive function (Body region)
comment: 1 MD06901 2 Structure of palate 3 None 4 Structure of palate 5 72914001 6 palate 7 Palatal structure (body structure) 8 Structure of palate 9 C0700374

Structure of parasympathetic nervous system
type: Class
subclass of: Nervous system and Mental function (Body region)
comment: 1 MD06853 2 Structure of parasympathetic nervous system 3 None 4 Structure of parasympathetic nervous system 5 23424009 6 parasyspathetic nervous system 7 Parasympathetic nervous system structure (body structure) 8 Structure of parasympathetic nervous system 9 C0030510

Structure of pelvic floor
type: Class
subclass of: Musculoskeletal function (Body region)
comment: 1 MD06985 2 Structure of pelvic floor 3 None 4 Structure of pelvic floor 5 87770006 6 Pelvic floor 7 Pelvic floor structure (body structure) 8 Structure of pelvic floor 9 C0206248

Structure of pelvic region
type: Class
subclass of: Musculoskeletal function (Body region)
comment: 1 MD07051 2 Structure of pelvic region 3 None 4 Structure of pelvic region 5 12921003 6 Pelvic region 7 Structure of pelvis (body structure) 8 Structure of pelvic region 9 C2371077

Structure of pharynx
type: Class
subclass of: Respiratory function (Body region)
comment: 1 MD06911 2 Structure of pharynx 3 None 4 Structure of pharynx 5 54066008 6 pharynx 7 Pharyngeal structure (body structure) 8 Structure of pharynx 9 C0031354

Structure of reproductive system
type: Class
subclass of: Urogenital function (Body region)
comment: 1 MD06986 2 Structure of reproductive system 3 None 4 Structure of reproductive system 5 278875001 6 Entire reproductive system 7 Entire reproductive system (body structure) 8 Structure of reproductive system 9 C2371043

Structure of respiratory system
type: Class
subclass of: Respiratory function (Body region)
comment: 1 MD06941 2 Structure of respiratory system 3 None 4 Structure of respiratory system 5 20139000 6 Structure of respiratory system 7 Structure of respiratory system (body structure) 8 Structure of respiratory system 9 C0035237

Structure of salivary glands
type: Class
subclass of: Digestive function (Body region)
comment: 1 MD06958 2 Structure of salivary glands 3 None 4 Structure of salivary glands 5 385294005 6 salivary gland 7 Salivary gland structure (body structure) 8 Structure of salivary glands 9 C0036098

Structure of shoulder region
type: Class
subclass of: Musculoskeletal function (Body region)
comment: Body region Musculoskeletal function None 1 MD07020 2 Structure of shoulder region 3 None 4 Structure of shoulder region 5 16982005 6 Shoulder region 7 Shoulder region structure (body structure) 8 Structure of shoulder region 9 C0037004

Structure of skin glands
type: Class
subclass of: Sensory function, Pain and Skin function (Body region)
comment: 1 MD07112 2 Structure of skin glands 3 None 4 Structure of skin glands 5 732104009 6 Entire skin gland 7 Entire skin gland (body structure) 8 Structure of skin glands 9 C2371911

Structure of sole of foot
type: Class
subclass of: Sensory function, Pain and Skin function (Body region)
comment: 1 M02060 2 Structure of sole of foot 3 Sole of Foot, foot soles, foot sole, Sole, soles 4 Structure of sole of foot 5 57999000 6 Structure of sole of foot 7 Structure of sole of foot (body structure) 8 Structure of sole of foot 9 C0230463
alternative label: foot soles
alternative label: Sole
alternative label: soles
alternative label: foot sole
alternative label: Sole of Foot

Structure of spinal cord
type: Class
subclass of: Nervous system and Mental function (Body region)
comment: 1 MD06841 2 Structure of spinal cord 3 None 4 Structure of spinal cord 5 2748008 6 spinal cord 7 Spinal cord structure (body structure) 8 Structure of spinal cord 9 C0037925

Structure of stomach
type: Class
subclass of: Digestive function (Body region)
comment: 1 MD06960 2 Structure of stomach 3 None 4 Structure of stomach 5 69695003 6 stomach 7 Stomach structure (body structure) 8 Structure of stomach 9 C3714551

Structure of suprasellar region
type: Class
subclass of: Musculoskeletal function (Body region)
comment: 1 M02164 2 Structure of suprasellar region 3 supranuclear, Suprasellar Region, Suprapubic region, Suprasellar region, Suprasellar 4 Structure of suprasellar region 5 15328005 6 Structure of suprasellar region 7 Structure of suprasellar region (body structure) 8 Structure of suprasellar region 9 C0230054
alternative label: Suprasellar Region
alternative label: Suprapubic region
alternative label: Suprasellar region
alternative label: Suprasellar

Structure of sympathetic nervous system
type: Class
subclass of: Nervous system and Mental function (Body region)
comment: 1 MD06852 2 Structure of sympathetic nervous system 3 None 4 Structure of sympathetic nervous system 5 68365008 6 syspathetic nervous structure 7 Sympathetic nervous system structure (body structure) 8 Structure of sympathetic nervous system 9 C0039044

Structure of the penis
type: Class
subclass of: Urogenital function (Body region)
comment: 1 MD07001 2 Structure of the penis 3 None 4 Structure of the penis 5 18911002 6 Penis 7 Penile structure (body structure) 8 Structure of the penis 9 C0030851

Structure of thigh
type: Class
subclass of: Musculoskeletal function (Body region)
comment: 1 MD07059 2 Structure of thigh 3 None 4 Structure of thigh 5 68367000 6 Thigh 7 Thigh structure (body structure) 8 Structure of thigh 9 C0039866

Structure of upper arm
type: Class
subclass of: Musculoskeletal function (Body region)
comment: 1 MD07028 2 Structure of upper arm 3 None 4 Structure of upper arm 5 40983000 6 Upper arm 7 Structure of upper extremity between shoulder and elbow (body structure) 8 Structure of upper arm 9 C0446516

Structure of upper third of esophagus
type: Class
subclass of: Digestive function (Body region)
comment: 1 M02299 2 Structure of upper third of esophagus 3 Structure of upper third of oesophagus 4 Structure of upper third of esophagus 5 54738009 6 Structure of upper third of esophagus 7 Structure of upper third of esophagus (body structure) 8 Upper third of esophagus 9 C0227187

Structure of urinary system
type: Class
subclass of: Urogenital function (Body region)
comment: 1 MD06978 2 Structure of urinary system 3 None 4 Structure of urinary system 5 122489005 6 Urinary system 7 Urinary system structure (body structure) 8 Structure of urinary system 9 C1508753

Structure of uterus
type: Class
subclass of: Urogenital function (Body region)
comment: 1 MD06988 2 Structure of uterus 3 None 4 Structure of uterus 5 35039007 6 Uterus 7 Uterine structure (body structure) 8 Structure of uterus 9 C2371044

Structure of vagina and external genitalia
type: Class
subclass of: Urogenital function (Body region)
comment: 1 MD06995 2 Structure of vagina and external genitalia 3 None 4 Structure of vagina and external genitalia 5 76784001 6 Vagina 7 Vaginal structure (body structure) 8 Structure of vagina and external genitalia 9 C2371048
comment: 1 MD06995-1 2 Structure of vagina and external genitalia 3 None 4 Structure of vagina and external genitalia 5 77142006 6 External genitalia 7 External genitalia structure (body structure) 8 Structure of vagina and external genitalia 9 C2371048

Structure of vertebral column
type: Class
subclass of: Musculoskeletal function (Body region)
comment: 1 MD07083 2 Structure of vertebral column 3 None 4 Structure of vertebral column 5 421060004 6 Structure of vertebral column 7 Structure of vertebral column (body structure) 8 Structure of vertebral column 9 C0037949

Structures around eye
type: Class
subclass of: Sensory function, Pain and Skin function (Body region)
comment: 1 MD06866 2 Structures around eye 3 None 4 Structures around eye 5 81745001 6 eye structure 7 Structure of eye proper (body structure) 8 Structures around eye 9 C2371865

Sturge-Weber-Dimitri syndrome
type: Class
subclass of: Hospital information, examination/diagnosis/treatment data
comment: 1 MD00495 2 Dimitri 3 None 4 Sturge-Weber-Dimitri syndrome 5 19886006 6 Sturge-Weber-Dimitri syndrome 7 Sturge-Weber syndrome (disorder) 8 Sturge-Weber Syndrome 9 C0038505

Sturge-Weber syndrome
type: Class
subclass of: Hospital information, examination/diagnosis/treatment data
comment: 1 MD00494 2 Sturge-Weber syndrome 3 None 4 Sturge-Weber syndrome 5 19886006 6 Sturge-Weber syndrome 7 Sturge-Weber syndrome (disorder) 8 Sturge-Weber syndrome 9 C0038505

Sub-Item
type: Class
subclass of: Units
comment: 1 MD04145 2 Sub-Item 3 None 4 Sub-Item 5 351726001 6 Sub- 7 Below (qualifier value) 8 Inferior 9 C0542339

Subacute
type: Class
subclass of: Hospital information, examination/diagnosis/treatment data
comment: 1 MD00480 2 Subacute 3 None 4 Subacute 5 19939008 6 Subacute 7 Subacute (qualifier value) 8 Subacute 9 C0205365

Subareolar Region
type: Class
subclass of: Urogenital function (Body region)
comment: 1 M01002 2 Subareolar Region 3 None 4 Subareolar Region 5 245525003 6 Subareolar region 7 Structure of subareolar region (body structure) 8 Subareolar region 9 C0447661

Subclavicular region
type: Class
subclass of: Musculoskeletal function (Body region)
comment: 1 M01725 2 Subclavicular region 3 None 4 Subclavicular region 5 20253009 6 Subclavicular region 7 Infraclavicular region structure (body structure) 8 Subclavicular region 9 C0230108

Substance-induced sleep disorder
type: Class
subclass of: Activities of disability
comment: 1 M00055 2 Substance-induced sleep disorder 3 None 4 Substance-induced sleep disorder 5 363314000 6 Substance-induced sleep disorder 7 Substance-induced sleep disorder (disorder) 8 Substance-induced sleep disorder 9 C1285445

Sucking
type: Class
subclass of: Health Related Factors
comment: 1 M00234 2 Sucking 3 sucked, suck 4 Sucking 5 90485000 6 Sucking 7 Sucking (observable entity) 8 Sucking 9 C0233927

Sucking exercises
type: Class
subclass of: Active exercise
comment: 1 M00275 2 Sucking exercises 3 None 4 Sucking exercises 5 229126009 6 Sucking exercises 7 Sucking exercises (regime/therapy) 8 Sucking exercises 9 C0454336

Suddenly
type: Class
subclass of: Frequency
comment: 1 MD02233 2 Suddenly 3 None 4 Suddenly 5 255363002 6 Sudden 7 Sudden (qualifier value) 8 Sudden (qualifier value) 9 C5201090

Sufficient Quantity
type: Class
subclass of: Units
comment: 1 M05242 2 Sufficient Quantity 3 None 4 Sufficient Quantity 5 767525000 6 unit 7 Unit (qualifier value) 8 Unit 9 C0439178

Summary
type: Class
subclass of: Units
comment: 1 MD02352 2 Summary 3 summaries 4 Summary 5 406550009 6 Summary of needs 7 Summary of needs (record artifact) 8 Summary of needs 9 C1320309
alternative label: summaries

Summary of results
type: Class
subclass of: Device
comment: 1 MD05219 2 Summary of results 3 None 4 Summary of results 5 371534008 6 Summary report 7 Summary report (record artifact) 8 Summary (document) 9 C1706244

Super-satisfaction
type: Class
subclass of: Questionnaire
comment: 1 MD04577 2 Super-satisfaction 3 None 4 Super-satisfaction 5 405153007 6 Personal satisfaction 7 Personal wellbeing status (observable entity) 8 satisfaction 9 C0242428

Superalimentation
type: Class
subclass of: Functions of Blood System, Metabolic system and Endocrine system (Therapy)
comment: 1 M01281 2 Superalimentation 3 None 4 Superalimentation 5 225372007 6 Superalimentation 7 Total parenteral nutrition (regime/therapy) 8 Superalimentation 9 C0030548

Superior member
type: Class
subclass of: Musculoskeletal function (Body region)
comment: 1 M02429 2 Superior member 3 None 4 Superior member 5 53120007 6 Upper extremity 7 Upper limb structure (body structure) 8 Upper Extremity 9 C1140618

Supportive functions of arm or leg
type: Class
subclass of: Musculoskeletal function (Body measurement)
comment: 1 MD06081 2 Supportive functions of arm or leg 3 None 4 Supportive functions of arm or leg 5 364807002 6 Control of movement - finding 7 Finding of control of movement (finding) 8 Supportive functions of arm or leg 9 C2371251

Suppository
type: Class
subclass of: Units
comment: 1 M03616 2 Suppository 3 Suppositories 4 Suppository 5 385194003 6 Suppository 7 Suppository (basic dose form) 8 Suppository 9 C0038854
comment: 1 M03616-1 2 Suppository 3 Suppositories 4 Suppository 5 385194003 6 Suppository 7 Suppository (basic dose form) 8 Suppository Dosing Unit 9 C1704744
comment: 1 M03616-10 2 Suppository 3 Suppositories 4 Suppository 5 733019001 6 Suppository 7 Suppository (unit of presentation) 8 Suppository Dosing Unit 9 C1704744
comment: 1 M03616-11 2 Suppository 3 Suppositories 4 Suppository 5 733019001 6 Suppository 7 Suppository (unit of presentation) 8 Suppository (unit of presentation) 9 C4319669
comment: 1 M03616-2 2 Suppository 3 Suppositories 4 Suppository 5 385194003 6 Suppository 7 Suppository (basic dose form) 8 Suppository (unit of presentation) 9 C4319669
comment: 1 M03616-3 2 Suppository 3 Suppositories 4 Suppository 5 430293001 6 Suppository - unit of product usage 7 Suppository - unit of product usage (qualifier value) 8 Suppository 9 C0038854
comment: 1 M03616-4 2 Suppository 3 Suppositories 4 Suppository 5 430293001 6 Suppository - unit of product usage 7 Suppository - unit of product usage (qualifier value) 8 Suppository Dosing Unit 9 C1704744
comment: 1 M03616-5 2 Suppository 3 Suppositories 4 Suppository 5 430293001 6 Suppository - unit of product usage 7 Suppository - unit of product usage (qualifier value) 8 Suppository (unit of presentation) 9 C4319669
comment: 1 M03616-6 2 Suppository 3 Suppositories 4 Suppository 5 430293001 6 Suppository 7 Suppository (physical object) 8 Suppository 9 C0038854
comment: 1 M03616-7 2 Suppository 3 Suppositories 4 Suppository 5 706493001 6 Suppository 7 Suppository (physical object) 8 Suppository Dosing Unit 9 C1704744
comment: 1 M03616-8 2 Suppository 3 Suppositories 4 Suppository 5 706493001 6 Suppository 7 Suppository (physical object) 8 Suppository (unit of presentation) 9 C4319669
comment: 1 M03616-9 2 Suppository 3 Suppositories 4 Suppository 5 733019001 6 Suppository 7 Suppository (unit of presentation) 8 Suppository 9 C0038854
alternative label: Suppositories

SuppositoryDrugForm
type: Class
subclass of: Units
comment: 1 M03613 2 SuppositoryDrugForm 3 None 4 SuppositoryDrugForm 5 385194003 6 Suppository 7 Suppository - unit of product usage (qualifier value) 8 Suppository 9 C0439148

Suppository dose form
type: Class
subclass of: Units
comment: 1 M03614 2 Suppository dose form 3 Suppository Dosage Form 4 Suppository dose form 5 385194004 6 Suppository 7 Suppository (basic dose form) 8 Suppository 9 C0439148
alternative label: Suppository Dosage Form

Suralimentation
type: Class
subclass of: Functions of Blood System, Metabolic system and Endocrine system (Therapy)
comment: 1 M01282 2 Suralimentation 3 None 4 Suralimentation 5 225372007 6 Suralimentation 7 Total parenteral nutrition (regime/therapy) 8 Suralimentation 9 C0030548

Surfing
type: Class
subclass of: Sport
comment: 1 M00441 2 Surfing 3 surf 4 Surfing 5 84096006 6 Surfing 7 Surfing (qualifier value) 8 Surfing 9 C0336932
alternative label: surf

Surgical History
type: Class
subclass of: Hospital information, examination/diagnosis/treatment data
comment: 1 MD03071 2 Surgical History 3 Passed Surgical History 4 Surgical History 5 161615003 6 History of surgery 7 History of surgery (situation) 8 H/O: surgery 9 C0455610
alternative label: Passed Surgical History

Survey
type: Class
subclass of: Tool
comment: 1 MD04761 2 Survey 3 None 4 Survey 5 844005 6 Behavior finding 7 Behavior finding (finding) 8 Behavior 9 C0004927

Sustained fever
type: Class
subclass of: Sensory function, Pain and Skin function (Symptom)
comment: 1 M02306 2 Sustained fever 3 None 4 Sustained fever 5 271751000 6 Sustained fever 7 Continuous fever (finding) 8 Continuous fever 9 C0424767

Sustaining a conversation
type: Class
subclass of: Health Related Factors
comment: 1 MD06254 2 Sustaining a conversation 3 None 4 Sustaining a conversation 5 288666009 6 Maintains conversation 7 Does maintain conversation (finding) 8 Sustaining a conversation 9 C2371358

Sustaining attention
type: Class
subclass of: Nervous system and Mental function (Body measurement)
comment: 1 MD05647 2 Sustaining attention 3 None 4 Sustaining attention 5 311518007 6 Sustained attention 7 Sustained attention, function (observable entity) 8 Sustaining attention 9 C0589099

Swallowing exercises
type: Class
subclass of: Active exercise
comment: 1 M00276 2 Swallowing exercises 3 exercises swallowing, exercise swallowing, swallow exercise 4 Swallowing exercises 5 311679000 6 Swallowing exercises 7 Swallowing exercises (regime/therapy) 8 Swallowing exercises 9 C0589276
alternative label: swallow exercise
alternative label: exercises swallowing
alternative label: exercise swallowing

Swallowing impairment
type: Class
subclass of: Digestive function (Symptom)
subclass of: Hospital information, examination/diagnosis/treatment data
comment: Clinical+Disability Hospital information, examination/diagnosis/treatment data None 1 M00518 2 Swallowing impairment 3 Impaired swallowing SWALLOWING IMPAIRED Swallowing problems 4 Swallowing impairment 5 399122003 6 Swallowing problem 7 Swallowing problem (finding) 8 Swallowing problem 9 C0392678
comment: Symptom Digestive function None 1 M02183 2 Swallowing impairment 3 Swallowing problem Impaired swallowing SWALLOWING IMPAIRED Swallowing problems 4 Swallowing impairment 5 399122003 6 Swallowing impairment 7 Swallowing problem (finding) 8 Swallowing impairment 9 C0392678
alternative label: Swallowing problems
alternative label: SWALLOWING IMPAIRED
alternative label: Impaired swallowing

Sweat glands
type: Class
subclass of: Sensory function, Pain and Skin function (Body region)
comment: 1 MD07113 2 Sweat glands 3 None 4 Sweat glands 5 10410005 6 Sweat gland 7 Sweat gland structure (body structure) 8 Sweat glands 9 C0038989

Sweating observable
type: Class
subclass of: Sensory function, Pain and Skin function (Symptom)
comment: 1 M01429 2 Sweating observable 3 None 4 Sweating observable 5 364538006 6 Sweating observable 7 Sweating observable (observable entity) 8 Sweating observable 9 C0038990

Sweating symptom
type: Class
subclass of: Sensory function, Pain and Skin function (Symptom)
comment: 1 M01430 2 Sweating symptom 3 Sweating, sweat, sweating symptoms, SWEATS 4 Sweating symptom 5 161857006 6 Sweating symptom 7 Sweating symptom (finding) 8 Sweating symptom 9 C0038990
alternative label: sweating symptoms
alternative label: Sweating
alternative label: sweat
alternative label: SWEATS

Swim
type: Class
subclass of: Sport
comment: 1 M00442 2 Swim 3 Swimming 4 Swim 5 20461001 6 Swimming 7 Swimming (qualifier value) 8 Swimming 9 C0039003
alternative label: Swimming

Swim Cadence
type: Class
subclass of: Units
comment: 1 MD02349 2 Swim Cadence 3 None 4 Swim Cadence 5 260698009 6 Method of cycling 7 Method of cycling (attribute) 8 cadence 9 C4716180

Switch Control Max speed
type: Class
subclass of: Units
comment: 1 MD01958 2 Switch Control Max speed 3 None 4 Switch Control Max speed 5 870597004 6 Speed 7 Distance per time (property) (qualifier value) 8 Speed (motion) 9 C0678536

Switch Control Mode
type: Class
subclass of: Units
comment: 1 MD01960 2 Switch Control Mode 3 None 4 Switch Control Mode 5 8420300 6 Has method 7 Has method (qualifier value) 8 Mode 9 C1513371

Swolf
type: Class
subclass of: Units
comment: 1 MD02346 2 Swolf 3 None 4 Swolf 5 278061009 6 scores 7 Scores (qualifier value) 8 score 9 C0449820

Symptom
type: Class
comment: 1 MD01512 2 Symptom 3 None 4 symptom 5 264931009 6 symptomatic 7 Symptomatic (qualifier value) 8 Symptoms 9 C1457887
comment: Clinical+Disability Hospital information, examination/diagnosis/treatment data None 1 M00470 2 Symptom 3 symptom Symptoms 4 Symptom 5 264931009 6 Symptomatic 7 Symptomatic (qualifier value) 8 Symptoms 9 C1457887
alternative label: general manifestation of disorders

Symptoms interfere with sleep
type: Class
subclass of: Nervous system and Mental function (Symptom)
comment: 1 M00067 2 Symptoms interfere with sleep 3 None 4 Symptoms interfere with sleep 5 248259004 6 Symptoms interfere with sleep 7 Symptoms interfere with sleep (disorder) 8 Symptoms interfere with sleep 9 C0424570

Syncope
type: Class
subclass of: Nervous system and Mental function (Symptom)
comment: 1 M01476 2 Syncope 3 Syncope attack, Syncope symptom, Syncopes 4 Syncope 5 271594007 6 Syncope 7 Syncope (finding) 8 Syncope 9 C0039070
alternative label: Syncope attack
alternative label: Syncopes
alternative label: Syncope symptom

Syncope and collapse
type: Class
subclass of: Nervous system and Mental function (Symptom)
comment: 1 M01477 2 Syncope and collapse 3 None 4 Syncope and collapse 5 309585006 6 Syncope and collapse 7 Syncope and collapse (finding) 8 Syncope and collapse 9 C0039070
alternative label: syncope collapse

Syringe
type: Class
subclass of: Device
comment: 1 M03470 2 Syringe 3 Syringe Dosing Unit, SYR 4 Syringe 5 61968008 6 Syringe 7 Syringe, device (physical object) 8 Syringes 9 C0039142
comment: 1 M03470-1 2 Syringe 3 Syringe Dosing Unit, SYR 4 Syringe 5 61968008 6 Syringe 7 Syringe, device (physical object) 8 Syringe (unit of presentation) 9 C4319671
comment: 1 M03470-2 2 Syringe 3 Syringe Dosing Unit, SYR 4 Syringe 5 733020007 6 Syringe 7 Syringe (unit of presentation) 8 Syringes 9 C0039142
comment: 1 M03470-3 2 Syringe 3 Syringe Dosing Unit, SYR 4 Syringe 5 733020007 6 Syringe 7 Syringe (unit of presentation) 8 Syringe (unit of presentation) 9 C4319671
alternative label: Syringe Dosing Unit
alternative label: SYR

Syringomyelia
type: Class
subclass of: Nervous system and Mental function (Symptom)
comment: 1 MD00422 2 Syringomyelia 3 None 4 Syringomyelia 5 111496009 6 Syringomyelia 7 Syringomyelia (disorder) 8 Syringomyelia 9 C0039144

Systemic
type: Class
subclass of: Musculoskeletal function (Body region)
comment: 1 MD00347 2 Systemic 3 None 4 Systemic 5 31099001 6 Systemic 7 Systemic (qualifier value) 8 Systemic 9 C0205373

Systemic arterial hypertension
type: Class
subclass of: Cardiovascular system function (Symptom)
comment: 1 M01146 2 Systemic arterial hypertension 3 arterial hypertension systemic 4 Systemic arterial hypertension 5 38341003 6 Systemic arterial hypertension 7 Hypertensive disorder, systemic arterial (disorder) 8 Hypertensive disease 9 C0020538
alternative label: arterial hypertension systemic

Systemic arterial pressure
type: Class
subclass of: Cardiovascular system function (Body measurement)
comment: 1 M02790 2 Systemic arterial pressure 3 SAP - Systemic arterial pressure 4 Systemic arterial pressure 5 364090009 6 Systemic arterial pressure 7 Systemic arterial pressure (observable entity) 8 Systemic arterial pressure 9 C1272641
alternative label: SAP - Systemic arterial pressure

Systemic blood pressure
type: Class
subclass of: Cardiovascular system function (Body measurement)
comment: 1 M02791 2 Systemic blood pressure 3 SBP - Systemic blood pressure 4 Systemic blood pressure 5 386536003 6 Systemic blood pressure 7 Systemic blood pressure (observable entity) 8 Systemic arterial pressure 9 C1272641
alternative label: SBP - Systemic blood pressure

Systemic connective tissue disorder
type: Class
subclass of: Body functions of disability
comment: 1 MD00051 2 Systemic connective tissue disorder 3 None 4 Systemic connective tissue disorder 5 105969002 6 Disorder of connective tissue 7 Disorder of connective tissue (disorder) 8 Systemic involvement of connective tissue, unspecified 9 C0477583

Systemic hypertension
type: Class
subclass of: Cardiovascular system function (Symptom)
comment: 1 M01147 2 Systemic hypertension 3 None 4 Systemic hypertension 5 38341003 6 Systemic arterial hypertension 7 Hypertensive disorder, systemic arterial (disorder) 8 Hypertensive disease 9 C0020538

Systems for the production of consumer goods
type: Class
subclass of: Public Policy Factors
comment: 1 MD06712 2 Systems for the production of consumer goods 3 None 4 Systems for the production of consumer goods 5 246333005 6 system 7 System (attribute) 8 Systems for the production of consumer goods 9 C2371744

Systolic pressure
type: Class
subclass of: Musculoskeletal function (Body measurement)
comment: 1 MD00894 2 Systolic pressure 3 None 4 Systolic pressure 5 271649006 6 Systolic blood pressure 7 Systolic blood pressure (observable entity) 8 Systolic pressure 9 C0871470

T-shirt
type: Class
subclass of: Questionnaire
comment: 1 MD05402 2 T-shirt 3 None 4 T-shirt 5 228196009 6 T shirt 7 T shirt (physical object) 8 T shirt 9 C0453919

T11 part of esophagus
type: Class
subclass of: Digestive function (Body region)
comment: 1 M01152 2 T11 part of esophagus 3 T11 segment of esophagus 4 T11 part of esophagus 5 32849002 6 Esophagus 7 Esophageal structure (body structure) 8 Esophagus 9 C0014876
alternative label: T11 segment of esophagus

T12
type: Class
subclass of: Musculoskeletal function (Body region)
comment: 1 MD04843 2 T12 3 None 4 T12 5 23215003 6 Bone structure of T12 7 Bone structure of T12 (body structure) 8 Bone structure of T12 9 C0459957

TRICEPS
type: Class
subclass of: Musculoskeletal function (Body region)
comment: 1 MD02002 2 TRICEPS 3 None 4 TRICEPS 5 40284004 6 Triceps muscle structure 7 Triceps brachii muscle structure (body structure) 8 Triceps 9 C3146295

TWIST
type: Class
subclass of: Aerobic Exercise
comment: 1 MD02014 2 TWIST 3 None 4 TWIST 5 51795009 6 Twisting 7 Musculoskeletal torsion (observable entity) 8 Musculoskeletal torsion, function 9 C0040480

Table tennis
type: Class
subclass of: Sport
comment: 1 M00443 2 Table tennis 3 None 4 Table tennis 5 26550000 6 Tennis 7 Tennis (qualifier value) 8 Tennis (activity) 9 C0039515

Tablespoon Dosing Unit
type: Class
subclass of: Units
comment: 1 M04886 2 Tablespoon Dosing Unit 3 Tablespoonful Tablespoon Unit Tablespoonful - unit of product usage Tbsp Tblsp Tablespoon (HealthVault) tablespoons 4 Tablespoon Dosing Unit 5 415702004 6 Tablespoon - unit of product usage 7 Tablespoonful - unit of product usage (qualifier value) 8 Tablespoon - unit of product usage 9 C1532186
alternative label: Tablespoon - unit of product usage
alternative label: Tbsp
alternative label: Tablespoonful
alternative label: Tablespoonful - unit of product usage
alternative label: (HealthVault) tablespoons
alternative label: Tblsp
alternative label: Tablespoon

Tablet Dosing Unit
type: Class
subclass of: Units
comment: 1 M05275 2 Tablet Dosing Unit 3 Tablet - unit of product usage tab tablet 4 Tablet Dosing Unit 5 428673006 6 Tablet 7 Tablet - unit of product usage (qualifier value) 8 Tablet dosing unit 9 C1705223
alternative label: Tablet - unit of product usage
alternative label: tab

Tachycardia
type: Class
subclass of: Cardiovascular system function (Symptom)
comment: 1 M00179 2 Tachycardia 3 Tachycardias, Tachycardia - pulse 4 Tachycardia 5 3424008 6 Tachycardia 7 Tachycardia (finding) 8 Tachycardia 9 C0039231
alternative label: Tachycardia - pulse
alternative label: Tachycardias

Tachypnea
type: Class
subclass of: Respiratory function (Symptom)
comment: 1 M01867 2 Tachypnea 3 Tachypneas Tachypneic Tachypnoeic Tachypnoea 4 Tachypnea 5 271823003 6 Tachypnea 7 Tachypnea (finding) 8 Tachypnea 9 C0231835
alternative label: Tachypnoea
alternative label: Tachypneas
alternative label: Tachypneic
alternative label: Tachypnoeic

Tactile perception
type: Class
subclass of: Nervous system and Mental function (Body measurement)
comment: 1 MD05676 2 Tactile perception 3 None 4 Tactile perception 5 785767004 6 Tactile perception 7 Touch perception (observable entity) 8 Tactile perception 9 C2350522

Tai chi
type: Class
subclass of: Sport
comment: 1 M00444 2 Tai chi 3 T'ai chi ch'uan, Taijiquan, Tai chi chuan 4 Tai chi 5 30900002 6 Tai-chi 7 Tai-chi (qualifier value) 8 Tai chi for older people 9 C3824821
comment: 1 M00444-1 2 Tai chi 3 T'ai chi ch'uan, Taijiquan, Tai chi chuan 4 tai chi 5 30900002 6 Tai-chi 7 Tai-chi (qualifier value) 8 Sports 9 C0038039
alternative label: T'ai chi ch'uan
alternative label: Tai chi chuan
alternative label: Taijiquan

Take out
type: Class
subclass of: Health Related Factors
comment: 1 MD04528 2 Take out 3 None 4 Take out 5 844005 6 Behavior finding 7 Behavior finding (finding) 8 Behavior 9 C0004927

Take things out of the refrigerator and move them
type: Class
subclass of: Health Related Factors
comment: 1 MD04533 2 Take things out of the refrigerator and move them 3 None 4 Take things out of the refrigerator and move them 5 302000008 6 move 7 Does move (finding) 8 Does move 9 C0578671

Take your medicine
type: Class
subclass of: Questionnaire
comment: 1 MD05269 2 Take your medicine 3 None 4 Take your medicine 5 715035002 6 Does take medication 7 Does take medication (finding) 8 Does take medication 9 C4074970

Taking care of animals
type: Class
subclass of: Health Related Factors
comment: 1 MD06445 2 Taking care of animals 3 None 4 Taking care of animals 5 387961004 6 Animals 7 Kingdom Animalia (organism) 8 Taking care of animals 9 C2371515

Taking care of others or pets
type: Class
subclass of: Health Related Factors
comment: 1 MD05411 2 Taking care of others or pets 3 None 4 Taking care of others or pets 5 844005 6 Behavior finding 7 Behavior finding (finding) 8 Behavior 9 C0004927

Taking care of walkways and driveways
type: Class
subclass of: Health Related Factors
comment: 1 MD06446 2 Taking care of walkways and driveways 3 None 4 Taking care of walkways and driveways 5 1179229002 6 Caring environment 7 Caring environment (finding) 8 Caring environment 9 C0557735

Taking medicine alone
type: Class
subclass of: Health Related Factors
comment: 1 MD05443 2 Taking medicine alone 3 None 4 Taking medicine alone 5 129019007 6 Taking medication 7 Taking medication (observable entity) 8 Taking medication (activity) 9 C1290952

Taking off clothes
type: Class
subclass of: Health Related Factors
comment: 1 MD06395 2 Taking off clothes 3 None 4 Taking off clothes 5 272180002 6 Clothes 7 Garment (physical object) 8 Taking off clothes 9 C1998905

Taking off footwear
type: Class
subclass of: Health Related Factors
comment: 1 MD06397 2 Taking off footwear 3 None 4 Taking off footwear 5 88063004 6 Footwear 7 Footwear (physical object) 8 Taking off footwear 9 C2584319

Taking the elevator
type: Class
subclass of: Health Related Factors
comment: 1 MD05473 2 Taking the elevator 3 None 4 Taking the elevator 5 419652001 6 Take 7 Take - dosing instruction imperative (qualifier value) 8 Behavior 9 C0004927

Taking your wallet out of your back pocket
type: Class
subclass of: Health Related Factors
comment: 1 MD04525 2 Taking your wallet out of your back pocket 3 None 4 Taking your wallet out of your back pocket 5 844005 6 Behavior finding 7 Behavior finding (finding) 8 Behavior 9 C0004927

Talking about recent events
type: Class
subclass of: Questionnaire
comment: 1 MD05320 2 Talking about recent events 3 None 4 Talking about recent events 5 273389003 6 Daily activities questionnaire 7 Daily activities questionnaire (assessment scale) 8 Daily activities questionnaire 9 C0451094

Tampon Dosing Unit
type: Class
subclass of: Units
comment: 1 M05253 2 Tampon Dosing Unit 3 Tampon TAMP 4 Tampon Dosing Unit 5 733022004 6 Tampon 7 Tampon (unit of presentation) 8 Tampon (unit of presentation) 9 C4319692
alternative label: TAMP
alternative label: Tampon

Tangible assets
type: Class
subclass of: Characteristics of the individual
comment: 1 MD06630 2 Tangible assets 3 None 4 Tangible assets 5 118598001 6 Property 7 Property (qualifier value) 8 Tangible assets 9 C2371680

Taste function
type: Class
subclass of: Sensory function, Pain and Skin function (Body measurement)
comment: 1 MD05781 2 Taste function 3 Tasting 4 Taste function 5 397627001 6 taste, function 7 Taste, function (observable entity) 8 Taste function 9 C0039336
alternative label: Tasting

Tear secretion
type: Class
subclass of: Health Related Factors
comment: 1 M00230 2 Tear secretion 3 None 4 Tear secretion 5 40431001 6 Tears 7 Tears (substance) 8 tear secretion 9 C2610724

Teaspoon Dosing Unit
type: Class
subclass of: Units
comment: 1 M05258 2 Teaspoon Dosing Unit 3 Teaspoon Unit Teaspoonful Teaspoon tsp 4 Teaspoon Dosing Unit 5 415703001 6 Teaspoon 7 Teaspoonful - unit of product usage (qualifier value) 8 Teaspoon 9 C1533179
alternative label: Teaspoon Unit
alternative label: Teaspoon
alternative label: Teaspoonful
alternative label: tsp

Teeth grinding at night
type: Class
subclass of: Sensory function, Pain and Skin function (Symptom)
comment: 1 M02200 2 Teeth grinding at night 3 None 4 Teeth grinding at night 5 274950005 6 Teeth grinding at night 7 Sleep related bruxism (disorder) 8 Teeth grinding at night 9 C0393774

Teeth grinding while asleep
type: Class
subclass of: Sensory function, Pain and Skin function (Symptom)
comment: 1 M02199 2 Teeth grinding while asleep 3 None 4 Teeth grinding while asleep 5 274950005 6 Teeth grinding while asleep 7 Sleep related bruxism (disorder) 8 Teeth grinding while asleep 9 C0393774
alternative label: Teeth grinding whilst asleep

Teetotaller
type: Class
subclass of: Classification of Patient
comment: 1 M02475 2 Teetotaller 3 None 4 Teetotaller 5 105542008 6 Teetotaller 7 Current non-drinker of alcohol (finding) 8 Current non-drinker of alcohol 9 C0457801

Temperament and personality functions
type: Class
subclass of: Nervous system and Mental function (Body measurement)
comment: 1 MD05618 2 Temperament and personality functions 3 None 4 Temperament and personality functions 5 71565002 6 Personality, function 7 Personality, function (observable entity) 8 Temperament and personality functions 9 C2370866

Temperature
type: Class
subclass of: Physical/Chemical Environment
comment: 1 MD03182 2 Temperature 3 Has a temperature, temp 4 Temperature 5 246508008 6 Temperature 7 Temperature (attribute) 8 Temperature 9 C0005903
comment: 1 MD03182-1 2 Temperature 3 Has a temperature, temp 4 Temperature 5 246508008 6 Temperature 7 Temperature (attribute) 8 Temperature 9 C0039476
comment: 1 MD03182-2 2 Temperature 3 Has a temperature, temp 4 Temperature 5 703421000 6 Temperature 7 Temperature (observable entity) 8 Temperature 9 C0005903
comment: 1 MD03182-3 2 Temperature 3 Has a temperature, temp 4 Temperature 5 703421000 6 Temperature 7 Temperature (observable entity) 8 Temperature 9 C0039476
comment: 1 MD03182-4 2 Temperature 3 Has a temperature, temp 4 Temperature 5 722490005 6 Temperature 7 Temperature (property) (qualifier value) 8 Temperature 9 C0005903
comment: 1 MD03182-5 2 Temperature 3 Has a temperature, temp 4 Temperature 5 722490005 6 Temperature 7 Temperature (property) (qualifier value) 8 Temperature 9 C0039476
alternative label: temp

Temperature normal
type: Class
subclass of: Sensory function, Pain and Skin function (Body measurement)
comment: 1 M01818 2 normal temperature 3 normal temperatures, normals temperature 4 Temperature normal 5 87273009 6 Temperature normal 7 Temperature normal (finding) 8 Temperature normal 9 C0231262

Temporary socket
type: Class
subclass of: Equipment
comment: 1 MD04430 2 Temporary socket 3 None 4 Temporary socket 5 9096001 6 Support, device 7 Support, device (physical object) 8 Support, device 9 C0183683

Tense
type: Class
subclass of: Nervous system and Mental function (Symptom)
comment: 1 M05839 2 Tense 3 Tense Feeling, Tension 4 Tense 5 263897001 6 Tense 7 Feeling tense (finding) 8 Tense 9 C0235108
alternative label: Tension
alternative label: Tense Feeling

Terminating a job
type: Class
subclass of: Individual Related Factors
comment: 1 MD06522 2 Terminating a job 3 None 4 Terminating a job 5 360239007 6 Termination - action 7 Termination - action (qualifier value) 8 Terminating a job 9 C2371585

Terminating relationships
type: Class
subclass of: Individual Related Factors
comment: 1 MD06473 2 Terminating relationships 3 None 4 Terminating relationships 5 272151006 6 Relationships 7 Relationships (qualifier value) 8 Terminating relationships 9 C2371543

Tesla
type: Class
subclass of: Units
comment: 1 M05092 2 Tesla 3 Tesla - unit 4 Tesla 5 767525000 6 unit 7 Unit (qualifier value) 8 Unit 9 C0439169
alternative label: Tesla - unit

Test
type: Class
subclass of: Questionnaire
comment: 1 MD04676 2 Test 3 None 4 Test 5 272393004 6 Tests 7 Tests (qualifier value) 8 Tests (qualifier value) 9 C0392366

Testes and scrotum
type: Class
subclass of: Urogenital function (Body region)
comment: 1 MD07000 2 Testes and scrotum 3 None 4 Testes and scrotum 5 42774007 6 Both testes 7 Both testes (body structure) 8 Testes and scrotum 9 C0545929
comment: 1 MD07000-1 2 Testes and scrotum 3 None 4 Testes and scrotum 5 20233005 6 Scrotum 7 Scrotal structure (body structure) 8 Testes and scrotum 9 C0545929

Tetanus
type: Class
subclass of: Hospital information, examination/diagnosis/treatment data
comment: 1 MD00976 2 Tetanus 3 None 4 Tetanus 5 76902006 6 Tetanus 7 Tetanus (disorder) 8 Tetanus 9 C0039614

Texting
type: Class
subclass of: Health Related Factors
comment: 1 MD05462 2 Texting 3 None 4 Texting 5 900000000000466004 6 Text 7 Text (foundation metadata concept) 8 Text Messaging 9 C3178908

The Special Interest Group in Amputee Medicine mobility grades
type: Class
subclass of: Questionnaire
comment: 1 MD04769 2 The Special Interest Group in Amputee Medicine mobility grades 3 None 4 The Special Interest Group in Amputee Medicine mobility grades 5 273249006 6 Assessment scales 7 Assessment scales (assessment scale) 8 Assessment scales 9 C0450973

The app
type: Class
subclass of: Tool
comment: 1 MD05453 2 The app 3 None 4 The app 5 410619003 6 Application 7 Application (procedure) 8 Application (Document) 9 C1947919

The low income working class
type: Class
subclass of: Hospital Administration
comment: 1 MD00585 2 The low income working class 3 None 4 The low income working class 5 224175008 6 Low personal income 7 Low personal income (finding) 8 Low personal income 9 C0557170

The most burdensome task on your return
type: Class
subclass of: Questionnaire
comment: 1 MD04949 2 The most burdensome task on your return 3 None 4 The most burdensome task on your return 5 246137000 6 equipment 7 Equipment (attribute) 8 equipment 9 C0014672

The patient cannot smoothly maintain abdominal contraction at 40 mmHg for 10 seconds and 3 times using biofeedback in the hook-ling position.
type: Class
subclass of: Questionnaire
comment: 1 MD04290 2 The patient cannot smoothly maintain abdominal contraction at 40 mmHg for 10 seconds and 3 times using biofeedback in the hook-ling position. 3 None 4 The patient cannot smoothly maintain abdominal contraction at 40 mmHg for 10 seconds and 3 times using biofeedback in the hook-ling position. 5 273389003 6 Daily activities questionnaire 7 Daily activities questionnaire (assessment scale) 8 Daily activities questionnaire 9 C0451094

Theme
type: Class
subclass of: Units
comment: 1 MD01966 2 Theme 3 None 4 Theme 5 767525000 6 Unit 7 Unit (qualifier value) 8 Subject - topic 9 C1706203

Therapeutic bath
type: Class
subclass of: Sensory function, Pain and Skin function (Therapy)
comment: 1 M01132 2 Therapeutic bath 3 None 4 Therapeutic bath 5 46903006 6 Therapeutic bath 7 Hydrotherapy (regime/therapy) 8 Hydrotherapy 9 C0020311

Therapy
type: Class
comment: 1 M00573 2 Therapy 3 None 4 Therapy 5 276239002 6 Therapy 7 Therapy (regime/therapy) 8 Therapy 9 C0087111

Thermoregulatory functions
type: Class
subclass of: Functions of Blood System, Metabolic system and Endocrine system (Body measurement)
comment: 1 MD05965 2 Thermoregulatory functions 3 None 4 Thermoregulatory functions 5 386726008 6 Thermoregulation, function 7 Thermoregulation, function (observable entity) 8 Thermoregulatory functions 9 C2371150

Thinking
type: Class
subclass of: Health Related Factors
comment: 1 MD06174 2 Thinking 3 Thought functions 4 Thinking 5 88952004 6 Thinking 7 Thinking, function (observable entity) 8 Thinking 9 C0039869

Thinning hair
type: Class
subclass of: Sensory function, Pain and Skin function (Symptom)
comment: 1 M00668 2 Thinning hair 3 Thinning of hair 4 Thinning hair 5 278040002 6 Thinning hair 7 Loss of hair (finding) 8 Thinning hair 9 C0002170
alternative label: Thinning of hair

Thoracic Esophagus
type: Class
subclass of: Digestive function (Body region)
comment: 1 M01052 2 Thoracic Esophagus 3 Thoracic oesophagus, Thoracic part of oesophagus, Thoracic esophagus structure, Thoracic oesophagus structure, Pars thoracica oesophageae 4 Thoracic Esophagus 5 59609004 6 Thoracic esophagus 7 Thoracic esophagus structure (body structure) 8 Thoracic esophagus 9 C0227188
alternative label: Thoracic part of oesophagus
alternative label: Thoracic part of esophagus
alternative label: Pars thoracica oesophageae
alternative label: Thoracic esophagus structure
alternative label: Thoracic oesophagus structure
alternative label: Thoracic oesophagus

Thoracic pain
type: Class
subclass of: Hospital information, examination/diagnosis/treatment data
comment: 1 M00799 2 Thoracic pain 3 thoracodynia thorax pain pain thoracic thoracalgia 4 Thoracic pain 5 29857009 6 Chest pain 7 Chest pain (finding) 8 Chest Pain 9 C0008031
alternative label: pain thoracic
alternative label: thoracalgia
alternative label: thoracodynia
alternative label: thorax pain

Thoracic structure
type: Class
subclass of: Respiratory function (Body region)
comment: 1M02225 2Thorax 3 thoracic region thoracics Thoraces Thorace chest region regions thoracic thoracic region area thoracic thoracic area 4 Thoracic structure 5 51185008 6 Thoracic structure 7 Thoracic structure (body structure) 8 Thoracic structure 9 C0817096
comment: 1M02225-1 2Thorax 3 thoracic region thoracics Thoraces Thorace chest region regions thoracic thoracic region area thoracic thoracic area 4 Thoracic structure 5 51185008 6 Thoracic structure 7 Thoracic structure (body structure) 8 Thoracic structure 9 C0817096
comment: 1M02225-2 2Thorax 3 thoracic region thoracics Thoraces Thorace chest region regions thoracic thoracic region area thoracic thoracic area 4 Thoracic structure 5 51185008 6 Thoracic structure 7 Thoracic structure (body structure) 8 Thoracic structure 9 C0817096

Thoracic vertebral column
type: Class
subclass of: Musculoskeletal function (Body region)
comment: 1 MD07085 2 Thoracic vertebral column 3 Thoracolumbar Region 4 Thoracic vertebral column 5 122495006 6 Thoracic vertebral column 7 Structure of thoracic vertebral column (body structure) 8 Thoracic vertebral column 9 C0581269

Thoracolumbar Region
type: Class
subclass of: Musculoskeletal function (Body region)
comment: 1 M01057 2 Thoracolumbar Region 3 None 4 Thoracolumbar Region 5 264232007 6 Thoracolumbar 7 Thoracolumbar (qualifier value) 8 Thoracolumbar Region 9 C2985204

Thorax
type: Class
subclass of: Musculoskeletal function (Body region)
comment: 1 M01063 2 Thorax 3 Thoracic structure, thoracic region, thoracics 4 Thorax 5 51185008 6 Thorax 7 Thoracic structure (body structure) 8 Thorax 9 C0817096
alternative label: Thorace
alternative label: thoracic area
alternative label: area thoracic
alternative label: Thoracic
alternative label: regions thoracic
alternative label: thoracics
alternative label: Thoraces
alternative label: chest region
alternative label: thoracic region

Thought functions
type: Class
subclass of: Nervous system and Mental function (Body measurement)
comment: 1 MD05680 2 Thought functions 3 Thinking 4 Thought functions 5 88952004 6 Thinking, function 7 Thinking, function (observable entity) 8 Thought functions 9 C0039869

Thousand Cells per Microliter
type: Class
subclass of: Units
comment: 1 M05808 2 Thousand Cells per Microliter 3 10^3 Cells/uL 10E3 cells/uL (HealthVault) thousand cell/microliter 4 Thousand Cells per Microliter 5 258774008 6 Microliter 7 Microliter (qualifier value) 8 Thousand Cells per Microliter 9 C1883312
alternative label: 10E3 cells/uL
alternative label: (HealthVault) thousand cell/microliter
alternative label: 10^3 Cells/uL

Thousand International Units
type: Class
subclass of: Units
comment: 1 M04274 2 Thousand International Units 3 None 4 Thousand International Units 5 258997004 6 international unit 7 international unit (qualifier value) 8 international unit 9 C0439453

Thousand per Cubic Millimeter
type: Class
subclass of: Units
comment: 1 M04390 2 Thousand per Cubic Millimeter 3 None 4 Thousand per Cubic Millimeter 5 767525000 6 Unit 7 Unit (qualifier value) 8 Unit 9 C0439148

Thousand per Deciliter
type: Class
subclass of: Units
comment: 1 M05646 2 Thousand per Deciliter 3 thous/dL Thousand/Deciliter 10^3/dL thous/dL 10E3/dL 4 Thousand per Deciliter 5 2011000175108 6 Thousand unit 7 Thousand unit (qualifier value) 8 Thousand per Deciliter 9 C2348779
alternative label: thous/dL
alternative label: 10E3/dL
alternative label: Thousand/Deciliter
alternative label: 10^3/dL

Thousand per Microliter
type: Class
subclass of: Units
comment: 1 M04389 2 Thousand per Microliter 3 thou/mcL Thousands/microlitre Thousands/microliter Thousands/mcL 4 Thousand per Microliter 5 420167005 6 Per microliter 7 Per microliter (qualifier value) 8 Million per Microliter 9 C0456614
alternative label: Thousands/mcL
alternative label: Thousands/microliter
alternative label: thou/mcL
alternative label: Thousands/microlitre

Thousand per Milliliter
type: Class
subclass of: Units
comment: 1 M05396 2 Thousand per Milliliter 3 10E3/mL 10^3/mL 10^3 per Milliliter 4 Thousand per Milliliter 5 767525000 6 unit 7 Unit (qualifier value) 8 Unit 9 C0439189
alternative label: 10E3/mL
alternative label: 10^3 per Milliliter
alternative label: 10^3/mL

Three-joint
type: Class
subclass of: Musculoskeletal function (Body region)
comment: 1 MD04267 2 Three-joint 3 None 4 Three-joint 5 39352004 6 Joint 7 Joint structure (body structure) 8 joints 9 C0022417

Three-joint range of motion
type: Class
subclass of: Musculoskeletal function (Body measurement)
comment: 1 MD04266 2 Three-joint range of motion 3 None 4 Three-joint range of motion 5 364564000 6 Range of motion 7 Range of joint movement (observable entity) 8 Range of Motion, Articular 9 C0080078

Throat discomfort
type: Class
subclass of: Respiratory function (Symptom)
comment: 1 M02015 2 Throat discomfort 3 None 4 Throat discomfort 5 162397003 6 Throat discomfort 7 Pain in throat (finding) 8 Throat discomfort 9 C0242429

Throat pain
type: Class
subclass of: Hospital information, examination/diagnosis/treatment data
comment: 1 M00548 2 Throat pain 3 PAIN THROAT Pain in throat (throat pain) 4 Throat pain 5 162397003 6 Throat pain 7 Pain in throat (finding) 8 Throat pain 9 C0242429

Thromboangiitis obliterans
type: Class
subclass of: Cardiovascular system function (Symptom)
comment: 1 MD00337 2 Thromboangiitis obliterans 3 Buerger disease 4 Thromboangiitis obliterans 5 52403007 6 Thromboangiitis obliterans 7 Thromboangiitis obliterans (disorder) 8 Thromboangiitis obliterans 9 C0040021
alternative label: Buerger disease

Throwing
type: Class
subclass of: Health Related Factors
comment: 1 MD06327 2 Throwing 3 None 4 Throwing 5 282667008 6 throw 7 Does throw (finding) 8 Throwing 9 C2584314

Thumb
type: Class
subclass of: Musculoskeletal function (Body region)
comment: 1 MD04024 2 Thumb 3 None 4 Thumb 5 76505004 6 Thumb 7 Thumb structure (body structure) 8 Thumb 9 C0040067

Thumb to Index Finger
type: Class
subclass of: Musculoskeletal function (Body measurement)
comment: 1 MD04133 2 Thumb to Index Finger 3 None 4 Thumb to Index Finger 5 276414009 6 Able to oppose thumb 7 Able to oppose thumb (finding) 8 Able to oppose thumb 9 C0455915
comment: 1 MD04638 2 Thumb to Index Finger 3 None 4 Thumb to Index Finger 5 364486001 6 Measure of hand 7 Measure of hand (observable entity) 8 Measure of hand 9 C1286192

Thumb to Little Finger
type: Class
subclass of: Musculoskeletal function (Body measurement)
comment: 1 MD04137 2 Thumb to Little Finger 3 None 4 Thumb to Little Finger 5 276414009 6 Able to oppose thumb 7 Able to oppose thumb (finding) 8 Able to oppose thumb 9 C0455915

Thumb to Middle Finger
type: Class
subclass of: Musculoskeletal function (Body measurement)
comment: 1 MD04134 2 Thumb to Middle Finger Finger 3 None 4 Thumb to Middle Finger 5 276414009 6 Able to oppose thumb 7 Able to oppose thumb (finding) 8 Able to oppose thumb 9 C0455915
comment: 1 MD04639 2 Thumb to Middle Finger 3 None 4 Thumb to Middle Finger 5 364486001 6 Measure of hand 7 Measure of hand (observable entity) 8 Measure of hand 9 C1286192

Thumb to Ring Finger
type: Class
subclass of: Musculoskeletal function (Body measurement)
comment: 1 MD04135 2 Thumb to Ring Finger 3 None 4 Thumb to Ring Finger 5 276414009 6 Able to oppose thumb 7 Able to oppose thumb (finding) 8 Able to oppose thumb 9 C0455915

Thursday
type: Class
subclass of: Day
comment: 1 MD01988 2 Thursday 3 None 4 Thursday 5 307149005 6 Thursday 7 Thursday (qualifier value) 8 Thursday 9 C0585028

TiLite
type: Class
subclass of: Equipment
comment: 1 MD01936 2 TiLite 3 None 4 TiLite 5 49062001 6 Device 7 Device (physical object) 8 Devices 9 C0699733

Tics and mannerisms
type: Class
subclass of: Musculoskeletal function (Body measurement)
comment: 1 MD06092 2 Tics and mannerisms 3 None 4 Tics and mannerisms 5 386783003 6 Tics 7 Tic (finding) 8 Tics and mannerisms 9 C2371254
comment: 1 MD06092-1 2 Tics and mannerisms 3 None 4 Tics and mannerisms 5 5090003 6 Mannerism 7 Mannerism (finding) 8 Tics and mannerisms 9 C2371254

Tidal volume amount of air in and out of each breath
type: Class
subclass of: Hospital information, examination/diagnosis/treatment data
comment: 1 MD03740 2 Tidal volume amount of air in and out of each breath 3 None 4 Tidal volume amount of air in and out of each breath 5 13621006 6 Tidal volume 7 Tidal volume (observable entity) 8 Tidal volume 9 C0040210

Time
type: Class
subclass of: Time patterns
comment: 1 MD02342 2 time 3 None 4 time 5 410669006 6 Time 7 Time (property) (qualifier value) 8 Time 9 C0040223
comment: 1 MD02342-1 2 time 3 None 4 time 5 410669006 6 Time 7 Time (property) (qualifier value) 8 Time 9 C3541383
comment: 1 MD02342-2 2 time 3 None 4 time 5 410670007 6 Time 7 Time (attribute) 8 Time 9 C0040223
comment: 1 MD02342-3 2 time 3 None 4 time 5 410670007 6 Time 7 Time (attribute) 8 Time 9 C3541383
comment: 1 MD02342-6 2 time 3 None 4 time 5 900000000000475002 6 Time 7 Time (foundation metadata concept) 8 Time 9 C0040223
comment: 1 MD02342-7 2 time3 None 4 time 5 900000000000475002 6 Time 7 Time (foundation metadata concept) 8 Time 9 C3541383

Time-related changes
type: Class
subclass of: Frequency
comment: 1 MD06665 2 Time-related changes 3 None 4 Time-related changes 5 263703002 6 Changed 7 Changed status (qualifier value) 8 Time-related changes 9 C2371702

Time Format
type: Class
subclass of: Time
comment: 1 MD01963 2 Time Format 3 None 4 Time Format 5 410669006 6 Time 7 Time (property) (qualifier value) 8 Time 9 C0040223

Time management
type: Class
subclass of: Nervous system and Mental function (Body measurement)
comment: 1 MD05690 2 Time management 3 None 4 Time management 5 285624007 6 manage time 7 Does manage time (finding) 8 Time management 9 C0206209

Timed 10-Meter Walk Test
type: Class
subclass of: Tool
comment: 1 MD04393 2 Timed 10-Meter Walk Test 3 None 4 Timed 10-Meter Walk Test 5 252480006 6 Simple walk test 7 Simple walk test (procedure) 8 Simple walk test 9 C0430517
comment: 1 MD04698 2 Timed 10-Meter Walk Test 3 None 4 Timed 10-Meter Walk Test 5 431527001 6 Timed 10 meter walk 7 Timed ten meter walk (procedure) 8 Timed 10 meter walk 9 C2315460

Timed Up and Go test
type: Class
subclass of: Tool
comment: 1 MD04385 2 Timed Up and Go test 3 None 4 Timed Up and Go test 5 404932006 6 Timed up and go 7 Timed up and go mobility test (procedure) 8 Timed up and go 9 C3161512

Tingling
type: Class
subclass of: Sensory function, Pain and Skin function (Symptom)
comment: 1 MD04868 2 Tingling 3 None 4 Tingling 5 62507009 6 Tingling 7 Pins and needles (finding) 8 Tingling 9 C2242996

Tip pinch
type: Class
subclass of: Health Related Factors
comment: 1 MD04107 2 Tip pinch 3 None 4 Tip pinch 5 251435008 6 Tip pinch 7 Tip pinch (observable entity) 8 Tip pinch 9 C0429273

Tired
type: Class
subclass of: Nervous system and Mental function (Symptom)
comment: 1 M05844 2 Tired 3 Tiredness 4 Tired 5 224960004 6 Tired 7 Tired (finding) 8 Tired 9 C0849970

Tired of vision
type: Class
subclass of: Sensory function, Pain and Skin function (Symptom)
comment: 1 MD05015 2 Tired of vision 3 None 4 Tired of vision 5 70323002 6 Tired eyes 7 Eye strain (finding) 8 Asthenopia 9 C0004095

Titer
type: Class
subclass of: Units
comment: 1 M03091 2 Titer 3 Titre 4 Titer 5 118590008 6 Titer 7 Dilution factor expressed as titer (property) (qualifier value) 8 Titer 9 C0475208
alternative label: Titre

To clean using a vacuum cleaner
type: Class
subclass of: Health Related Factors
comment: 1 MD05379 2 To clean using a vacuum cleaner 3 None 4 To clean using a vacuum cleaner 5 844005 6 Behavior finding 7 Behavior finding (finding) 8 Behavior 9 C0004927

Tobacco Dependence
type: Class
subclass of: Hospital information, examination/diagnosis/treatment data
comment: 1 M01503 2 Tobacco Dependence 3 Dependent smoker dependence tobacco Tobacco Dependences Tobacco dependence syndrome 4 Tobacco Dependence 5 89765005 6 Tobacco dependence 7 Tobacco dependence syndrome (disorder) 8 Tobacco dependence 9 C0040332
alternative label: dependence tobacco
alternative label: Dependent smoker
alternative label: Tobacco dependence syndrome
alternative label: Tobacco Dependences

Tobacco Smoking
type: Class
subclass of: Sub-Cultural Level
comment: 1 M02383 2 Tobacco Smoking 3 Tobacco smoking behavior, Tobacco smoking behavior - finding, Tobacco smoking behaviour, Tobacco smoking behaviour - finding, Tobacco Smokings, smoking tobacco 4 Tobacco Smoking 5 365981009 6 Finding of tobacco smoking behavior 7 Finding of tobacco smoking behavior (finding) 8 Tobacco smoking behavior 9 C0453996
alternative label: Tobacco smoking behaviour - finding
alternative label: Tobacco smoking behaviour
alternative label: Finding of tobacco smoking behavior
alternative label: smoking tobacco
alternative label: Tobacco smoking behavior
alternative label: Tobacco Smokings
alternative label: Tobacco smoking behavior - finding

Toe nails
type: Class
subclass of: Sensory function, Pain and Skin function (Body region)
comment: 1 MD07119 2 Toe nails 3 None 4 Toe nails 5 770805009 6 Nail unit of toe 7 Structure of nail unit of toe (body structure) 8 Toe nails 9 C0222007

Toilet
type: Class
subclass of: Physical/Chemical Environment
comment: 1 MD05180 2 Toilet 3 None 4 Toilet 5 53303003 6 Toilet 7 Toilet (procedure) 8 Toilet 9 C0184958

Toilet treatment
type: Class
subclass of: Health Related Factors
comment: 1 MD04553 2 Toilet treatment 3 None 4 Toilet treatment 5 284909007 6 Uses toilet 7 Does use toilet (finding) 8 Does use toilet 9 C0562819

Toileting
type: Class
subclass of: Health Related Factors
comment: 1 MD06387 2 Toileting 3 None 4 Toileting 5 129004006 6 Toileting 7 Toileting (observable entity) 8 Toileting 9 C0150810

Tolerance in relationships
type: Class
subclass of: Individual Related Factors
comment: 1 MD06464 2 Tolerance in relationships 3 None 4 Tolerance in relationships 5 272151006 6 Relationships 7 Relationships (qualifier value) 8 Tolerance in relationships 9 C2371535

Tolerance to food
type: Class
subclass of: Digestive function (Body measurement)
comment: 1 MD05928 2 Tolerance to food 3 None 4 Tolerance to food 5 71412006 6 tolerance 7 Tolerance, function (observable entity) 8 Tolerance to food 9 C2371126

Tone of all muscles of the body
type: Class
subclass of: Musculoskeletal function (Body measurement)
comment: 1 MD06060 2 Tone of all muscles of the body 3 None 4 Tone of all muscles of the body 5 366725004 6 Muscle tone - finding 7 Finding of muscle tone (finding) 8 Tone of all muscles of the body 9 C2371232

Tone of isolated muscles and muscle groups
type: Class
subclass of: Musculoskeletal function (Body measurement)
comment: 1 MD06054 2 Tone of isolated muscles and muscle groups 3 None 4 Tone of isolated muscles and muscle groups 5 366725004 6 Muscle tone - finding 7 Finding of muscle tone (finding) 8 Tone of isolated muscles and muscle groups 9 C2371226

Tone of muscles of all limbs
type: Class
subclass of: Musculoskeletal function (Body measurement)
comment: 1 MD06058 2 Tone of muscles of all limbs 3 None 4 Tone of muscles of all limbs 5 366725004 6 Muscle tone - finding 7 Finding of muscle tone (finding) 8 Tone of muscles of all limbs 9 C2371230

Tone of muscles of lower half of body
type: Class
subclass of: Musculoskeletal function (Body measurement)
comment: 1 MD06057 2 Tone of muscles of lower half of body 3 None 4 Tone of muscles of lower half of body 5 366725004 6 Muscle tone - finding 7 Finding of muscle tone (finding) 8 Tone of muscles of lower half of body 9 C2371229

Tone of muscles of one limb
type: Class
subclass of: Musculoskeletal function (Body measurement)
comment: 1 MD06055 2 Tone of muscles of one limb 3 None 4 Tone of muscles of one limb 5 366725004 6 Muscle tone - finding 7 Finding of muscle tone (finding) 8 Tone of muscles of one limb 9 C2371227

Tone of muscles of one side of body
type: Class
subclass of: Musculoskeletal function (Body measurement)
comment: 1 MD06056 2 Tone of muscles of one side of body 3 None 4 Tone of muscles of one side of body 5 366725004 6 Muscle tone - finding 7 Finding of muscle tone (finding) 8 Tone of muscles of one side of body 9 C2371228

Tone of muscles of trunk
type: Class
subclass of: Musculoskeletal function (Body measurement)
comment: 1 MD06059 2 Tone of muscles of trunk 3 None 4 Tone of muscles of trunk 5 366725004 6 Muscle tone - finding 7 Finding of muscle tone (finding) 8 Tone of muscles of trunk 9 C2371231

Tongue exercises
type: Class
subclass of: Active exercise
comment: 1 M00277 2 Tongue exercises 3 None 4 Tongue exercises 5 311708000 6 Tongue exercises 7 Tongue exercises (regime/therapy) 8 Tongue exercises 9 C0589305

Top End
type: Class
subclass of: Device
comment: 1 MD01937 2 Top End 3 None 4 Top End 5 49062001 6 Device 7 Device (physical object) 8 Devices 9 C0699733

Total Cholesterol
type: Class
subclass of: Functions of Blood System, Metabolic system and Endocrine system (Body measurement)
comment: 1 MD00929 2 Total Cholesterol 3 Tot.cholesterol 4 Total Cholesterol 5 412808005 6 Serum total cholesterol measurement 7 Serum total cholesterol measurement (procedure) 8 Cholesterol/Total 9 C4759664
comment: 1 MD00929-1 2 Total Cholesterol 3 Tot.cholesterol 4 Total cholesterol 5 121868005 6 Total cholesterol measurement 7 Total cholesterol measurement (procedure) 8 Total cholesterol 9 C0543421
alternative label: Tot.cholesterol

Total Medication date
type: Class
subclass of: Units
comment: 1 MD00907 2 Total Medication date 3 None 4 Total Medication date 5 413947000 6 Date treatment stopped 7 Date treatment stopped (observable entity) 8 Medication time and date 9 C3173975

Total Work
type: Class
subclass of: Units
comment: 1 MD03120 2 Total Work 3 None 4 Total Work 5 365605003 6 Body measurement finding 7 Body measurement finding (finding) 8 Body measurement finding 9 C1287249

Total parenteral nutrition
type: Class
subclass of: Nutrient intake
comment: 1 M00461 2 Total parenteral nutrition 3 TPN - Total parenteral nutrition, TPN procedure, Total parenteral nutrition administration 4 Total parenteral nutrition 5 225372007 6 Total parenteral nutrition 7 Total parenteral nutrition (regime/therapy) 8 Total parenteral nutrition 9 C0030548
alternative label: TPN procedure
alternative label: TPN - Total parenteral nutrition
alternative label: Total parenteral nutrition administration

Total period
type: Class
subclass of: Units
comment: 1 MD04924 2 Total period 3 None 4 Total period 5 248957007 6 Periods 7 Menstruation, function (observable entity) 8 Period (temporal qualifier) 9 C1948053

Total period of performance of similar work
type: Class
subclass of: Duration
comment: 1 MD04921 2 Total period of performance of similar work 3 None 4 Total period of performance of similar work 5 248957007 6 Periods 7 Menstruation, function (observable entity) 8 Period (temporal qualifier) 9 C1948053

Total weight handled per day
type: Class
subclass of: Questionnaire
comment: 1 MD04888 2 Total weight handled per day 3 None 4 Total weight handled per day 5 246137000 6 equipment 7 Equipment (attribute) 8 equipment 9 C0014672

Touch function
type: Class
subclass of: Sensory function, Pain and Skin function (Body measurement)
comment: 1 MD05784 2 Touch function 3 Touching 4 Touch function 5 397624008 6 Touch sensation, function 7 Touch sensation, function (observable entity) 8 Touch function 9 C2370957
alternative label: Touching

Trace Dosing Unit
type: Class
subclass of: Units
comment: 1 M05272 2 Trace Dosing Unit 3 None 4 Trace Dosing Unit 5 767525000 6 unit 7 Unit (qualifier value) 8 Unit 9 C0439178

Trachea
type: Class
subclass of: Respiratory function (Body region)
comment: 1 MD06942 2 Trachea 3 None 4 Trachea 5 44567001 6 Trachea 7 Tracheal structure (body structure) 8 Trachea 9 C0040578

Trainer Assessment
type: Class
subclass of: Hospital information, examination/diagnosis/treatment data
comment: 1 MD03266 2 Trainer Assessment 3 None 4 Trainer Assessment 5 129265001 6 Evlauation 7 Evaluation - action (qualifier value) 8 Evlauation 9 C0220825

Training Required Area
type: Class
subclass of: Questionnaire
comment: 1 MD05195 2 Training Required Area 3 None 4 Training Required Area 5 42798000 6 Area 7 Area (qualifier value) 8 Area 9 C0205146

Training Stress Score
type: Class
subclass of: Units
comment: 1 MD02331 2 Training Stress Score 3 None 4 Training Stress Score 5 278061009 6 scores 7 Scores (qualifier value) 8 score 9 C0449820

Training effect
type: Class
subclass of: Hospital information, examination/diagnosis/treatment data
comment: 1 MD01873 2 Training effect 3 None 4 Training effect 5 118629009 6 training 7 Functional training (procedure) 8 Training 9 C0220931

Training load
type: Class
subclass of: Aerobic Exercise
comment: 1 MD01879 2 Training load 3 None 4 Training load 5 118629009 6 Training 7 Functional training (procedure) 8 Training 9 C0220931

Traning Mode
type: Class
subclass of: Units
comment: 1 MD02643 2 Traning Mode 3 None 4 Traning Mode 5 118629009 6 training 7 Functional training (procedure) 8 Training 9 C0220931

Transferring oneself
type: Class
subclass of: Health Related Factors
comment: 1 MD06295 2 Transferring oneself 3 None 4 Transferring oneself 5 29005007 6 Transferring 7 Transferring (observable entity) 8 Transferring oneself 9 C2371389

Transferring oneself while lying
type: Class
subclass of: Health Related Factors
comment: 1 MD06297 2 Transferring oneself while lying 3 None 4 Transferring oneself while lying 5 29005007 6 Transferring 7 Transferring (observable entity) 8 Transferring oneself while lying 9 C2371391

Transferring oneself while sitting
type: Class
subclass of: Health Related Factors
comment: 1 MD06296 2 Transferring oneself while sitting 3 None 4 Transferring oneself while sitting 5 29005007 6 Transferring 7 Transferring (observable entity) 8 Transferring oneself while sitting 9 C2371390

Transient sleep-wake rhythm disorder
type: Class
subclass of: Activities of disability
comment: 1 M00056 2 Transient sleep-wake rhythm disorder 3 None 4 Transient sleep-wake rhythm disorder 5 230495008 6 Transient sleep-wake rhythm disorder 7 Transient sleep-wake rhythm disorder (disorder) 8 Transient sleep-wake rhythm disorder 9 C0393769

Transplant patients
type: Class
subclass of: Classification of Patient
comment: 1 MD00284 2 Transplant patients 3 None 4 Transplant patients 5 24486003 6 transplant 7 Structure of transplant (body structure) 8 Transplant 9 C3841811

Transport of food through stomach and intestines
type: Class
subclass of: Digestive function (Body measurement)
comment: 1 MD05925 2 Transport of food through stomach and intestines 3 None 4 Transport of food through stomach and intestines 5 386617003 6 digestive system finding 7 Digestive system finding (finding) 8 Transport of food through stomach and intestines 9 C2371124

Transportation of mucus
type: Class
subclass of: Respiratory function (Body measurement)
comment: 1 MD05892 2 Transportation of mucus 3 None 4 Transportation of mucus 5 49909006 6 Mucus 7 Mucus (substance) 8 Mucous body substance 9 C0026727

Transportation policies
type: Class
subclass of: Public Policy Factors
comment: 1 MD06749 2 Transportation policies 3 None 4 Transportation policies 5 276339004 6 environment 7 Environment (environment) 8 Transportation policies 9 C2371777

Transportation services
type: Class
subclass of: Public Policy Factors
comment: 1 MD06747 2 Transportation services 3 None 4 Transportation services 5 224930009 6 services 7 Services (qualifier value) 8 Transportation services 9 C2003850

Transportation systems
type: Class
subclass of: Public Policy Factors
comment: 1 MD06748 2 Transportation systems 3 None 4 Transportation systems 5 246333005 6 system 7 System (attribute) 8 Transportation systems 9 C2371776

Treatment items other than normal treatment
type: Class
subclass of: Hospital Administration
comment: 1 MD00195 2 Treatment items other than normal treatment 3 None 4 Treatment items other than normal treatment 5 7922000 6 General treatment 7 General treatment (procedure) 8 General treatment 9 C0199174

Treatment record
type: Class
subclass of: Hospital information, examination/diagnosis/treatment data
comment: 1 MD03051 2 Treatment record 3 None 4 Treatment record 5 722448004 6 Treatment plan report 7 Treatment plan report (record artifact) 8 Treatment plan report 9 C4302533

Tremor
type: Class
subclass of: Musculoskeletal function (Symptom)
comment: 1 MD06091 2 Tremor 3 None 4 Tremor 5 26079004 6 Tremor 7 Tremor (finding) 8 Tremor 9 C0040822

Triathlon
type: Class
subclass of: Sport
comment: 1 M00446 2 Triathlon 3 None 4 Triathlon 5 285080002 6 Athletics field 7 Athletics field (environment) 8 Athletics field 9 C0562986

Triglyceride
type: Class
subclass of: Functions of Blood System, Metabolic system and Endocrine system (Body measurement)
comment: 1 MD00028 2 Triglyceride 3 None 4 Triglyceride 5 14740000 6 Triglycerides measurement 7 Triglycerides measurement (procedure) 8 Triglycerides 9 C0041004
comment: 1 MD00028-1 2 Triglyceride 3 None 4 Triglyceride 5 85600001 6 Triglyceride 7 Triacylglycerol (substance) 8 Triglycerides 9 C0041004

Tripit
type: Class
subclass of: Units
comment: 1 M05771 2 Tripit 3 None 4 Tripit 5 413568008 6 Application - unit of product usage (qualifier value) 7 Application - unit of product usage (qualifier value) 8 Application dose 9 C1533134

Tripod Pinch
type: Class
subclass of: Health Related Factors
comment: 1 MD04105 2 Tripod Pinch 3 None 4 Tripod Pinch 5 242899004 6 Grip/pinch 7 Grasped with hand (event) 8 Grip/pinch 9 C0429270

Trivial cigarette smoker
type: Class
subclass of: Sub-Cultural Level
comment: 1 M00110 2 Trivial cigarette smoker 3 None 4 Trivial cigarette smoker 5 230059006 6 Trivial cigarette smoker 7 Occasional cigarette smoker (finding) 8 Light cigarette smoker 9 C0459845

Troche Dosing Unit
type: Class
subclass of: Units
comment: 1 M05278 2 Troche Dosing Unit 3 TRO Troche 4 Troche Dosing Unit 5 767525000 6 unit 7 Unit (qualifier value) 8 Unit 9 C0439178
alternative label: TRO
alternative label: Troche

Trunk Extension
type: Class
subclass of: Musculoskeletal function (Body measurement)
comment: 1 MD04281 2 Trunk Extension 3 None 4 Trunk Extension 5 255536004 6 Extension 7 Extension (qualifier value) 8 Extension 9 C0231448

Trunk Flexion
type: Class
subclass of: Musculoskeletal function (Body measurement)
comment: 1 MD04280 2 Trunk Flexion 3 None 4 Trunk Flexion 5 9964006 6 Flexion 7 Flexion, function (observable entity) 8 Flexion, function 9 C0231452

Trunk exercises
type: Class
subclass of: Limb
comment: 1 M00315 2 Trunk exercises 3 None 4 Trunk exercises 5 229142002 6 Trunk exercises 7 Trunk exercises (regime/therapy) 8 Trunk exercises 9 C0454352

Trunk exercises in water
type: Class
subclass of: Active exercise
comment: 1 M00324 2 Trunk exercises in water 3 None 4 Trunk exercises in water 5 229184005 6 Trunk exercises in water 7 Trunk exercises in water (regime/therapy) 8 Trunk exercises in water 9 C0454393

Trustworthiness
type: Class
subclass of: Nervous system and Mental function (Body measurement)
comment: 1 MD05626 2 Trustworthiness 3 None 4 Trustworthiness 5 711122003 6 Establishment of trust 7 Establishment of trust (procedure) 8 Trustworthiness 9 C2370864

Tube
type: Class
subclass of: Units
comment: 1 M05252 2 Tube 3 Tube - unit dose Tubes TB Tube Dosing Unit Tube - unit of product usage 4 Tube 5 83059008 6 Tube 7 Tube, device (physical object) 8 Tube 9 C0175730
comment: 1 M05252-1 2 Tube 3 Tube - unit dose Tubes TB Tube Dosing Unit Tube - unit of product usage 4 Tube 5 83059008 6 Tube 7Tube, device (physical object) 8 Tube 9 C1704474
comment: 1 M05252-2 2 Tube 3 Tube - unit dose Tubes TB Tube Dosing Unit Tube - unit of product usage 4 Tube 5 83059008 6 Tube 7 Tube, device (physical object) 8 Tube 9 C4318415
comment: 1 M05252-3 2 Tube 3 Tube - unit dose Tubes TB Tube Dosing Unit Tube - unit of product usage 4 Tube 5 418530008 6 Tube 7 Tube - unit of product usage (qualifier value) 8 Tube 9 C0175730
comment: 1 M05252-4 2 Tube 3 Tube - unit dose Tubes TB Tube Dosing Unit Tube - unit of product usage 4 Tube 5 418530008 6 Tube 7 Tube - unit of product usage (qualifier value) 8 Tube 9 C1704474
comment: 1 M05252-5 2 Tube 3 Tube - unit dose Tubes TB Tube Dosing Unit Tube - unit of product usage 4 Tube 5 418530008 6 Tube 7 Tube - unit of product usage (qualifier value) 8 Tube 9 C4318415
comment: 1 M05252-6 2 Tube 3 Tube - unit dose Tubes TB Tube Dosing Unit Tube - unit of product usage 4 Tube 5 733024003 6 Tube 7 Tube (unit of presentation) 8 Tube 9 C0175730
comment: 1 M05252-7 2 Tube 3 Tube - unit dose Tubes TB Tube Dosing Unit Tube - unit of product usage 4 Tube 5 733024003 6 Tube 7 Tube (unit of presentation) 8 Tube 9 C1704474
comment: 1 M05252-8 2 Tube 3 Tube - unit dose Tubes TB Tube Dosing Unit Tube - unit of product usage 4 Tube 5 733024003 6 Tube 7 Tube (unit of presentation) 8 Tube 9 C4318415
alternative label: Tube - unit of product usage
alternative label: Tubes
alternative label: Tube Dosing Unit
alternative label: TB
alternative label: Tube - unit dose

Tuberculin
type: Class
subclass of: Units
comment: 1 M04892 2 Tuberculin 3 None 4 Tuberculin 5 415758004 6 Tuberculin unit 7 Tuberculin unit (qualifier value) 8 Tuberculin unit 9 C1532465

Tuberculin Unit
type: Class
subclass of: Units
comment: 1 M04891 2 Tuberculin Unit uberculin units TU 4 Tuberculin Unit 5 415758003 6 Tuberculin unit 7 Tuberculin unit (qualifier value) 8 Tuberculin unit 9 C1532464
alternative label: TU
alternative label: Tuberculin units

Tuberculin Unit per Milliliter
type: Class
subclass of: Units
comment: 1 M05650 2 Tuberculin Unit per Milliliter 3 Tuberculin Unit/Milliliter Tuberculin Unit/mL 4 Tuberculin Unit per Milliliter 5 415758003 6 Tuberculin unit 7 Tuberculin unit (qualifier value) 8 Tuberculin Unit per Milliliter 9 C2348823
alternative label: Tuberculin Unit/Milliliter
alternative label: Tuberculin Unit/mL

Tuberculosis
type: Class
subclass of: Functions of Blood System, Metabolic system and Endocrine system (Symptom)
comment: Symptom Functions_of_Blood_System,_Metabolic_system_and_Endocrine_system_(Symptom) None 1 MD00475 2 Tuberculosis 3 None 4 Tuberculosis 5 56717001 6 Tuberculosis 7 Tuberculosis (disorder) 8 Tuberculosis 9 C0041296

Tuberculosis medicine
type: Class
subclass of: Classification of Hospital
comment: 1 MD00649 2 Tuberculosis medicine 3 None 4 Tuberculosis medicine 5 56717001 6 Tuberculosis 7 Tuberculosis (disorder) 8 Tuberculosis 9 C0041296

Tuberous sclerosis
type: Class
subclass of: Cardiovascular system function (Symptom)
comment: 1 MD00470 2 Tuberous sclerosis 3 Tuberous sclerosis 4 Tuberous sclerosis 5 7199000 6 Tuberous sclerosis 7 Tuberous sclerosis syndrome (disorder) 8 Tuberous sclerosis 9 C0041341

Tuesday
type: Class
subclass of: Day
comment: 1 MD01986 2 Tuesday 3 None 4 Tuesday 5 307147007 6 Tuesday 7 Tuesday (qualifier value) 8 Tuesday 9 C0585026

Turner syndrome
type: Class
subclass of: Hospital information, examination/diagnosis/treatment data
comment: 1 MD00267 2 Turner syndrome 3 None 4 Turner syndrome 5 38804009 6 Turner syndrome 7 Turner syndrome (disorder) 8 Turner Syndrome 9 C0041408

Turning Test
type: Class
subclass of: Tool
comment: 1 MD04180 2 Turning Test 3 None 4 Turning Test 5 272393004 6 Tests 7 Tests (qualifier value) 8 Tests (qualifier value) 9 C0392366

Turning or twisting the hands or arms
type: Class
subclass of: Health Related Factors
comment: 1 MD06326 2 Turning or twisting the hands or arms 3 None 4 Turning or twisting the hands or arms 5 85562004 6 Hand 7 Hand structure (body structure) 8 Turning or twisting the hands or arms 9 C2371414

Twitch
type: Class
subclass of: Musculoskeletal function (Symptom)
comment: 1 M01852 2 Twitch 3 twitches twitched Twitching 4 Twitch 5 60238002 6 Twitch 7 Muscle twitch (finding) 8 Twitch 9 C0231530
alternative label: twitches
alternative label: Twitching
alternative label: twitched

Twitter
type: Class
subclass of: Units
comment: 1 M05772 2 Twitter 3 None 4 Twitter 5 413568008 6 Application - unit of product usage (qualifier value) 7 Application - unit of product usage (qualifier value) 8 Application dose 9 C1533134

Two Point Discrimination
type: Class
subclass of: Questionnaire
comment: 1 MD04085 2 Two Point Discrimination 3 None 4 Two Point Discrimination 5 417482005 6 Two Point Discrimination test 7 Ophthalmic two point discrimination test (procedure) 8 Ophthalmic two point discrimination test 9 C1562559

Type of Disability
type: Class
subclass of: Hospital information, examination/diagnosis/treatment data
comment: 1 MD03044 2 Type of Disability 3 disability type Type of disease 4 Type of Disability 5 21134002 6 Disability (finding) 7 Disability (finding) 8 Disability:Type:Pt:^Patient:Nom 9 C5240435
alternative label: disability type

Type of assist device
type: Class
subclass of: Device
comment: 1 MD04371 2 Type of assist device 3 None 4 Type of assist device 5 410656007 6 Type 7 Type (property) (qualifier value) 8 Type 9 C0332307

Type of desired return
type: Class
subclass of: Questionnaire
comment: 1 MD04956 2 Type of desired return 3 None 4 Type of desired return 5 410656007 6 Type 7 Type (property) (qualifier value) 8 Type 9 C0332307

Type of employment
type: Class
subclass of: Questionnaire
comment: 1 MD04926 2 Type of employment 3 None 4 Type of employment 5 248957007 6 In employment 7 Menstruation, function (observable entity) 8 Employment 9 C0014003

Type of work
type: Class
subclass of: Questionnaire
comment: 1 MD04930 2 Type of work 3 None 4 Type of work 5 410656007 6 Type 7 Type (property) (qualifier value) 8 Type 9 C0332307

UP by Jawbone
type: Class
subclass of: Units
comment: 1 M05773 2 UP by Jawbone 3 None 4 UP by Jawbone 5 413568008 6 Application - unit of product usage (qualifier value) 7 Application - unit of product usage (qualifier value) 8 Application dose 9 C1533134

URINATION PAIN
type: Class
subclass of: Urogenital function (Symptom)
comment: 1 M00920 2 URINATION PAIN 3 Urination painful Painful urination PAINFUL URINATION 4 URINATION PAIN 5 49650001 6 Urination painful 7 Dysuria (finding) 8 Dysuria 9 C0013428
alternative label: Painful urination
alternative label: Urination painful
alternative label: PAINFUL URINATION

URINE RETENTION
type: Class
subclass of: Urogenital function (Symptom)
comment: 1 M01657 2 URINE RETENTION 3 Urinary Retention Retention of urine RETENTION URINARY 4 URINE RETENTION 5 1251594002 6 Urine retention 7 Urine retention (morphologic abnormality) 8 Urinary retention 9 C0080274
alternative label: Urinary Retention
alternative label: RETENTION URINARY

US Foot
type: Class
subclass of: Units
comment: 1 M05434 2 US Foot 3 None 4 US Foot 5 259051003 6 foot 7 Foot (qualifier value) 8 ft 9 C0347979

UV
type: Class
subclass of: Physical/Chemical Environment
comment: 1 M01523 2 UV 3 None 4 UV 5 41355003 6 Ultraviolet light 7 Ultraviolet radiation (physical force) 8 Ultraviolet Rays 9 C0041625

Ulcerative colitis
type: Class
subclass of: Digestive function (Symptom)
comment: 1 MD00341 2 Ulcerative colitis 3 None 4 Ulcerative colitis 5 64766004 6 Ulcerative colitis 7 Ulcerative colitis (disorder) 8 Ulcerative Colitis 9 C0009324

Ulnar
type: Class
subclass of: Musculoskeletal function (Body region)
comment: 1 MD04064 2 Ulnar 3 None 4 Ulnar 5 261182007 6 Ulnar 7 Ulnar (qualifier value) 8 Ulnar 9 C0442044

Ulnar deviation
type: Class
subclass of: Musculoskeletal function (Body measurement)
comment: 1 MD04017 2 Ulnar deviation 3 None 4 Ulnar deviation 5 264748007 6 Ulnar deviation 7 Ulnar deviation (qualifier value) 8 Ulnar deviation 9 C0449752

Ultraviolet Ray
type: Class
subclass of: Physical/Chemical Environment
comment: 1 M01519 2 Ultraviolet Ray 3 UV rays, ray uv, rays uv, Ultra Violet Rays, Ultra-Violet Ray, Ultraviolet Rays, Ultra-Violet Rays 4 Ultraviolet Ray 5 41355003 6 Ultraviolet light 7 Ultraviolet radiation (physical force) 8 Ultraviolet Rays 9 C0041625
alternative label: rays ultraviolet
alternative label: ray uv
alternative label: Ultraviolet Rays
alternative label: Ultra-Violet Rays
alternative label: rays uv
alternative label: UV rays
alternative label: Ultra Violet Rays
alternative label: Ultra-Violet Ray

Ultraviolet radiation
type: Class
subclass of: Physical/Chemical Environment
comment: 1 M00253 2 Ultraviolet radiation 3 UV Radiation, UVR - Ultraviolet radiation, radiation ultraviolet 4 Ultraviolet radiation 5 41355003 6 Ultraviolet radiation 7 Ultraviolet radiation (physical force) 8 Ultraviolet Rays 9 C0041625
alternative label: radiation ultraviolet
alternative label: UV Radiation
alternative label: UVR - Ultraviolet radiation

Umbilical Region
type: Class
subclass of: Sensory function, Pain and Skin function (Body region)
comment: 1 M01091 2 Umbilical Region 3 Umbilical region structure, Umbilical part of abdomen 4 Umbilical Region 5 90290004 6 Umbilical region 7 Umbilical region structure (body structure) 8 Umbilical region 9 C3887539
alternative label: Umbilical part of abdomen
alternative label: Umbilical region structure

Unable to pass urine
type: Class
subclass of: Urogenital function (Symptom)
comment: 1 M01655 2 Unable to pass urine 3 None 4 Unable to pass urine 5 267064002 6 Unable to pass urine 7 Retention of urine (disorder) 8 Unable to pass urine 9 C0080274

Unacceptable performance
type: Class
subclass of: Questionnaire
comment: 1 MD05597 2 Unacceptable performance 3 None 4 Unacceptable performance 5 398166005 6 Performed 7 Performed (qualifier value) 8 Performance 9 C0597198

Unconscious
type: Class
subclass of: Nervous system and Mental function (Symptom)
comment: 1 M01536 2 Unconscious 3 Unconscious State, Unconscious States, Unconsciousness 4 Unconscious 5 418107008 6 Unconscious 7 Unconscious (finding) 8 Unconscious 9 C0041657
alternative label: Unconscious States
alternative label: Unconsciousness
alternative label: Unconscious State

Undernutrition
type: Class
subclass of: Nutritional status
comment: 1 M01746 2 Undernutrition 3 Underfed, Undernourished, Undernutrition syndrome 4 Undernutrition 5 65404009 6 Undernutrition 7 Undernutrition (disorder) 8 Undernutrition 9 C0162429
alternative label: Underfed
alternative label: Undernourished
alternative label: Undernutrition syndrome

Undertaking a complex task
type: Class
subclass of: Health Related Factors
comment: 1 MD06198 2 Undertaking a complex task 3 None 4 Undertaking a complex task 5 844005 6 Behavior finding 7 Behavior finding (finding) 8 Undertaking a complex task 9 C2371308

Undertaking a simple task
type: Class
subclass of: Health Related Factors
comment: 1 MD06197 2 Undertaking a simple task 3 None 4 Undertaking a simple task 5 844005 6 Behavior finding 7 Behavior finding (finding) 8 Undertaking a simple task 9 C2371307

Undertaking a single task
type: Class
subclass of: Health Related Factors
comment: 1 MD06196 2 Undertaking a single task 3 None 4 Undertaking a single task 5 844005 6 Behavior finding 7 Behavior finding (finding) 8 Undertaking a single task 9 C2371306

Undertaking a single task in a group
type: Class
subclass of: Health Related Factors
comment: 1 MD06200 2 Undertaking a single task in a group 3 None 4 Undertaking a single task in a group 5 844005 6 Behavior finding 7 Behavior finding (finding) 8 Undertaking a single task in a group 9 C2371310

Undertaking a single task independently
type: Class
subclass of: Health Related Factors
comment: 1 MD06199 2 Undertaking a single task independently 3 None 4 Undertaking a single task independently 5 844005 6 Behavior finding 7 Behavior finding (finding) 8 Undertaking a single task independently 9 C2371309

Undertaking multiple tasks
type: Class
subclass of: Health Related Factors
comment: 1 MD06203 2 Undertaking multiple tasks 3 None 4 Undertaking multiple tasks 5 844005 6 Behavior finding 7 Behavior finding (finding) 8 Undertaking multiple tasks 9 C2371313

Undertaking multiple tasks in a group
type: Class
subclass of: Health Related Factors
comment: 1 MD06207 2 Undertaking multiple tasks in a group 3 None 4 Undertaking multiple tasks in a group 5 844005 6 Behavior finding 7 Behavior finding (finding) 8 Undertaking multiple tasks in a group 9 C2371317

Undertaking multiple tasks independently
type: Class
subclass of: Health Related Factors
comment: 1 MD06206 2 Undertaking multiple tasks independently 3 None 4 Undertaking multiple tasks independently 5 844005 6 Behavior finding 7 Behavior finding (finding) 8 Undertaking multiple tasks independently 9 C2371316

Underwear
type: Class
subclass of: Questionnaire
comment: 1 MD05400 2 Underwear 3 None 4 Underwear 5 228164001 6 Underwear 7 Undergarment (physical object) 8 Underwear 9 C0453880

Undetermined
type: Class
subclass of: Questionnaire
comment: 1 MD04968 2 Undetermined 3 None 4 Undetermined 5 373068000 6 Undetermined 7 Undetermined (qualifier value) 8 Undetermined 9 C3536725

Unit dose
type: Class
subclass of: Units
comment: 1 M04712 2 Unit dose 3 dosing units 4 Unit dose 5 408102007 6 Unit dose 7 Unit dose (qualifier value) 8 Unit dose 9 C0869039
alternative label: dose
alternative label: dosing units

Unit of bone density
type: Class
subclass of: Units
comment: 1 M03438 2 Unit of bone density 3 None 4 Unit of bone density 5 418262007 6 Unit of bone density 7 Unit of bone density (qualifier value) 8 Unit of bone density 9 C1689934

Unit of calorific content
type: Class
subclass of: Units
comment: 1 M03198 2 Unit of calorific content 3 None 4 Unit of calorific content 5 282736003 6 Unit of calorific content 7 Unit of calorific content (qualifier value) 8 Unit of calorific content 9 C0560593

Unit of dietary carbohydrate exchange
type: Class
subclass of: Units
comment: 1 M03108 2 Unit of dietary carbohydrate exchange 3 None 4 Unit of dietary carbohydrate exchange 5 228891001 6 Unit of dietary carbohydrate exchange 7 Unit of dietary carbohydrate exchange (qualifier value) 8 Unit of dietary carbohydrate exchange 9 C0556591

Unit of dietary energy measurement
type: Class
subclass of: Units
comment: 1 M03117 2 Unit of dietary energy measurement 3 None 4 Unit of dietary energy measurement 5 228900009 6 Unit of dietary energy measurement 7 Unit of dietary energy measurement (qualifier value) 8 Unit of dietary energy measurement 9 C0556600

Unit of dietary exchange
type: Class
subclass of: Units
comment: 1 M03101 2 Unit of dietary exchange 3 None 4 Unit of dietary exchange 5 228880008 6 Unit of dietary exchange 7 Unit of dietary exchange (qualifier value) 8 Unit of dietary exchange 9 C0556584

Unit of dietary mass measurement
type: Class
subclass of: Units
comment: 1 M03118 2 Unit of dietary mass measurement 3 None 4 Unit of dietary mass measurement 5 228915005 6 Unit of dietary mass measurement 7 Unit of dietary mass measurement (qualifier value) 8 Unit of dietary mass measurement 9 C0556601

Unit of dietary potassium exchange
type: Class
subclass of: Units
comment: 1 M03113 2 Unit of dietary potassium exchange 3 None 4 Unit of dietary potassium exchange 5 228896006 6 Unit of dietary potassium exchange 7 Unit of dietary potassium exchange (qualifier value) 8 Unit of dietary potassium exchange 9 C0556596

Unit of dietary protein exchange
type: Class
subclass of: Units
comment: 1 M03102 2 Unit of dietary protein exchange 3 None 4 Unit of dietary protein exchange 5 228881007 6 Unit of dietary protein exchange 7 Unit of dietary protein exchange (qualifier value) 8 Unit of dietary protein exchange 9 C0556585

Unit of dietary volume measurement
type: Class
subclass of: Units
comment: 1 M03119 2 Unit of dietary volume measurement 3 None 4 Unit of dietary volume measurement 5 228925000 6 Unit of dietary volume measurement 7 Unit of dietary volume measurement (qualifier value) 8 Unit of dietary volume measurement 9 C0556602

Unit of electrical capacitance
type: Class
subclass of: Units
comment: 1 M04685 2 Unit of electrical capacitance 3 None 4 Unit of electrical capacitance 5 304609006 6 Unit of electrical capacitance 7 Unit of electrical capacitance (qualifier value) 8 Unit of electrical capacitance 9 C0582514

Unit of electrical inductance
type: Class
subclass of: Units
comment: 1 M03287 2 Unit of electrical inductance 3 None 4 Unit of electrical inductance 5 304611002 6 Unit of electrical inductance 7 Unit of electrical inductance (qualifier value) 8 Unit of electrical inductance 9 C0582516

Unit of genetic analysis
type: Class
subclass of: Units
comment: 1 M03289 2 Unit of genetic analysis 3 None 4 Unit of genetic analysis 5 304613004 6 Unit of genetic analysis 7 Unit of genetic analysis (qualifier value) 8 Unit of genetic analysis 9 C0582518

Unit of physiological rate
type: Class
subclass of: Units
comment: 1 M03179 2 Unit of physiological rate 3 None 4 Unit of physiological rate 5 282392000 6 Unit of physiological rate 7 Unit of physiological rate (qualifier value) 8 Unit of physiological rate 9 C0560277

Unit per Gram
type: Class
subclass of: Units
comment: 1 M05699 2 Unit per Gram 3 U/g Unit/gram Unit/gm 4 Unit per Gram 5 415784009 6 Unit per gram 7 Unit/gram (qualifier value) 8 Unit per gram 9 C2608091
alternative label: Unit/gm
alternative label: Unit/gram
alternative label: U/g

Unit per Gram per Day
type: Class
subclass of: Units
comment: 1 M05686 2 Unit per Gram per Day 3 Unit/gram/day U/g/d 4 Unit per Gram per Day 5 415784009 6 Unit/gram 7 Unit/gram (qualifier value) 8 Unit per Gram per Day 9 C2349072
alternative label: Unit/gram/day
alternative label: U/g/d

Unit per Gram per Hour
type: Class
subclass of: Units
comment: 1 M05688 2 Unit per Gram per Hour 3 Unit/Gram/Hour U/g/h 4 Unit per Gram per Hour 5 415784009 6 Unit/gram 7 Unit/gram (qualifier value) 8 Unit per Gram per Hour 9 C2349073
alternative label: Unit/Gram/Hour
alternative label: U/g/h

Unit per Gram per Minute
type: Class
subclass of: Units
comment: 1 M05690 2 Unit per Gram per Minute 3 Unit/Gram/Minute U/g/min 4 Unit per Gram per Minute 5 415784009 6 Unit/gram 7 Unit/gram (qualifier value) 8 Unit per Gram per Minute 9 C2349074
alternative label: U/g/min
alternative label: Unit/Gram/Minute

Unit per Kilogram
type: Class
subclass of: Units
comment: 1 M04746 2 Unit per kilogram 3 Unit/kilogram unit/kg u/kg U/kg 4 Unit per Kilogram 5 415785005 6 Unit per kilogram 7 Unit/kilogram (qualifier value) 8 Unit per kilogram 9 C1300561
alternative label: u/kg
alternative label: unit/kg
alternative label: U/kg
alternative label: Unit/kilogram

Unit per Kilogram per Day
type: Class
subclass of: Units
comment: 1 M04989 2 Unit per Kilogram per Day 3 U/kg/day Unit/kilogram/day Unit/kg/day U/kg/d 4 Unit per Kilogram per Day 5 415786006 6 Unit per kilogram per day 7 Unit/kilogram/day (qualifier value) 8 Unit per kilogram per day 9 C1532634
alternative label: U/kg/day
alternative label: Unit/kg/day
alternative label: Unit/kilogram/day
alternative label: U/kg/d

Unit per Liter
type: Class
subclass of: Units
comment: 1 M04034 2 Unit per Liter 3 unit/litre unit/liter U/L unit/litre unit/liter 4 Unit per Liter 5 258947003 6 Unit/liter 7 Unit/liter (qualifier value) 8 Unit/liter 9 C0439339
alternative label: unit/liter
alternative label: unit/litre
alternative label: U/L

Unit per Milligram
type: Class
subclass of: Units
comment: 1 M05187 2 Unit per Milligram 3 Unit/mg Unit/milligram U/mg 4 Unit per Milligra\m 5 418830004 6 Unit per milligram 7 Unit/milligram (qualifier value) 8 Unit per milligram 9 C1638407

Unit per Milliliter
type: Class
subclass of: Units
comment: 1 M04042 2 Unit per Milliliter 3 unit/milliliter unit/millilitre unit/mL U/mL U/ml 4 Unit per Milliliter 5 767525000 6 Unit 7 Unit (qualifier value) 8 Unit 9 C0439148
comment: 1 M05720 2 Unit per Milliliter 3 unit/milliliter unit/millilitre unit/mL U/mL U/ml 4 Unit per Milliliter 5 258948008 6 Unit/milliliter 7 Unit/milliliter (qualifier value) 8 Unit/milliliter 9 C2945590
alternative label: Units per Milliliter
alternative label: unit/mL
alternative label: unit/millilitre
alternative label: unit/milliliter
alternative label: U/mL

Unit per Millimole
type: Class
subclass of: Units
comment: 1 M05726 2 Unit per Millimole 3 U/mmol 4 Unit per Millimole 5 425629008 6 Unit/millimole creatinine 7 Unit/millimole creatinine (qualifier value) 8 Unit per Millimole 9 C2985216
alternative label: U/mmol

Unit per Square Meter
type: Class
subclass of: Units
comment: 1 M05002 2 Unit per Square Meter 3Unit per square metre Unit/Square Meter Unit/meter2 unit/m2 Unit per metre squared Unit per meter2 Unit per meter squared 4 Unit per Square Meter 5 415789004 6 Unit per square meter 7 Unit/meter2 (qualifier value) 8 Unit per square meter 9 C1532637
alternative label: Unit per metre squared
alternative label: Unit per meter2
alternative label: unit/m2
alternative label: Unit per meter squared
alternative label: Unit per square metre

Unit per Square Meter per Day
type: Class
subclass of: Units
comment: 1 M05692 2 Unit per Square Meter per Day 3 Unit/meter2/day U/m2/d 4 Unit per Square Meter per Day 5 415789004 6 Unit per square metre 7 Unit/meter2 (qualifier value) 8 Unit per Square Meter per Day 9 C2349077
alternative label: Unit/meter2/day
alternative label: U/m2/d
alternative label: U/m2

Unit per Square Meter per Hour
type: Class
subclass of: Units
comment: 1 M05694 2 Unit per Square Meter per Hour 3 Unit/Square Meter/Hour U/m2/h 4 Unit per Square Meter per Hour 5 415789004 6 Unit per square metre 7 Unit/meter2 (qualifier value) 8 Unit per Square Meter per Hour 9 C2349078
alternative label: Unit/Square Meter/Hour
alternative label: U/m2/h

Unit per Square Meter per Minute
type: Class
subclass of: Units
comment: 1 M05696 2 Unit per Square Meter per Minute 3 Unit/Square Meter/Minute U/m2/min 4 Unit per Square Meter per Minute 5 415789004 6 Unit per square metre 7 Unit/meter2 (qualifier value) 8 Unit per Square Meter per Minute 9 C2349079
alternative label: Unit/Square Meter/Minute
alternative label: U/m2/min

Unit per cubic meter
type: Class
subclass of: Units
comment: 1 M04743 2 Unit per cubic meter 3 unit/m3 Unit/cubic metre Unit/cubic meter Unit per metre cubed Unit per meter cubed Unit per cubic metre u/m3 4 Unit per cubic meter 5 396164002 6 Unit per cubic meter 7 Unit/cubic meter (qualifier value) 8 Unit per cubic meter 9 C1300560
alternative label: Unit per meter cubed
alternative label: Unit/cubic metre
alternative label: Unit per cubic metre
alternative label: Unit/cubic meter
alternative label: u/m3
alternative label: unit/m3
alternative label: Unit per metre cubed

Unit per deciliter
type: Class
subclass of: Units
comment: 1 M04986 2 Unit per deciliter 3 Unit per decilitre unit/dL U/dL 4 Unit per deciliter 5 415783003 6 Unit per deciliter 7 Unit/deciliter (qualifier value) 8 Unit per deciliter 9 C1532632
alternative label: Unit per decilitre
alternative label: unit/dL
alternative label: Unit/deciliter
alternative label: U/dL

Units
type: Class
comment: 1 M02864 2 unit 3 None 4 Units 5 246514001 6 Units 7 Units (attribute) 8 Units 9 C0439148

Units of concentraion for glomerular filtrate
type: Class
subclass of: Units
comment: 1 M03434 2 Units of concentraion for glomerular filtrate 3 None 4 Units of concentraion for glomerular filtrate 5 419626007 6 Units of concentraion for glomerular filtrate 7 Units of concentraion for glomerular filtrate (qualifier value) 8 Units of concentraion for glomerular filtrate 9 C1688596

Units per 2 hours
type: Class
subclass of: Units
comment: 1 M04785 2 Units per 2 hours 3 Unit/2hr Unit/2 hours U/2hr 4 Units per 2 hours 5 415782008 6 Units per 2 hours 7 Unit/2 hours (qualifier value) 8 Units per 2 hours 9 C1300568
alternative label: Unit/2 hours
alternative label: Unit/2hr
alternative label: U/2hr

Units per unit time
type: Class
subclass of: Units
comment: 1 M03178 2 Units per unit time 3 None 4 Units per unit time 5 282391007 6 Units per unit time 7 Units per unit time (qualifier value) 8 Units per unit time 9 C0560276

Unspecified chest pain
type: Class
subclass of: Hospital information, examination/diagnosis/treatment data
comment: 1 M00802 2 Unspecified chest pain 3 Nonspecific chest pain 4 Unspecified chest pain 5 29857009 6 Chest pain 7 Chest pain (finding) 8 Chest Pain 9 C0008031
alternative label: Nonspecific chest pain

Unspecified constipation
type: Class
subclass of: Digestive function (Symptom)
comment: 1 M00842 2 Unspecified constipation 3 None 4 Unspecified constipation 5 14760008 6 Constipation 7 Constipation (finding) 8 Constipation 9 C0009806

Unspecified erythematous condition
type: Class
subclass of: Sensory function, Pain and Skin function (Symptom)
comment: 1 M01552 2 Unspecified erythematous condition 3 None 4 Unspecified erythematous condition 5 70819003 6 Erythema 7 Erythema (morphologic abnormality) 8 Erythema 9 C0041834

Unspecified lymphadenopathy
type: Class
subclass of: Immune system function (Symptom)
comment: 1 M02535 2 Unspecified lymphadenopathy 3 None 4 Unspecified lymphadenopathy 5 30746006 6 Lymphadenopathy 7 Lymphadenopathy (disorder) 8 Lymphadenopathy 9 C0497156

Unspecified non-organic sleep disorder
type: Class
subclass of: Nervous system and Mental function (Symptom)
comment: 1 M01724 2 Unspecified non-organic sleep disorder 3 None 4 Unspecified non-organic sleep disorder 5 270487001 6 Non-organic sleep disorder 7 Non-organic sleep disorder (disorder) 8 Other nonorganic sleep disorders 9 C0338961

Unspecified nutritional deficiency
type: Class
subclass of: Nutritional status
comment: 1 M01748 2 Unspecified nutritional deficiency 3 None 4 Unspecified nutritional deficiency 5 47563007 6 Nutritional deficiency 7 Nutritional deficiency (finding) 8 Nutritional deficiency disorder 9 C4761312

Unspecified sleep apnea
type: Class
subclass of: Respiratory function (Symptom)
comment: 1 M01376 2 Unspecified sleep apnea 3 None 4 Unspecified sleep apnea 5 73430006 6 SAS - Sleep apnea syndrome 7 Sleep apnea (disorder) 8 Sleep apnea syndrome 9 C0037315

Unstable mood
type: Class
subclass of: Nervous system and Mental function (Symptom)
comment: 1 M00568 2 Unstable mood 3 None 4 Unstable mood 5 18963009 6 Unstable mood 7 Mood swings (finding) 8 Unstable mood 9 C0085633

Upper Body Circuit
type: Class
subclass of: Anatomic part
comment: 1 MD02027 2 Upper Body Circuit 3 None 4 Upper Body Circuit 5 229074006 6 Exercise circuits 7 Exercise circuits (regime/therapy) 8 Exercise circuits 9 C0454286

Upper Extremities
type: Class
subclass of: Musculoskeletal function (Body region)
comment: 1 M02403 2 Upper Extremities 3 Structure of upper extremity 4 Upper Extremities 5 88650009 6 Both upper extremities 7 Both upper extremities (body structure) 8 Upper Extremity 9 C1140618
alternative label: Structure of upper extremity

Upper Hospital
type: Class
subclass of: Classification of Hospital
comment: 1 MD00604 2 Upper Hospital 3 None 4 Upper Hospital 5 22232009 6 Hospital 7 Hospital (environment) 8 Hospitals 9 C0019994
comment: 1 MD00604-1 2 Upper Hospital 3 None 4 Upper Hospital 5 34271000087101 6 General hospital 7 General hospital (environment) 8 Hospitals, General 9 C0020008

Upper Limb
type: Class
subclass of: Musculoskeletal function (Body region)
comment: 1 M02413 2 Upper Limb 3 upper limbs, arms, arm, Arm, Upper Extremity, Upper Extremities, Upper limb structure 4 Upper Limb 5 53120007 6 Upper limb 7 Upper limb structure (body structure) 8 Upper Extremity 9 C1140618
alternative label: upper limbs
alternative label: Upper Extremity
alternative label: Upper limb structure

Upper Limb Amputee
type: Class
subclass of: Classification of Patient
comment: 1 MD04506 2 Upper Limb Amputee 3 Upper Limb amputation upper extremity amputation 4 Upper Limb Amputee 5 275530009 6 Amputee - limb 7 Amputee - limb (finding) 8 Amputee - limb 9 C0559172
alternative label: Upper Limb amputation

Upper Third of the Esophagus
type: Class
subclass of: Digestive function (Body region)
comment: 1 M01092 2 Upper Third of the Esophagus 3 Upper third of esophagus 4 Upper Third of the Esophagus 5 54738009 6 Upper third of esophagus 7 Structure of upper third of esophagus (body structure) 8 Upper third of esophagus 9 C0227187
alternative label: Upper third of esophagus

Upper limb exercises
type: Class
subclass of: Limb
comment: 1 M00303 2 Upper limb exercises 3 arm exercise, Arm exercises 4 Upper limb exercises 5 229109003 6 Upper limb exercises 7 Upper limb exercises (regime/therapy) 8 Upper limb exercises 9 C0454320
alternative label: arm exercise
alternative label: Arm exercises

Upper limb function
type: Class
subclass of: Body functions of disability
comment: 1 MD00100 2 Upper limb function 3 None 4 Upper limb function 5 116307009 6 Finding of upper limb 7 Finding of upper limb (finding) 8 Active upper limb movements 9 C0454461

Upper limb joint
type: Class
subclass of: Structures of disability
comment: 1 MD00098 2 Upper limb joint 3 None 4 Upper limb joint 5 896816002 6 Joint structure of upper limb 7 Joint structure of upper limb (body structure) 8 Joint structure of shoulder girdle or upper limb 9 C0459449

Urethra
type: Class
subclass of: Urogenital function (Body region)
comment: 1 MD06982 2 Urethra 3 Ureters 4 Urethra 5 13648007 6 Urethra 7 Urethral structure (body structure) 8 Urethra 9 C0041967

Urinary bladder
type: Class
subclass of: Urogenital function (Body region)
comment: 1 MD06981 2 Urinary bladder 3 None 4 Urinary bladder 5 89837001 6 Urinary bladder 7 Urinary bladder structure (body structure) 8 Urinary bladder 9 C0005682

Urinary continence
type: Class
subclass of: Urogenital function (Body measurement)
comment: 1 MD05987 2 Urinary continence 3 None 4 Urinary continence 5 405002008 6 urinary continence ability 7 Ability to maintain urinary continence (observable entity) 8 Urinary continence 9 C0542565

Urinary excretory functions
type: Class
subclass of: Urogenital function (Body measurement)
comment: 1 MD05979 2 Urinary excretory functions 3 None 4 Urinary excretory functions 5 63911002 6 Excretory function 7 Excretory function (observable entity) 8 Urinary excretory functions 9 C2371160

Urination
type: Class
subclass of: Urogenital function (Body measurement)
comment: 1 MD05985 2 Urination 3 None 4 Urination 5 102834005 6 normal urination 7 Normal micturition (finding) 8 Urination 9 C0042034

Urination functions
type: Class
subclass of: Urogenital function (Body measurement)
comment: 1 MD05984 2 Urination functions 3 None 4 Urination functions 5 102834005 6 Normal urination 7 Normal micturition (finding) 8 Urination functions 9 C2371165

Urine
type: Class
subclass of: Urogenital function (Body measurement)
comment: 1 MD04564 2 Urine 3 None 4 Urine 5 78014005 6 Urine 7 Urine (substance) 8 Urine 9 C0042036

Urine control
type: Class
subclass of: Health Related Factors
comment: 1 MD04563 2 Urine control 3 None 4 Urine control 5 246106000 6 Control 7 Control (attribute) 8 Control 9 C2587213

Urine glucose
type: Class
subclass of: Hospital information, examination/diagnosis/treatment data
comment: 1 MD00702 2 Urine glucose 3 None 4 Urine glucose 5 69376001 6 Urine test for glucos 7 Urinalysis, glucose, qualitative (procedure) 8 Glucose measurement, urine 9 C0004076

Urine protein
type: Class
subclass of: Hospital information, examination/diagnosis/treatment data
comment: 1 MD00703 2 Urine protein 3 None 4 Urine protein 5 50456001 6 Urine protein 7 Urine protein (substance) 8 Urine protein 9 C1305628

Urine protein test
type: Class
subclass of: Hospital information, examination/diagnosis/treatment data
comment: 1 MD03960 2 Urine protein test 3 None 4 Urine protein test 5 57378007 6 Measurement of protein in urine 7 Measurement of protein in urine (procedure) 8 Urine protein test 9 C0262923

Urology
type: Class
subclass of: Classification of Hospital
comment: 1 MD00644 2 Urology 3 None 4 Urology 5 394612005 6 Urology 7 Urology (qualifier value) 8 Urology 9 C0042077

Use
type: Class
subclass of: Health Related Factors
comment: 1 MD04370 2 Use 3 using, use of 4 Use 5 419385000 6 Use 7 Use - dosing instruction imperative (qualifier value) 8 Use 9 C1947944
alternative label: use of
alternative label: Using
alternative label: Performance Evaluation of Basic Daily Life Behavior

Use of assist device
type: Class
subclass of: Questionnaire
comment: 1 MD04368 2 Use of assist device 3 None 4 Use of assist device 5 1141802005 6 Assistive device 7 Assistive device (physical object) 8 device 9 C0699733

Using Cookware
type: Class
subclass of: Health Related Factors
comment: 1 MD05370 2 Using Cookware 3 None 4 Using Cookware 5 424226004 6 Using device 7 Using device (attribute) 8 Using device 9 C1828349

Using Hand Tools
type: Class
subclass of: Health Related Factors
comment: 1 MD04992 2 Using Hand Tools 3 None 4 Using Hand Tools 5 20997002 6 Hand tool 7 Hand tool, device (physical object) 8 Hand tool 9 C0336792

Using Online Banking
type: Class
subclass of: Health Related Factors
comment: 1 MD05436 2 Using Online Banking 3 None 4 Using Online Banking 5 844005 6 Behavior finding 7 Behavior finding (finding) 8 Behavior 9 C0004927

Using Online Shopping
type: Class
subclass of: Health Related Factors
comment: 1 MD05406 2 Using Online Shopping 3 None 4 Using Online Shopping 5 129011005 6 Shopping 7 Shopping (observable entity) 8 Shopping (activity) 9 C0150768

Using Sort technique
type: Class
subclass of: Health Related Factors
comment: 1 MD05339 2 Using Sort technique 3 None 4 Using Sort technique 5 272394005 6 Technique 7 Technique (qualifier value) 8 Techniques 9 C0449851

Using a Call Taxi
type: Class
subclass of: Health Related Factors
comment: 1 MD05476 2 Using a Call Taxi 3 None 4 Using a Call Taxi 5 260676000 6 Use of 7 Use of (attribute) 8 Use of 9 C1524063

Using a Microwave to Heat Food
type: Class
subclass of: Questionnaire
comment: 1 MD05359 2 Using a Microwave to Heat Food 3 None 4 Using a Microwave to Heat Food 5 302205006 6 Microwave - action 7 Microwave - action (qualifier value) 8 Behavior 9 C0004927

Using a fork
type: Class
subclass of: Health Related Factors
comment: 1 MD04542 2 Using a fork 3 None 4 Using a fork 5 289056005 6 Does use fork to feed self 7 Does use fork to feed self (finding) 8 Does not use fork to feed self 9 C0566470

Using communication aids
type: Class
subclass of: Health Related Factors
comment: 1 MD05450 2 Using communication aids 3 None 4 Using communication aids 5 260676000 6 Use of 7 Use of (attribute) 8 Use of 9 C1524063

Using communication devices and techniques
type: Class
subclass of: Health Related Factors
comment: 1 MD06266 2 Using communication devices and techniques 3 None 4 Using communication devices and techniques 5 719369003 6 Uses communication device 7 Does use communication device (finding)| 8 Using communication devices and techniques 9 C2371368

Using communication techniques
type: Class
subclass of: Health Related Factors
comment: 1 MD06269 2 Using communication techniques 3 None 4 Using communication techniques 5 401049002 6 Communication skills 7 Communication skills (observable entity) 8 Using communication techniques 9 C2371371

Using general skills and strategies of the writing process
type: Class
subclass of: Health Related Factors
comment: 1 MD06177 2 Using general skills and strategies of the writing process 3 None 4 Using general skills and strategies of the writing process 5 288361006 6 Skill in use of hands 7 Ability to perform general manipulative activities (observable entity) 8 Using general skills and strategies of the writing process 9 C2372014

Using general skills and strategies to complete compositions
type: Class
subclass of: Health Related Factors
comment: 1 MD06179 2 Using general skills and strategies to complete compositions 3 None 4 Using general skills and strategies to complete compositions 5 288361006 6 Skill in use of hands 7 Ability to perform general manipulative activities (observable entity) 8 Using general skills and strategies to complete compositions 9 C2372016

Using grammatical and mechanical conventions in written compositions
type: Class
subclass of: Health Related Factors
comment: 1 MD06178 2 Using grammatical and mechanical conventions in written compositions 3 None 4 Using grammatical and mechanical conventions in written compositions 5 288361006 6 Skill in use of hands 7 Ability to perform general manipulative activities (observable entity) 8 Using grammatical and mechanical conventions in written compositions 9 C2372015

Using household appliances
type: Class
subclass of: Health Related Factors
comment: 1 MD06432 2 Using household appliances 3 use of home appliances 4 Using household appliances 5 67604003 6 Household appliance 7 Household appliance (physical object) 8 Using household appliances 9 C2371501
alternative label: use of home appliances

Using human-powered vehicles
type: Class
subclass of: Health Related Factors
comment: 1 MD06355 2 Using human-powered vehicles 3 None 4 Using human-powered vehicles 5 261324000 6 Vehicle 7 Vehicle (physical object) 8 Using human-powered vehicles 9 C2371438

Using humans for transportation
type: Class
subclass of: Health Related Factors
comment: 1 MD06358 2 Using humans for transportation 3 None 4 Using humans for transportation 5 424483007 6 Transportation details 7 Transportation details (observable entity) 8 Using humans for transportation 9 C2372048

Using private motorized transportation
type: Class
subclass of: Health Related Factors
comment: 1 MD06356 2 Using private motorized transportation 3 None 4 Using private motorized transportation 5 720370008 6 Transportation by car 7 Transportation by car (procedure) 8 Using private motorized transportation 9 C2371439

Using public motorized transportation
type: Class
subclass of: Health Related Factors
comment: 1 MD06357 2 Using public motorized transportation 3 None 4 Using public motorized transportation 5 716367000 6 Transportation by public transport 7 Transportation by public transport (procedure) 8 Using public motorized transportation 9 C2371440

Using skills and strategies to perform complex numeric operations and calculations
type: Class
subclass of: Health Related Factors
comment: 1 MD06184 2 Using skills and strategies to perform complex numeric operations and calculations 3 None 4 Using skills and strategies to perform complex numeric operations and calculations 5 288361006 6 Skill in use of hands 7 Ability to perform general manipulative activities (observable entity) 8 Using simple skills and strategies of the calculation process 9 C2372019

Using skills and strategies to perform simple numeric calculations
type: Class
subclass of: Health Related Factors
comment: 1 MD06183 2 Using skills and strategies to perform simple numeric calculations 3 None 4 Using skills and strategies to perform simple numeric calculations 5 288361006 6 Skill in use of hands 7 Ability to perform general manipulative activities (observable entity) 8 Using simple skills and strategies of the calculation process 9 C2372019

Using telecommunication devices
type: Class
subclass of: Health Related Factors
comment: 1 MD06267 2 Using telecommunication devices 3 None 4 Using telecommunication devices 5 719369003 6 Uses communication device 7 Does use communication device (finding)| 8 Using telecommunication devices 9 C2371369

Using the ATM
type: Class
subclass of: Health Related Factors
comment: 1 MD05429 2 Using the ATM 3 None 4 Using the ATM 5 844005 6 Behavior finding 7 Behavior finding (finding) 8 Behavior 9 C0004927

Using the Phone
type: Class
subclass of: Health Related Factors
comment: 1 MD05222 2 Using the Phone 3 Using your smartphone 4 Using the Phone 5 300725000 6 Able to perform telephone activities 7 Able to perform telephone activities (finding 8 Able to perform telephone activities 9 C0577441
alternative label: Using your smartphone

Using transportation
type: Class
subclass of: Health Related Factors
comment: 1 MD06354 2 Using transportation 3 None 4 Using transportation 5 84762007 6 Transportation procedure 7 Transportation procedure (procedure) 8 Using transportation 9 C2371437

Using writing machines
type: Class
subclass of: Health Related Factors
comment: 1 MD06268 2 Using writing machines 3 None 4 Using writing machines 5 61284002 6 Machine 7 Machine, device (physical object) 8 Using writing machines 9 C2371370

Utilities policies
type: Class
subclass of: Public Policy Factors
comment: 1 MD06737 2 Utilities policies 3 None 4 Utilities policies 5 276339004 6 environment 7 Environment (environment) 8 Utilities policies 9 C2371768

Utilities services
type: Class
subclass of: Public Policy Factors
comment: 1 MD06735 2 Utilities services 3 None 4 Utilities services 5 224930009 6 services 7 Services (qualifier value) 8 Utilities services 9 C2371766

Utilities systems
type: Class
subclass of: Public Policy Factors
comment: 1 MD06736 2 Utilities systems 3 None 4 Utilities systems 5 246333005 6 system 7 System (attribute) 8 Utilities systems 9 C2371767

Utility biking
type: Class
subclass of: Sport
comment: 1 MD01001 2 Utility biking 3 None 4 Utility biking 5 300648001 6 rides a bicycle 7 Does ride a bicycle (finding) 8 Does ride a bicycle 9 C0577368

Utilization tools
type: Class
subclass of: Questionnaire
comment: 1 MD05545 2 Utilization tools 3 None 4 Utilization tools 5 86967005 6 Tool 7 Tool, device (physical object) 8 Tool, device (physical object) 9 C0336791

Utilization tools and facilities
type: Class
subclass of: Questionnaire
comment: 1 MD05544 2 Utilization tools and facilities 3 None 4 Utilization tools and facilities 5 246137000 6 Equipment 7 Equipment (attribute) 8 Equipment 9 C0014672

V-CRUNCHES
type: Class
subclass of: Aerobic Exercise
comment: 1 MD02023 2 V-CRUNCHES 3 None 4 V-CRUNCHES 5 183301007 6 Physical exercises 7 Physical exercises (regime/therapy) 8 Physical therapy exercises 9 C0452240

V-CURL
type: Class
subclass of: Aerobic Exercise
comment: 1 MD02016 2 V-CURL 3 None 4 V-CURL 5 183301007 6 Physical exercises 7 Physical exercises (regime/therapy) 8 Physical therapy exercises 9 C0452240

VCO2
type: Class
subclass of: Hospital information, examination/diagnosis/treatment data
comment: 1 MD03170 2 VCO2 3 None 4 VCO2 5 251408004 6 VCO2-Carbon dioxide output 7 Carbon dioxide output (observable entity) 8 Carbon dioxide output 9 C0429247

VD
type: Class
subclass of: Hospital information, examination/diagnosis/treatment data
comment: 1 MD03178 2 VD 3 None 4 VD 5 251916001 6 Respiratory dead space 7 Respiratory dead space (observable entity) 8 Respiratory Dead Space 9 C0035218

VE Max
type: Class
subclass of: Hospital information, examination/diagnosis/treatment data
comment: 1 MD03175 2 VE Max 3 None 4 VE Max 5 426168008 6 Expiratory minute volume 7 Expiratory minute volume (observable entity) 8 Expiratory minute volume 9 C1959925

VI
type: Class
subclass of: Units
comment: 1 M05315 2 VI 3 None 4 VI 5 262261009 6 VI 7 Roman numeral VI (qualifier value) 8 VI 9 C0445379

VICON
type: Class
subclass of: Equipment
comment: 1 MD03161 2 VICON 3 None 4 VICON 5 272391002 6 Measurement 7 Measurement technique (qualifier value) 8 Measurement 9 C0242485

VO2
type: Class
subclass of: Hospital information, examination/diagnosis/treatment data
comment: 1 MD03171 2 VO2 3 None 4 VO2 5 251832002 6 VO2-oxygen uptake 7 Oxygen uptake (observable entity) 8 Oxygen uptake 9 C0429627

Vaginal canal
type: Class
subclass of: Urogenital function (Body region)
comment: 1 MD06999 2 Vaginal canal 3 None 4 Vaginal canal 5 48001003 6 Vaginal canal 7 Structure of vaginal canal (body structure) 8 Vaginal canal 9 C0227792

Values
type: Class
subclass of: Units
comment: 1 MD02323 2 Values 3 None 4 Values 5 260245000 6 finding value 7 Finding value (qualifier value) 8 values 9 C0042295

Varicella
type: Class
subclass of: Hospital information, examination/diagnosis/treatment data
comment: 1 MD00972 2 Varicella 3 None 4 Varicella 5 38907003 6 Varicella 7 Varicella (disorder) 8 Chickenpox 9 C0008049

Vascular Hypertensive Disorder
type: Class
subclass of: Cardiovascular system function (Symptom)
comment: 1 M01149 2 Vascular Hypertensive Disorder 3 vascular hypertension 4 Vascular Hypertensive Disorder 5 38341003 6 Hypertension 7 Hypertensive disorder, systemic arterial (disorder) 8 Hypertensive disease 9 C0020538
alternative label: vascular hypertension

Vascular Hypotensive Disorder
type: Class
subclass of: Cardiovascular system function (Symptom)
comment: 1 M01208 2 Vascular Hypotensive Disorder 3 Vascular Hypotension 4 Vascular Hypotensive Disorder 5 45007003 6 Hypotension 7 Low blood pressure (disorder) 8 Hypotension 9 C0020649
alternative label: Vascular Hypotension

Vegan Diet
type: Class
subclass of: Nutritional management
comment: 1 MD02031 2 Vegan Diet 3 None 4 Vegan Diet 5 138045004 6 Vegan diet 7 Vegan diet (finding) 8 Vegan diet 9 C0344353

Vegetables
type: Class
subclass of: Nutritional management
comment: 1 MD00773 2 Vegetables 3 None 4 Vegetables 5 300928006 6 vegiterian 7 vegiterian (finding) 8 Vegetables 9 C0042440

Veins
type: Class
subclass of: Cardiovascular system function (Body region)
comment: 1 MD06929 2 Veins 3 Functions of veins 4 Veins 5 29092000 6 vein 7 Venous structure (body structure) 8 Veins 9 C0042449
alternative label: Functions of veins

Ventilation rate
type: Class
subclass of: Respiratory function (Body measurement)
comment: 1 M05895 2 Ventilation rate 3 None 4 Ventilation rate 5 86290005 6 Respiratory rate 7 Respiratory rate (observable entity) 8 SIMV ventilation rate 9 C4700366

Ventricles
type: Class
subclass of: Cardiovascular system function (Body region)
comment: 1 MD06925 2 Ventricles 3 None 4 Ventricles 5 21814001 6 ventricle 7 Cardiac ventricular structure (body structure) 8 Ventricles 9 C0018827

Vertigo
type: Class
subclass of: Nervous system and Mental function (Symptom)
comment: 1 M00522 2 Vertigo 3 None 4 Vertigo 5 399153001 6 Vertigo 7 Vertigo (finding) 8 Vertigo 9 C0042571

Vertigo induced by motion of head or body
type: Class
subclass of: Nervous system and Mental function (Symptom)
comment: 1 M02592 2 Vertigo induced by motion of head or body 3 None 4 Vertigo induced by motion of head or body 5 103284002 6 Vertigo induced by position of head or body 7 Positional vertigo (finding) 8 Positional vertigo 9 C0522351

Vertigo induced by position of head or body
type: Class
subclass of: Nervous system and Mental function (Symptom)
comment: 1 M02593 2 Vertigo induced by position of head or body 3 None 4 Vertigo induced by position of head or body 5 103284002 6 Vertigo induced by position of head or body 7 Positional vertigo (finding) 8 Vertigo induced by position of head or body 9 C0522351
comment: 1 M02593-1 2 Vertigo induced by position of head or body 3 None 4 Vertigo induced by position of head or body 5 103284002 6 Vertigo induced by position of head or body 7 Positional vertigo (finding) 8 Vertigo induced by position of head or body 9 C0522351
comment: 1 M02593-2 2 Vertigo induced by position of head or body 3 None 4 Vertigo induced by position of head or body 5 103284002 6 Vertigo induced by position of head or body 7 Positional vertigo (finding) 8 Vertigo induced by position of head or body 9 C0522351

Very Stressed
type: Class
subclass of: Nervous system and Mental function (Symptom)
comment: 1 MD01771 2 Very Stressed 3 None 4 Very Stressed 5 424582000 6 Stress overload (finding) 7 Stress overload (finding) 8 Stress overload (finding) 9 C1827667

Very dangerous
type: Class
subclass of: Questionnaire
comment: 1 MD04987 2 Very dangerous 3 None 4 Very dangerous 5 246137000 6 equipment 7 Equipment (attribute) 8 equipment 9 C0014672

Very heavy drinker
type: Class
subclass of: Sub-Cultural Level
comment: 1 M00013 2 Very heavy drinker 3 None 4 Very heavy drinker 5 228279004 6 Very heavy drinker 7 Very heavy drinker (finding) 8 Very heavy drinker 9 C0556301

Very little
type: Class
subclass of: Questionnaire
comment: 1 MD05025 2 Very little 3 None 4 Very little 5 255507004 6 Little 7 Small (qualifier value) 8 Small 9 C0700321

Vestibular function of balance
type: Class
subclass of: Sensory function, Pain and Skin function (Body measurement)
comment: 1 MD05767 2 Vestibular function of balance 3 Vestibuloequilibratory 4 Vestibular function of balance 5 49441007 6 Vestibular nerve function 7 Vestibular nerve function (observable entity) 8 Vestibular functions 9 C2370946
alternative label: vestibuloequilibratory control

Vestibular function of determination of movement
type: Class
subclass of: Sensory function, Pain and Skin function (Body measurement)
comment: 1 MD05768 2 Vestibular function of determination of movement 3 None 4 Vestibular function of determination of movement 5 49441007 6 Vestibular nerve function 7 Vestibular nerve function (observable entity) 8 Vestibular function of determination of movement 9 C2370944

Vestibular function of position
type: Class
subclass of: Sensory function, Pain and Skin function (Body measurement)
comment: 1 MD05766 2 Vestibular function of position 3 None 4 Vestibular function of position 5 49441007 6 Vestibular nerve function 7 Vestibular nerve function (observable entity) 8 Vestibular functions 9 C2370946

Vestibular functions
type: Class
subclass of: Sensory function, Pain and Skin function (Body measurement)
comment: 1 MD05765 2 Vestibular functions 3 None 4 Vestibular functions 5 49441007 6 Vestibular nerve function 7 Vestibular nerve function (observable entity) 8 Vestibular functions 9 C2370946
alternative label: Vestibular functions, unspecified

Vestibular labyrinth
type: Class
subclass of: Sensory function, Pain and Skin function (Body region)
comment: 1 MD06881 2 Vestibular labyrinth 3 None 4 Vestibular labyrinth 5 117590005 6 ear structure 7 Ear structure (body structure) 8 Vestibular labyrinth 9 C1735318

Vial Dosing Unit
type: Class
subclass of: Units
comment: 1 M05314 2 Vial Dosing Unit 3 Vial 4 Vial Dosing Unit 5 415818006 6 Vial 7 Vial - unit of product usage (qualifier value) 8 Vial Dosing Unit 9 C1706398
alternative label: Vial

Vibration
type: Class
subclass of: Questionnaire
subclass of: Units
subclass of: Physical/Chemical Environment
comment: Environment Physical /Chemical environment None 1 MD06675 2 Vibration 3 None 4 Vibration 5 33679000 6 Vibration 7 Vibration (physical force) 8 Vibration 9 C0459800
comment: Equipment/Device/Tool/Questionnaire Questionnaire None 1 MD05034 2 Vibration 3 None 4 Vibration 5 33679000 6 Vibration 7 Vibration (physical force) 8 Vibration 9 C0459800
comment: Units None None 1 MD02321 2 Vibration 3 None 4 vibration 5 33679000 6 Vibration 7 Vibration (physical force) 8 Vibration 9 C0459800

Vibration site
type: Class
subclass of: Questionnaire
comment: 1 MD05037 2 Vibration site 3 None 4 Vibration site 5 10546003 6 Site 7 Site (attribute) 8 Site 9 C0205145

Video Analysis for Upper Limb Prosthesis use
type: Class
subclass of: Questionnaire
comment: 1 MD04450 2 Video Analysis for Upper Limb Prosthesis use 3 None 4 Video Analysis for Upper Limb Prosthesis use 5 257194007 6 Video 7 Video (physical object) 8 Video imaging 9 C1299527

Video material
type: Class
subclass of: Equipment
comment: 1 MD04881 2 Video material 3 None 4 Video material 5 257194007 6 Video 7 Video (physical object) 8 Video Media 9 C3463807

Video material availability
type: Class
subclass of: Questionnaire
comment: 1 MD04880 2 Video material availability 3 None 4 Video material availability 5 257194007 6 Video 7 Video (physical object) 8 Video Media 9 C3463807

Video shooting of the basic movement
type: Class
subclass of: Hospital information, examination/diagnosis/treatment data
comment: 1 MD04452 2 Video shooting of the basic movement 3 None 4 Video shooting of the basic movement 5 371576000 6 Video imaging procedure 7 Video imaging procedure (procedure) 8 Video imaging 9 C1299527

Video shooting of the basic movement of the annular upper extremity
type: Class
subclass of: Hospital information, examination/diagnosis/treatment data
comment: 1 MD04451 2 Video shooting of the basic movement of the annular upper extremity 3 None 4 Video shooting of the basic movement of the annular upper extremity 5 371576000 6 Video imaging procedure 7 Video imaging procedure (procedure) 8 Video imaging 9 C1299527

Vision care
type: Class
subclass of: Health Related Factors
comment: 1 M01702 2 Vision care 3 care vision 4 Vision care 5 386243005 6 Vision care 7 Vision therapy (regime/therapy) 8 Vision care 9 C0150177
alternative label: care vision

Vision therapy
type: Class
subclass of: Sensory function, Pain and Skin function (Therapy)
comment: 1 M00593 2 Vision therapy 3 None 4 Vision therapy 5 386243005 6 Vision therapy 7 Vision therapy (regime/therapy) 8 Vision therapy 9 C0150177
alternative label: therapy vision

Visual acuity functions
type: Class
subclass of: Sensory function, Pain and Skin function (Body measurement)
comment: 1 MD05731 2 Visual acuity functions 3 None 4 Visual acuity functions 5 363983007 6 visual acuity 7 Visual acuity (observable entity) 8 Visual acuity functions 9 C2370927

Visual field functions
type: Class
subclass of: Sensory function, Pain and Skin function (Body measurement)
comment: 1 MD05738 2 Visual field functions 3 None 4 Visual field functions 5 830129007 6 normal visual field 7 Normal visual field (finding) 8 Visual field functions 9 C2370928

Visual perception
type: Class
subclass of: Nervous system and Mental function (Body measurement)
comment: 1 MD05673 2 Visual perception 3 None 4 Visual perception 5 311886005 6 Visual perception 7 Visual perception, function (observable entity) 8 Visual perception 9 C0042830

Visual picture quality
type: Class
subclass of: Sensory function, Pain and Skin function (Body measurement)
comment: 1 MD05743 2 Visual picture quality 3 None 4 Visual picture quality 5 246646005 6 quality of visual image 7 Quality of visual image (observable entity) 8 Visual picture quality 9 C2370929

Visuospatial perception
type: Class
subclass of: Nervous system and Mental function (Body measurement)
comment: 1 MD05677 2 Visuospatial perception 3 None 4 Visuospatial perception 5 311886005 6 Visual perception 7 Visual perception, function (observable entity) 8 Visuospatial perception 9 C2370887
comment: 1 MD05677-1 2 Visuospatial perception 3 None 4 Visuospatial perception 5 81742003 6 Perception 7 Perception function (observable entity) 8 Visuospatial perception 9 C2370887

Vital sign
type: Class
subclass of: Hospital information, examination/diagnosis/treatment data
comment: 1 M00149 2 Vital sign 3 Vital signs 4 Vital sign 5 118227000 6 Vital signs finding 7 Vital signs finding (finding) 8 Vital signs 9 C0518766
alternative label: Vital signs

Vitamin B12
type: Class
subclass of: Nutritional management
comment: 1 MD01703 2 Vitamin B12 3 None 4 Vitamin B12 5 419382002 6 Vitamin B12 7 Cyanocobalamin (substance) 8 Vitamin B12 9 C0042845

Vitamin B6
type: Class
subclass of: Nutritional management
comment: 1 MD01702 2 Vitamin B6 3 None 4 Vitamin B6 5 103069003 6 Vitamin B and/or vitamin B derivative 7 Vitamin B and/or vitamin B derivative (substance) 8 vitamin B6 9 C0087162

Vitamin D
type: Class
subclass of: Nutritional management
comment: 1 MD01705 2 Vitamin D 3 None 4 Vitamin D 5 30178006 6 Vitamin D and/or vitamin D derivative 7 Vitamin D and/or vitamin D derivative (substance) 8 vitamin D 9 C0042866

Vitamin E
type: Class
subclass of: Nutritional management
comment: 1 MD01706 2 Vitamin E 3 None 4 Vitamin E 5 37237003 6 Vitamin E and/or vitamin E derivative 7 Vitamin E and/or vitamin E derivative (substance) 8 vitamin E 9 C0042874

Vitamin K
type: Class
subclass of: Nutritional management
comment: 1 MD01707 2 Vitamin K 3 None 4 Vitamin K 5 65183007 6 Vitamin K and/or vitamin K derivative 7 Vitamin K and/or vitamin K derivative (substance) 8 vitamin K 9 C0042878

Vitreous body
type: Class
subclass of: Sensory function, Pain and Skin function (Body region)
comment: 1 MD06863 2 Vitreous body 3 None 4 Vitreous body 5 47538007 6 Vitreous body 7 Vitreous body structure (body structure) 8 Vitreous body 9 C0042905

Vocal folds
type: Class
subclass of: Voice and Speaking (Body region)
comment: 1 MD06917 2 Vocal folds 3 None 4 Vocal folds 5 46105003 6 vocal fold 7 Vocal cord structure (body structure) 8 Vocal folds 9 C0042930

Vocational rehabilitation
type: Class
subclass of: Musculoskeletal function (Therapy)
comment: 1 M00623 2 Vocational rehabilitation 3 VOCATIONAL REHABIL Vocational rehabilitat Vocational Rehabilitations REHABIL VOCATIONAL 4 Vocational rehabilitation 5 70082004 6 Vocational rehabilitation 7 Vocational rehabilitation (regime/therapy) 8 Vocational rehabilitation 9 C0034996
alternative label: Vocational Rehabilitations
alternative label: REHABIL VOCATIONAL
alternative label: Vocational rehabilitat
alternative label: VOCATIONAL REHABIL

Vocational training
type: Class
subclass of: Individual Related Factors
comment: 1 MD06514 2 Vocational training 3 None 4 Vocational training 5 54106008 6 Vocational training 7 Vocational training (procedure) 8 Vocational training 9 C0204116

Voice Disorder
type: Class
subclass of: Voice and Speaking (Symptom)
comment: 1 M01578 2 Voice Disorder 3 Voice Disorders, VOICE DIS, Vocal disorders, Disorder of voice 4 Voice Disorder 5 16617009 6 Disorder of voice 7 Dysphonia (disorder) 8 Voice Disorders 9 C0042940
alternative label: Disorder of voice
alternative label: Vocal disorders
alternative label: VOICE DIS
alternative label: Voice Disorders

Voice functions
type: Class
subclass of: Voice and Speaking (Body measurement)
comment: 1 MD05813 2 Voice functions 3 None 4 Voice functions 5 415825004 6 Vocal function 7 Vocal function (observable entity) 8 Voice functions 9 C0541586

Voice impairment
type: Class
subclass of: Voice and Speaking (Symptom)
comment: 1 M01582 2 Voice impairment 3 None 4 Voice impairment 5 16617009 6 Voice impairment 7 Dysphonia (disorder) 8 Voice impairment 9 C1527340

Voice problem
type: Class
subclass of: Voice and Speaking (Symptom)
comment: 1 M00592 2 Voice problem 3 None 4 Voice problem 5 16617009 6 Disorder of voice 7 Dysphonia (disorder) 8 Voice Disorders 9 C0042940

Volleyball
type: Class
subclass of: Sport
comment: 1 M00448 2 Volleyball 3 Volleyballs 4 Volleyball 5 56235009 6 Exercise 7 Exercise (observable entity) 8 Volleyball 9 C1956059
alternative label: Volleyballs

Volt
type: Class
subclass of: Units
comment: 1 M04357 2 Volt 3 V - volt volts V 4 Volt 5 473019004 6 volt 7 volt (qualifier value) 8 volt 9 C0439502
alternative label: volts
alternative label: V
alternative label: V - volt

Volume-Volume Percentage
type: Class
subclass of: Units
comment: 1 M04573 2 Volume-Volume Percentage 3 v/v %V/V percent Volume per Volume volume/volume ratio Percent Volume/Volume 4 Volume-Volume Percentage 5 767525000 6 unit 7 Unit (qualifier value) 8 Unit 9 C0439155
alternative label: %V/V
alternative label: volume/volume ratio
alternative label: v/v
alternative label: Percent Volume/Volume
alternative label: Percent Volume per Volume

Volume Percent
type: Class
subclass of: Units
comment: 1 M04576 2 Volume Percentage 3 None 4 Volume Percent 5 767525000 6 unit 7 Unit (qualifier value) 8 Unit 9 C0439149

Volume Percentage
type: Class
subclass of: Units
comment: 1 M04575 2 Volume Percentage 3 Volume Percent 4 Volume Percentage 5 767525000 6 unit 7 Unit (qualifier value) 8 Unit 9 C0439148

Volume per unit mass
type: Class
subclass of: Units
comment: 1 M03326 2 Volume per unit mass 3 None 4 Volume per unit mass 5 396179009 6 Volume per unit mass 7 Volume per unit mass (qualifier value) 8 Volume per unit mass 9 C1300573

Volume per unit time per unit area
type: Class
subclass of: Units
comment: 1 M03182 2 Volume per unit time per unit area 3 None 4 Volume per unit time per unit area 5 282395003 6 Volume per unit time per unit area 7 Volume per unit time per unit area (qualifier value) 8 Volume per unit time per unit area 9 C0560280

Vulvovaginal Region
type: Class
subclass of: Urogenital function (Body region)
comment: 1 M01097 2 Vulvovaginal Region 3 None 4 Vulvovaginal Region 5 738989005 6 Vaginal 7 Vaginal (intended site) 8 Vulvovaginal Region 9 C2986553

http://www.semanticweb.org/user/ontologies/2023/10/untitled-ontology-5#W
type: Class
subclass of: Units
comment: 1 M03821 2 W 3 None 4 W 5 258001008 6 w 7 Lower case Roman letter w (qualifier value) 8 W 9 C0439121
comment: 1 M03821-1 2 W 3 None 4 W 5 258001008 6 w 7 Lower case Roman letter w (qualifier value) 8 w 9 C0439146
comment: 1 M03821-2 2 W 3 None 4 W 5 257978001 6 W 7 Upper case Roman letter W (qualifier value) 8 W 9 C0439121
comment: 1 M03821-3 2 W 3 None 4 W 5 257978001 6 W 7 Upper case Roman letter W (qualifier value) 8 w 9 C0439146

WEIGHT DECREASE
type: Class
subclass of: Hospital information, examination/diagnosis/treatment data
comment: 1 M01623 2 WEIGHT DECREASE 3 Weight decreased Weight decreasing Weight Reduction decrease weight decreased weight decreases weight reduction weight Weight Reductions Decreased body weight 4 WEIGHT DECREASE 5 262285001 6 Weight decreased 7 Weight decreased (finding) 8 Weight decreased 9 C1262477
alternative label: decreased weight
alternative label: decrease weight
alternative label: reduction weight
alternative label: Weight Reduction
alternative label: Weight decreased
alternative label: Weight decreasing
alternative label: Decreased body weight
alternative label: Weight Reductions
alternative label: decreases weight

WORKOUTS
type: Class
subclass of: Aerobic Exercise
comment: 1 MD01993 2 WORKOUTS 3 workout 4 WORKOUTS 5 256235009 6 Exercise 7 Exercise (observable entity) 8 Exercise 9 C0015259
alternative label: workout

Wafer
type: Class
subclass of: Units
comment: 1 M03478 2 Wafer 3 Wafer Dosing Unit 4 Wafer 5 1701000175103 6 Wafer 7 Wafer - unit of product usage (qualifier value) 8 Wafer Dosing Unit 9 C1706425

Wafer Dosing Unit
type: Class
subclass of: Units
comment: 1 M05316 2 Wafer Dosing Unit 3 Wafer 4 Wafer Dosing Unit 5 1701000175103 6 Wafer 7 Wafer - unit of product usage (qualifier value) 8 Wafer Dosing Unit 9 C1706425

Waist
type: Class
subclass of: Hospital information, examination/diagnosis/treatment data
comment: 1 M01116 2 Waist 3 None 4 Waist 5 33673004 6 Waist 7 Structure of waist (surface region) (body structure) 8 Structure of waist (surface region) 9 C0230097

Waist circumference
type: Class
subclass of: Digestive function (Body measurement)
comment: 1 MD00742 2 Waist circumference 3 None 4 Waist circumference 5 276361009 6 Waist circumference 7 Waist circumference (observable entity) 8 Waist circumference 9 C0455829

Wakeboarding
type: Class
subclass of: Sport
comment: 1 MD01085 2 Wakeboarding 3 None 4 Wakeboarding 5 14468000 6 Sports 7 Sports activity (observable entity) 8 Sports 9 C0038039
comment: 1 MD01085-1 2 Wakeboarding 3 None 4 Wakeboarding 5 415577004 6 Sport 7 Sport (qualifier value) 8 Sports 9 C0038039
comment: 1 MD01085-2 2 Wakeboarding 3 None 4 Wakeboarding 5 415577004 6 sports 7 Sport (qualifier value) 8 Activity, water skiing and wake boarding 9 C2712394

Walk
type: Class
subclass of: Health Related Factors
comment: 1 M01660 2 Walk 3 walking 4 Walk 5 282146009 6 Walks 7 Does walk (finding) 8 Walking (activity) 9 C0080331

Walker
type: Class
subclass of: Equipment
comment: 1 MD04376 2 Walker 3 None 4 Walker 5 705406009 6 Walker 7 Walker (physical object) 8 Walker 9 C0043016

Walkertracker
type: Class
subclass of: Units
comment: 1 M05774 2 Walkertracker 3 None 4 Walkertracker 5 413568008 6 Application - unit of product usage (qualifier value) 7 Application - unit of product usage (qualifier value) 8 Application dose 9 C1533134

Walking Training Assistance Tools
type: Class
subclass of: Tool
comment: 1 MD04342 2 Walking Training Assistance Tools 3 None 4 Walking Training Assistance Tools 5 705403001 6 Walking assistive device 7 Walking assistive device (physical object) 8 Walking assistive device 9 C3874140

Walking and standing repeatedly
type: Class
subclass of: Health Related Factors
comment: 1 MD05056 2 Walking and standing repeatedly 3 None 4 Walking and standing repeatedly 5 27582007 6 Repeat 7 Repeat (qualifier value) 8 Repeat 9 C0205341

Walking around obstacles
type: Class
subclass of: Aerobic Exercise
comment: 1 MD06336 2 Walking around obstacles 3 None 4 Walking around obstacles 5 870595007 6 Walking 7 Walking (qualifier value) 8 Walking around obstacles 9 C2371422

Walking function test
type: Class
subclass of: Tool
comment: 1 MD04392 2 Walking function test 3 None 4 Walking function test 5 252480006 6 Simple walk test 7 Simple walk test (procedure) 8 Simple walk test 9 C0430517

Walking long distances
type: Class
subclass of: Aerobic Exercise
comment: 1 MD06334 2 Walking long distances 3 None 4 Walking long distances 5 165263003 6 Walking distance 7 Walking distance (observable entity) 8 Walking long distances 9 C2371420

Walking on different surfaces
type: Class
subclass of: Aerobic Exercise
comment: 1 MD06335 2 Walking on different surfaces 3 None 4 Walking on different surfaces 5 870595007 6 Walking 7 Walking (qualifier value) 8 Walking on different surfaces 9 C2371421

Walking repeatedly
type: Class
subclass of: Health Related Factors
comment: 1 MD05057 2 Walking repeatedly 3 None 4 Walking repeatedly 5 27582007 6 Repeat 7 Repeat (qualifier value) 8 Repeat 9 C0205341

Walking short distances
type: Class
subclass of: Aerobic Exercise
comment: 1 MD06333 2 Walking short distances 3 None 4 Walking short distances 5 165263003 6 Walking distance 7 Walking distance (observable entity) 8 Walking short distances 9 C2371419

Walking speed
type: Class
subclass of: Units
comment: 1 MD03248 2 Walking speed 3 None 4 Walking speed 5 10904000 6 Gait speed 7 Orthostatic body position (finding) 8 walking speed 9 C2009910

Walks more than 50 metres. Independent of walking aids except occasionally for confidence or to improve confidence in adverse terrain or weather
type: Class
subclass of: Questionnaire
comment: 1 MD04782 2 Walks more than 50 metres. Independent of walking aids except occasionally for confidence or to improve confidence in adverse terrain or weather 3 None 4 Walks more than 50 metres. Independent of walking aids except occasionally for confidence or to improve confidence in adverse terrain or weather 5 165245003 6 Independent walking 7 Independent walking (finding) 8 Independent walking 9 C0429979

Warmup
type: Class
subclass of: Conditioning exercise
comment: 1 MD02029 2 Warmup 3 warm-up 4 Warmup 5 277132007 6 Therapeutic procedure 7 Therapeutic procedure (procedure) 8 Warm-Up Exercise 9 C2350169
alternative label: warm-up
alternative label: Warm-up
alternative label: warm up

Wash
type: Class
subclass of: Health Related Factors
comment: 1 MD04225 2 Wash 3 Washing 4 Wash 5 422152000 6 Wash 7 Wash - dosing instruction imperative (qualifier value) 8 Wash 9 C1547959
alternative label: washing

Washing and drying clothes and garments
type: Class
subclass of: Health Related Factors
comment: 1 MD06429 2 Washing and drying clothes and garments 3 None 4 Washing and drying clothes and garments 5 272180002 6 Clothes 7 Garment (physical object) 8 Washing and drying clothes and garments 9 C2371498

Washing body parts
type: Class
subclass of: Health Related Factors
comment: 1 MD06372 2 Washing body parts 3 None 4 Washing body parts 5 286088001 6 washing-up 7 Does washing-up (finding) 8 Washing body parts 9 C2371454

Washing oneself
type: Class
subclass of: Health Related Factors
comment: 1 MD06371 2 Washing oneself 3 None 4 Washing oneself 5 286852005 6 Washing self 7 Washing self, function (observable entity) 8 Washing oneself 9 C2371453

Washing the laundry
type: Class
subclass of: Health Related Factors
comment: 1 MD05389 2 Washing the laundry 3 None 4 Washing the laundry 5 286050003 6 Washes laundry 7 Does wash laundry (finding) 8 Laundry 9 C1830412

Washing whole body
type: Class
subclass of: Health Related Factors
comment: 1 MD06373 2 Washing whole body 3 None 4 Washing whole body 5 286088001 6 washing-up 7 Does washing-up (finding) 8 Washing whole body 9 C2371455

Watching
type: Class
subclass of: Health Related Factors
comment: 1 MD06115 2 Watching 3 None 4 Watching 5 225415001 6 Close watch 7 Close observation (regime/therapy) 8 Watching 9 C2371283

Watching kids
type: Class
subclass of: Health Related Factors
comment: 1 MD05412 2 Watching kids 3 None 4 Watching kids 5 225415001 6 Close watch 7 Close observation (regime/therapy) 8 Behavior 9 C0004927

Water aerobics
type: Class
subclass of: Sport
comment: 1 M00451 2 Water aerobics 3 aquarobics, Waterobics 4 Water aerobics 5 229072005 6 Aerobic exercises 7 Aerobic exercises (regime/therapy) 8 doing water aerobics 9 C2136115
alternative label: Waterobics
alternative label: aquarobics

Water aerobics and water exercise
type: Class
subclass of: Conditioning exercise
comment: 1 M028462 2 Water aerobics and water exercise 3 Water aerobics/exercise 4 Water aerobics and water exercise 5 226029000 6 Exercises 7 Exercises (regime/therapy) 8 Activity, water aerobics and water exercise 9 C2712391
alternative label: Water aerobics/exercise

Water balance
type: Class
subclass of: Functions of Blood System, Metabolic system and Endocrine system (Body measurement)
comment: 1 MD05956 2 Water balance 3 None 4 Water balance 5 16379007 6 Water-electrolyte balance 7 Water-electrolyte balance, function (observable entity) 8 Water balance 9 C0016284

Water ball
type: Class
subclass of: Equipment
comment: 1 M05887 2 Water ball 3 None 4 Water ball 5 86967005 6 Tool 7 Tool, device (physical object) 8 Ball Device 9 C1706910

Water hammer pulse
type: Class
subclass of: Cardiovascular system function (Symptom)
comment: 1 M01904 2 Water hammer pulse 3 None 4 Water hammer pulse 5 44922000 6 Water hammer pulse 7 Collapsing pulse (finding) 8 Water hammer pulse 9 C0232123

Water polo
type: Class
subclass of: Sport
comment: 1 M00452 2 Water polo 3 None 4 Water polo 5 229179004 6 Arm exercises in water 7 Upper limb exercises in water (regime/therapy) 8 Water Polo 9 C2712390
comment: 1 M00452-1 2 Water polo 3 None 4 Water polo 5 14468000 6 Sports 7 Sports activity (observable entity) 8 Water Polo 9 C2712390

Water retention
type: Class
subclass of: Functions of Blood System, Metabolic system and Endocrine system (Body measurement)
comment: 1 MD05957 2 Water retention 3 None 4 Water retention 5 36850000 6 Retention 7 Retention (morphologic abnormality) 8 Water retention 9 C2584327

Water volleyball
type: Class
subclass of: Sport
comment: 1 M00453 2 Water volleyball 3 None 4 Water volleyball 5 229179004 6 Arm exercises in water 7 Upper limb exercises in water (regime/therapy) 8 Volleyball 9 C1956059

Waterpolo
type: Class
subclass of: Sport
comment: 1 MD01089 2 Waterpolo 3 None 4 Waterpolo 5 14468000 6 Sports 7 Sports activity (observable entity) 8 Sports 9 C0038039
comment: 1 MD01089-1 2 Waterpolo 3 None 4 Waterpolo 5 415577004 6 Sport 7 Sport (qualifier value) 8 Sports 9 C0038039

Watt second
type: Class
subclass of: Units
comment: 1 M02929 2 Watt second 3 None 4 Watt second 5 258788007 6 kilojoule 7 kilojoule (qualifier value) 8 Joule, Unit of energy 9 C0439256

Weakness
type: Class
subclass of: Nervous system and Mental function (Symptom)
comment: 1 M00525 2 Weakness 3 None 4 Weakness 5 13791008 6 Weakness 7 Asthenia (finding) 8 Weakness 9 C3714552
alternative label: weaknesses

Weakness of face muscles
type: Class
subclass of: Musculoskeletal function (Symptom)
comment: 1 M02333 2 Weakness of face muscles 3 Weakness of the facial muscles Facial muscle weakness facial muscles weakness 4 Weakness of face muscles 5 95666008 6 Weakness of face muscles 7 Weakness of face muscles (finding) 8 Facial Paresis 9 C0427055
alternative label: Weakness of the facial muscles
alternative label: Facial muscle weakness

Wearing
type: Class
subclass of: Health Related Factors
comment: 1 MD04456 2 Wearing 3 weariness 4 wearing 5 129003000 6 Dressing 7 Dressing (observable entity) 8 Dressing- activity of daily living 9 C1305428
comment: 1 MD04456-1 2 Wearing 3 weariness 4 Wearing 5 844005 6 Behavior finding 7 Behavior finding (finding) 8 Behavior 9 C0004927
alternative label: Weariness

Wearing clothes
type: Class
subclass of: Health Related Factors
comment: 1 MD04557 2 Wearing clothes 3 None 4 Wearing clothes 5 844005 6 Behavior finding 7 Behavior finding (finding) 8 Behavior 9 C0004927

Wearing of assist device
type: Class
subclass of: Equipment
comment: 1 MD04379 2 Wearing of assist device 3 None 4 Wearing of assist device 5 1141802005 6 Assistive device 7 Assistive device (physical object) 8 device 9 C0699733

Weber
type: Class
subclass of: Units
comment: 1 M04694 2 Weber 3 Wb 4 Weber 5 304620006 6 weber 7 weber (qualifier value) 8 weber 9 C0582525
alternative label: Wb

Wednesday
type: Class
subclass of: Day
comment: 1 MD01987 2 Wednesday 3 None 4 Wednesday 5 307148002 6 Wednesday 7 Wednesday (qualifier value) 8 Wednesday 9 C0585027

Week
type: Class
subclass of: Units
comment: 1 M03775 2 Week 3 Weeks wk 4 Week 5 258705008 6 week 7 week (qualifier value) 8 week 9 C0439230

Weekly
type: Class
subclass of: Units
comment: 1 M03633 2 Weekly 3 per week /week Every week QS 4 Weekly 5 14497002 6 Weekly 7 Weekly (qualifier value) 8 Weekly 9 C0332174

Weighing date
type: Class
subclass of: Day
comment: 1 MD00880 2 Weighing date 3 None 4 Weighing date 5 439771001 6 Date of event 7 Date of event (observable entity) 8 Date of event 9 C2585732

Weight-Volume Percentage
type: Class
subclass of: Units
comment: 1 M03174 2 Weight-Volume Percentage 3 w/v %w/v %W/V 4 Weight-Volume Percentage 5 282379003 6 w/v 7 Weight/volume ratio (qualifier value) 8 w/v 9 C0560267
alternative label: %W/V
alternative label: w/v
alternative label: %w/v

Weight Percent
type: Class
subclass of: Units
comment: 1 M05332 2 Weight Percent 3 None 4 Weight Percent 5 767525000 6 unit 7 Unit (qualifier value) 8 Unit 9 C0439180

Weight Training
type: Class
subclass of: Muscle Strengthening Exercise
comment: 1 M01607 2 Weight Training 3 None 4 Weight Training 5 118629009 6 Training 7 Functional training (procedure) 8 Weight Lifting 9 C0043095
comment: 1 M01607-1 2 Weight Training 3 None 4 Weight Training 5 118629009 6 Training 7 Functional training (procedure) 8 Training 9 C0220931

Weight gain
type: Class
subclass of: Hospital information, examination/diagnosis/treatment data
comment: 1 M00526 2 Weight gain 3 gain weight gain wt gained weight gaining wt gains weight weight gaining Weight Gains wt gain 4 Weight gain 5 8943002 6 Weight gain 7 Weight gain (finding) 8 Weight gain 9 C0043094
comment: 1 M00526-1 2 Weight gain 3 gain weight gain wt gained weight gaining wt gains weight weight gaining Weight Gains wt gain 4 Weight gain 5 816159004 6 Weight gain 7 Measured weight gain (observable entity) 8 Weight gain 9 C0043094
alternative label: gained weight
alternative label: Weight Gains
alternative label: gaining wt
alternative label: gains weight
alternative label: gain wt
alternative label: gain weight
alternative label: wt gain
alternative label: weight gaining

Weight maintenance functions
type: Class
subclass of: Digestive function (Body measurement)
comment: 1 MD05940 2 Weight maintenance functions 3 None 4 Weight maintenance functions 5 388962008 6 Weight maintenance regimen 7 Weight maintenance regimen (regime/therapy) 8 Weight maintenance functions 9 C2371134

Weightlifting
type: Class
subclass of: Sport
comment: 1 M00454 2 Weightlifting 3 Weight Liftings, lifting weights, lifting weight 4 Weightlifting 5 258141001 6 Lifting 7 Lifting (observable entity) 8 Weight Lifting 9 C0043095
comment: 1 MD01090 2 Weightlifting 3 Weight Liftings, lifting weights, lifting weight 4 Weightlifting 5 14468000 6 Sports 7 Sports activity (observable entity) 8 Sports 9 C0038039
comment: 1 MD01090-1 2 Weightlifting 3 Weight Liftings, lifting weights, lifting weight 4 Weightlifting 5 415577004 6 Sport 7 Sport (qualifier value) 8 Sports 9 C0038039
alternative label: lifting weights
alternative label: lifting weight
alternative label: Weight Liftings

Wheelchair
type: Class
subclass of: Equipment
comment: 1 MD01091 2 Wheelchair 3 None 4 Wheelchair 5 58938008 6 Wheelchair 7 Wheelchair device (physical object) 8 Wheelchair 9 C0043143

Wheelchair Speed
type: Class
subclass of: Units
comment: 1 MD03141 2 Wheelchair Speed 3 None 4 Wheelchair Speed 5 870597004 6 Speed 7 Distance per time (property) (qualifier value) 8 Speed 9 C0678536

Wheeze
type: Class
subclass of: Respiratory function (Symptom)
comment: 1 M01634 2 Wheeze 3 Wheezing wheezes Wheezy Wheezings wheezing 4 Wheeze 5 56018004 6 Wheeze 7 Wheezing (finding) 8 Wheeze 9 C0043144
alternative label: wheezing
alternative label: Wheezy
alternative label: Wheezings
alternative label: wheezes
alternative label: Wheezing

Whistling exercises
type: Class
subclass of: Active exercise
comment: 1 M00278 2 Whistling exercises 3 None 4 Whistling exercises 5 229129002 6 Whistling exercises 7 Whistling exercises (regime/therapy) 8 Whistling exercises 9 C0454339

White Blood Cell
type: Class
subclass of: Functions of Blood System, Metabolic system and Endocrine system (Body measurement)
comment: 1 MD03061 2 White Blood Cell 3 None 4 White Blood Cell 5 52501007 6 White blood cell 7 Leukocyte (cell) 8 White blood cell 9 C0023516

Wide pupil
type: Class
subclass of: Sensory function, Pain and Skin function (Symptom)
comment: 1 M01241 2 Wide pupil 3 None 4 Wide pupil 5 37125009 6 Wide pupil 7 Dilated pupil (finding) 8 Mydriasis 9 C0026961

Wind
type: Class
subclass of: Physical/Chemical Environment
comment: 1 MD06655 2 Wind 3 None 4 Wind 5 90569008 6 Wind 7 Wind (event) 8 Wind 9 C0043187

Windsurfing
type: Class
subclass of: Sport
comment: 1 MD01092 2 Windsurfing 3 wheelchair 4 Windsurfing 5 14468000 6 Sports 7 Sports activity (observable entity) 8 Sports 9 C0038039
comment: 1 MD01092-1 2 Windsurfing 3 wheelchair 4 Windsurfing 5 415577004 6 Sport 7 Sport (qualifier value) 8 Sports 9 C0038039
alternative label: wind surfing

Withings Health Mate
type: Class
subclass of: Units
comment: 1 M05775 2 Withings Health Mate 3 None 4 Withings Health Mate 5 413568008 6 Application - unit of product usage (qualifier value) 7 Application - unit of product usage (qualifier value) 8 Application dose 9 C1533134

Work in draft
type: Class
subclass of: Questionnaire
comment: 1 MD05020 2 Work in draft 3 None 4 Work in draft 5 261041009 6 Working 7 Working, function (observable entity) 8 work 9 C0043227

Work with loud noise
type: Class
subclass of: Questionnaire
comment: 1 MD05029 2 Work with loud noise 3 None 4 Work with loud noise 5 261041009 6 Working 7 Working, function (observable entity) 8 work 9 C0043227

Working environment
type: Class
subclass of: Physical/Chemical Environment
comment: 1 MD04985 2 Working environment 3 None 4 Working environment 5 285141008 6 Work environment 7 Work environment (environment) 8 Environment 9 C0014406

Working hours
type: Class
subclass of: Hour
comment: 1 MD04934 2 Working hours 3 None 4 Working hours 5 258702006 6 hour 7 hour (qualifier value) 8 Hour 9 C0439227

Working memory
type: Class
subclass of: Nervous system and Mental function (Body measurement)
comment: 1 MD05657 2 Working memory 3 None 4 Working memory 5 303116000 6 Memory function 7 Memory function (observable entity) 8 Memory functions 9 C0025260

Working on a moving machine
type: Class
subclass of: Questionnaire
comment: 1 MD04999 2 Working on a moving machine 3 None 4 Working on a moving machine 5 261041009 6 Working 7 Working, function (observable entity) 8 work 9 C0043227

Working on scaffolding or ladders
type: Class
subclass of: Questionnaire
comment: 1 MD05003 2 Working on scaffolding or ladders 3 None 4 Working on scaffolding or ladders 5 261041009 6 Working 7 Working, function (observable entity) 8 work 9 C0043227

Working under artificial lighting
type: Class
subclass of: Questionnaire
comment: 1 MD05012 2 Working under artificial lighting 3 None 4 Working under artificial lighting 5 261041009 6 Working 7 Working, function (observable entity) 8 work 9 C0043227

Workout status
type: Class
subclass of: Anatomic part
comment: 1 MD01880 2 Wokout status 3 None 4 Workout status 5 413172004 6 Exercise monitoring status 7 Exercise monitoring status (finding) 8 Exercise monitoring status 9 C1446280

Worried
type: Class
subclass of: Nervous system and Mental function (Symptom)
comment: 1 M05845 2 Worried, Worrying, Worrisome mood 3 None 4 Worried 5 79015004 6 Worried 7 Worried (finding) 8 Worried 9 C0233481

Worrisome mood
type: Class
subclass of: Nervous system and Mental function (Symptom)
comment: 1 M05840 2 Worried, Worrying, Worrisome mood 3 None 4 Worrisome mood 5 79015004 6 Worry 7 Worried (finding) 8 Worried 9 C0233481

Worry
type: Class
subclass of: Nervous system and Mental function (Symptom)
comment: 1 M05843 2 Worried, Worrying, Worrisome mood 3 None 4 Worry 5 79015004 6 Worry 7 Worried (finding) 8 Worry 9 C0233481

Worrying
type: Class
subclass of: Nervous system and Mental function (Symptom)
comment: 1 M05842 2 Worried, Worrying, Worrisome mood 3 None 4 Worrying 5 79015004 6 Worrying 7 Worried (finding) 8 Worrying 9 C0233481

Wrist exercises
type: Class
subclass of: Limb
comment: 1 M00325 2 Wrist exercises 3 wrist exercise, exercises wrist, exercise wrists 4 Wrist exercises 5 229117006 6 Wrist exercises 7 Wrist exercises (regime/therapy) 8 Wrist exercises 9 C0454328
alternative label: wrist exercise
alternative label: exercise wrists
alternative label: exercises wrist

Wrist exercises in water
type: Class
subclass of: Active exercise
comment: 1 M00326 2 Wrist exercises in water 3 None 4 Wrist exercises in water 5 229183004 6 Wrist exercises in water 7 Wrist exercises in water (regime/therapy) 8 Wrist exercises in water 9 C0454392

Wrist joint
type: Class
subclass of: Musculoskeletal function (Body region)
comment: 1 MD07037 2 Wrist joint 3 None 4 Wrist joint 5 74670003 6 Wrist joint 7 Structure of radiocarpal joint (body structure) 8 Wrist joint 9 C0043265
comment: 1 MD07037-1 2 Wrist joint 3 None 4 Wrist joint 5 74670003 6 Wrist joint 7 Structure of radiocarpal joint (body structure) 8 Wrist joint 9 C1322271

Writing a letter
type: Class
subclass of: Health Related Factors
comment: 1 MD05455 2 Writing a letter 3 None 4 Writing a letter 5 12261009 6 Writing 7 Writing (observable entity) 8 Writing 9 C2584304

Writing messages
type: Class
subclass of: Health Related Factors
comment: 1 MD06250 2 Writing messages 3 None 4 Writing messages 5 12261009 6 Writing 7 Writing (observable entity) 8 Writing messages 9 C2371354

Writing therapy
type: Class
subclass of: Musculoskeletal function (Therapy)
comment: 1 M00594 2 Writing therapy 3 None 4 Writing therapy 5 430871004 6 Writing therapy 7 Writing therapy (regime/therapy) 8 Writing therapy 9 C2316916

http://www.semanticweb.org/user/ontologies/2023/10/untitled-ontology-5#X
type: Class
subclass of: Units
comment: 1 M05270 2 X 3 None 4 X 5 257979009 6 X 7 Upper case Roman letter X (qualifier value) 8 X 9 C0439122
comment: 1 M05270-1 2 X 3 None 4 X 5 257979009 6 X 7 Upper case Roman letter X (qualifier value) 8 x 9 C0441950
comment: 1 M05270-2 2 X 3 None 4 X 5 421806008 6 x 7 Lower case Roman letter x (qualifier value) 8 X 9 C0439122
comment: 1 M05270-3 2 X 3 None 4 X 5 421806008 6 x 7 Lower case Roman letter x (qualifier value) 8 x 9 C0441950

X-ray
type: Class
subclass of: Hospital information, examination/diagnosis/treatment data
comment: 1 MD03031 2 X-ray 3 None 4 X-ray 5 52250000 6 X-ray 7 X-ray electromagnetic radiation (physical force) 8 X-ray 9 C0043309
comment: 1 MD03031-1 2 X-ray 3 None 4 X-ray 5 52250000 6 X-ray 7 X-ray electromagnetic radiation (physical force) 8 X-ray 9 C1962945
comment: 1 MD03031-2 2 X-ray 3 None 4 X-ray 5 363680008 6 X-ray 7 Radiographic imaging procedure (procedure) 8 X-ray 9 C0043309
comment: 1 MD03031-3 2 X-ray 3 None 4 X-ray 5 363680008 6 X-ray 7 Radiographic imaging procedure (procedure) 8 X-ray 9 C1962945

X4
type: Class
subclass of: Units
comment: 1 M04840 2 X4 3 None 4 X4 5 404218003 6 Drop - unit of product usage 7 Drop - unit of product usage (qualifier value) 8 Drop Dosing Unit 9 C1321095

Yard
type: Class
subclass of: Units
comment: 1 M03736 2 Yard 3 yards yd 4 Yard 5 282123007 6 yard 7 cubic yard (qualifier value) 8 Yard 9 C0439205
comment: 1 M03736-1 2 Yard 3 yards yd 4 Yard 5 282123007 6 yard 7 cubic yard (qualifier value) 8 yard 9 C0560016
comment: 1 M03736-2 2 Yard 3 yards yd 4 Yard 5 258679005 6 Yard 7 Yard (qualifier value) 8 Yard 9 C0439205
comment: 1 M03736-3 2 Yard 3 yards yd 4 Yard 5 258679005 6 Yard 7 Yard (qualifier value) 8 yard 9 C0560016
alternative label: yd

Yard International
type: Class
subclass of: Units
comment: 1 M03735 2 Yard International 3 None 4 Yard International 5 282123007 6 yard 7 cubic yard (qualifier value) 8 Yard 9 C0439205

Yard US
type: Class
subclass of: Units
comment: 1 M03734 2 Yard US 3 None 4 Yard US 5 282123007 6 yard 7 cubic yard (qualifier value) 8 Yard 9 C0439205

Year
type: Class
subclass of: Time patterns
comment: 1 M03782 2 Year 3 years, yr 4 Year 5 258707000 6 year 7 year (qualifier value) 8 year 9 C0439234
alternative label: years
alternative label: yr

Year of onset
type: Class
subclass of: Hospital information, examination/diagnosis/treatment data
comment: 1 MD00754 2 Year of onset 3 None 4 Year of onset 5 370139004 6 onsets 7 Onsets (qualifier value) 8 Year of Onset 9 C3274945

Yoctogram per Attogram
type: Class
subclass of: Units
comment: 1 M03859 2 Yoctogram per Attogram 3 yg/ag 4 Yoctogram per Attogram 5 767525000 6 Unit 7 Unit (qualifier value) 8 Unit 9 C0439148
alternative label: yg/ag

Yoctogram per Femtogram
type: Class
subclass of: Units
comment: 1 M05137 2 Yoctogram per Femtogram 3 yg/fg 4 Yoctogram per Femtogram 5 767525000 6 unit 7 Unit (qualifier value) 8 Unit 9 C0439171
alternative label: yg/fg

Yoctokatal per Attoliter
type: Class
subclass of: Units
comment: 1 M05376 2 Yoctokatal per Attoliter 3 ykat/aL 4 Yoctokatal per Attoliter 5 767525000 6 unit 7 Unit (qualifier value) 8 Unit 9 C0439190
alternative label: ykat/aL

Yoctomole per Attogram
type: Class
subclass of: Units
comment: 1 M03955 2 Yoctomole per Attogram 3 ymol/ag 4 Yoctomole per Attogram 5 767525000 6 Unit 7 Unit (qualifier value) 8 Unit 9 C0439148
alternative label: ymol/ag

Yoctomole per Femtoliter
type: Class
subclass of: Units
comment: 1 M03903 2 Yoctomole per Femtoliter 3 ymol/fL 4 Yoctomole per Femtoliter 5 767525000 6 Unit 7 Unit (qualifier value) 8 Unit 9 C0439148
alternative label: ymol/fL

Yoctomole per Nanoliter
type: Class
subclass of: Units
comment: 1 M03938 2 Yoctomole per Nanoliter 3 ymol/nL 4 Yoctomole per Nanoliter 5 767525000 6 Unit 7 Unit (qualifier value) 8 Unit 9 C0439148
alternative label: ymol/nL

Yoctomole per Picoliter
type: Class
subclass of: Units
comment: 1 M03920 2 Yoctomole per Picoliter 3 ymol/pL 4 Yoctomole per Picoliter 5 767525000 6 Unit 7 Unit (qualifier value) 8 Unit 9 C0439148
alternative label: ymol/pL

Yoctomole per Yoctogram
type: Class
subclass of: Units
comment: 1 M05544 2 Yoctomole per Yoctogram 3 ymol/yg 4 Yoctomole per Yoctogram 5 767525000 6 Unit 7 Unit (qualifier value) 8 Unit 9 C0439148
alternative label: ymol/yg

Yoctomole per Zeptogram
type: Class
subclass of: Units
comment: 1 M05562 2 Yoctomole per Zeptogram 3 ymol/zg 4 Yoctomole per Zeptogram 5 767525000 6 Unit 7 Unit (qualifier value) 8 Unit 9 C0439148
alternative label: ymol/zg

Yoga Therapy
type: Class
subclass of: Musculoskeletal function (Therapy)
comment: 1 M02833 2 Yoga Therapy 3 None 4 Yoga Therapy 5 1259940003 6 Yoga 7 Yoga medicine (qualifier value) 8 Yoga 9 C1883583

You can only turn it off and on
type: Class
subclass of: Questionnaire
comment: 1 MD05295 2 You can only turn it off and on 3 None 4 You can only turn it off and on 5 273389003 6 Daily activities questionnaire 7 Daily activities questionnaire (assessment scale) 8 Daily activities questionnaire 9 C0451094

You can put your stuff in the designated place and find it again without much help
type: Class
subclass of: Questionnaire
comment: 1 MD05301 2 You can put your stuff in the designated place and find it again without much help 3 None 4 You can put your stuff in the designated place and find it again without much help 5 273389003 6 Daily activities questionnaire 7 Daily activities questionnaire (assessment scale) 8 Daily activities questionnaire 9 C0451094

You choose what you need and pay the exact amount of money without the help of others
type: Class
subclass of: Questionnaire
comment: 1 MD05236 2 You choose what you need and pay the exact amount of money without the help of others 3 None 4 You choose what you need and pay the exact amount of money without the help of others 5 273389003 6 Daily activities questionnaire 7 Daily activities questionnaire (assessment scale) 8 questionnaire 9 C0034394

You have to be accompanied by someone to go out
type: Class
subclass of: Questionnaire
comment: 1 MD05267 2 You have to be accompanied by someone to go out 3 None 4 You have to be accompanied by someone to go out 5 273389003 6 Daily activities questionnaire 7 Daily activities questionnaire (assessment scale) 8 Daily activities questionnaire 9 C0451094

Zeo Sleep Manager
type: Class
subclass of: Units
comment: 1 M05776 2 Zeo Sleep Manager 3 None 4 Zeo Sleep Manager 5 413568008 6 Application - unit of product usage (qualifier value) 7 Application - unit of product usage (qualifier value) 8 Application dose 9 C1533134

Zeptogram per Femtogram
type: Class
subclass of: Units
comment: 1 M03858 2 Zeptogram per Femtogram 3 zg/fg 4 Zeptogram per Femtogram 5 767525000 6 Unit 7 Unit (qualifier value) 8 Unit 9 C0439148
alternative label: zg/fg

Zeptogram per Picogram
type: Class
subclass of: Units
comment: 1 M05136 2 Zeptogram per Picogram 3 zg/pg 4 Zeptogram per Picogram 5 767525000 6 unit 7 Unit (qualifier value) 8 Unit 9 C0439170
alternative label: zg/pg

Zeptokatal per Femtoliter
type: Class
subclass of: Units
comment: 1 M05375 2 Zeptokatal per Femtoliter 3 zkat/fL 4 Zeptokatal per Femtoliter 5 767525000 6 unit 7 Unit (qualifier value) 8 Unit 9 C0439190
alternative label: zkat/fL

Zeptomole per Attogram
type: Class
subclass of: Units
comment: 1 M05561 2 Zeptomole per Attogram 3 zmol/ag 4 Zeptomole per Attogram 5 767525000 6 Unit 7 Unit (qualifier value) 8 Unit 9 C0439148
alternative label: zmol/ag

Zeptomole per Femtogram
type: Class
subclass of: Units
comment: 1 M03954 2 Zeptomole per Femtogram 3 zg/fg 4 Zeptomole per Femtogram 5 767525000 6 Unit 7 Unit (qualifier value) 8 Unit 9 C0439148

Zeptomole per Femtoliter
type: Class
subclass of: Units
comment: 1 M04011 2 Zeptomole per Femtoliter 3 zmol/fL 4 Zeptomole per Femtoliter 5 767525000 6 Unit 7 Unit (qualifier value) 8 Unit 9 C0439148
alternative label: zmol/fL

Zeptomole per Microliter
type: Class
subclass of: Units
comment: 1 M03937 2 Zeptomole per Microliter 3 zmol/mcL zmol/uL 4 Zeptomole per Microliter 5 767525000 6 Unit 7 Unit (qualifier value) 8 Unit 9 C0439148
alternative label: zmol/mcL
alternative label: zmol/uL

Zeptomole per Nanoliter
type: Class
subclass of: Units
comment: 1 M03919 2 Zeptomole per Nanoliter 3 zmol/nL 4 Zeptomole per Nanoliter 5 767525000 6 Unit 7 Unit (qualifier value) 8 Unit 9 C0439148
alternative label: zmol/nL

Zeptomole per Picoliter
type: Class
subclass of: Units
comment: 1 M03902 2 Zeptomole per Picoliter 3 zmol/pL 4 Zeptomole per Picoliter 5 767525000 6 Unit 7 Unit (qualifier value) 8 Unit 9 C0439148
alternative label: zmol/pL

Zeptomole per Yoctogram
type: Class
subclass of: Units
comment: 1 M05580 2 Zeptomole per Yoctogram 3 zmol/yg 4 Zeptomole per Yoctogram 5 767525000 6 Unit 7 Unit (qualifier value) 8 Unit 9 C0439148
alternative label: zmol/yg

Zeptomole per Yoctoliter
type: Class
subclass of: Units
comment: 1 M05597 2 Zeptomole per Yoctoliter 3 zmol/yL 4 Zeptomole per Yoctoliter 5 767525000 6 Unit 7 Unit (qualifier value) 8 Unit 9 C0439148
alternative label: zmol/yL

Zeptomole per Zeptogram
type: Class
subclass of: Units
comment: 1 M05543 2 Zeptomole per Zeptogram 3 zmol/zg 4 Zeptomole per Zeptogram 5 767525000 6 Unit 7 Unit (qualifier value) 8 Unit 9 C0439148
alternative label: zmol/zg

Zone Mins
type: Class
subclass of: Units
comment: 1 MD01754 2 Zone Mins 3 None 4 Zone Mins 5 767525000 6 Unit 7 Unit (qualifier value) 8 Minute of time 9 C0439232

aL
type: Class
subclass of: Units
comment: 1 M05457 2 aL 3 None 4 aL 5 767525000 6 unit 7 Unit (qualifier value) 8 Unit 9 C0439190

abdominal
type: Class
subclass of: Functions of Blood System, Metabolic system and Endocrine system (Body region)
comment: 1 MD02892 2 abdominal 3 None 4 abdominal 5 277112006 6 Abdominal 7 Abdominal (qualifier value) 8 Abdominal 9 C5200941

abdominal distention
type: Class
subclass of: Digestive function (Symptom)
comment: 1 MD01604 2 abdominal distention 3 None 4 abdominal distention 5 60728008 6 Abdominal distention 7 Swollen abdomen (finding) 8 Abdomen distended 9 C0000731

abduction
type: Class
subclass of: Musculoskeletal function (Body measurement)
comment: 1 MD03471 2 abduction 3 None 4 abduction 5 60074003 6 Abduction 7 Abduction, function (observable entity) 8 Abduction 9 C0231456

abnormal blood sugar
type: Class
subclass of: Functions of Blood System, Metabolic system and Endocrine system (Symptom)
comment: 1 M02657 2 abnormal blood sugar 3 None 4 abnormal blood sugar 5 166922008 6 Blood glucose abnormal 7 Blood glucose outside reference range (finding) 8 Blood glucose abnormal 9 C0580546

abnormal growth hair
type: Class
subclass of: Sensory function, Pain and Skin function (Symptom)
comment: 1 M01943 2 abnormal growth hair 3 None 4 abnormal growth hair 5 85305001 6 abnormal hair growth 7 Abnormal hair growth (finding) 8 Abnormal hair growth 9 C0232409

above head
type: Class
subclass of: Musculoskeletal function (Body measurement)
comment: 1 MD04814 2 above head 3 None 4 above head 5 54709006 6 Body measurement 7 Body measurement (procedure) 8 Body measurement 9 C0203910

above the waist
type: Class
subclass of: Musculoskeletal function (Body measurement)
comment: 1 MD04810 2 above the waist 3 None 4 above the waist 5 54709006 6 Body measurement 7 Body measurement (procedure) 8 Body measurement 9 C0203910

absent
type: Class
subclass of: Questionnaire
comment: 1 MD04070 2 absent 3 None 4 absent 5 2667000 6 Absent 7 Absent (qualifier value) 8 Absent 9 C0332197

acceleration
type: Class
subclass of: Units
comment: 1 MD02676 2 acceleration 3 None 4 acceleration 5 285659007 6 Acceleration 7 Acceleration (physical force) 8 Acceleration 9 C0000894

access
type: Class
subclass of: Health Related Factors
comment: 1 MD04465 2 access 3 None 4 access 5 260507000 6 Access 7 Access (attribute) 8 Access 9 C0444454

ache head
type: Class
subclass of: Nervous system and Mental function (Symptom)
comment: 1 M01064 2 ache head 3 None 4 ache head 5 25064002 6 Headache 7 Headache (finding) 8 Headache 9 C0018681

aches muscles
type: Class
subclass of: Sensory function, Pain and Skin function (Symptom)
comment: 1. M01823 2. Muscle ache 3. Muscle aches ache muscle ache muscles aches muscles Aching muscles 4. aches muscles 5. 68962001 6. Muscle ache 7. Muscle pain (finding) 8. Myalgia 9. C0231528

acidity
type: Class
subclass of: Digestive function (Body measurement)
comment: 1 M02732 2 acidity 3 None 4 acidity 5 178960009 6 Gastric acidity 7 Gastric acidity, function (observable entity) 8 Heartburn acidity 9 C0847097

acne
type: Class
subclass of: Sensory function, Pain and Skin function (Symptom)
comment: 1 MD01616 2 acne 3 None 4 acne 5 11381005 6 Acne 7 Acne (disorder) 8 Acne 9 C0702166

acromegaly
type: Class
subclass of: Functions of Blood System, Metabolic system and Endocrine system (Symptom)
comment: 1 MD00315 2 acromegaly 3 None 4 acromegaly 5 74107003 6 Acromegaly 7 Acromegaly (disorder) 8 Acromegaly 9 C0001206

act of opening a bottle lid and drinking water
type: Class
subclass of: Health Related Factors
comment: 1 MD04521 2 act of opening a bottle lid and drinking water 3 None 4 act of opening a bottle lid and drinking water 5 844005 6 Behavior finding 7 Behavior finding (finding) 8 Behavior 9 C0004927

active
type: Class
subclass of: Units
comment: 1 MD02601 2 active 3 None 4 active 5 55561003 6 Active 7 Active (qualifier value) 8 Active 9 C0205177

active Kilocalories
type: Class
subclass of: Units
comment: 1 MD02600 2 active Kilocalories 3 None 4 active Kilocalories 5 258791007 6 kilocalorie 7 kilocalorie (qualifier value) 8 kilocalorie 9 C0439259

active eye movement sleep
type: Class
subclass of: Individual Related Factors
comment: 1 M01378 2 active eye movement sleep 3 None 4 active eye movement sleep 5 89129007 6 REM sleep 7 Rapid eye movement sleep, function (observable entity) 8 Sleep, REM 9 C0037322

active minutes
type: Class
subclass of: Minute
comment: 1 MD01787 2 active minutes 3 None 4 active minutes 5 1156209001 6 minutes 7 minute (qualifier value) 8 Minute of time 9 C0439232

active range of motion
type: Class
subclass of: Active exercise
comment: 1 MD04010 2 active range of motion 3 None 4 active range of motion 5 710829000 6 Assessment of active range of motion 7 Assessment of active range of motion (procedure) 8 Assessment of active range of motion 9 C4040151
comment: 1 MD04784 2 active range of motion 3 None 4 active range of motion 5 710829000 6 Assessment of active range of motion 7 Assessment of active range of motion (procedure) 8 active range of motion 9 C1879548

activites
type: Class
subclass of: Health Related Factors
comment: 1 MD05336 2 activites 3 None 4 activites 5 257733005 6 Activity 7 Activity (observable entity) 8 Activities 9 C0441655

activities of daily living
type: Class
subclass of: Hospital information, examination/diagnosis/treatment data
comment: 1 MD04400 2 activities of daily living 3 Activites of Daily iving, ADL 4 activities of daily living 5 129025006 6 Activity of daily living 7 Activity of daily living (observable entity) 8 Activities of Daily Living (activity) 9 C0001288
alternative label: Activites of Daily iving, ADL

activity
type: Class
subclass of: Health Related Factors
comment: 1 MD02597 2 activity 3 None 4 activity 5 257733005 6 Activity 7 Activity (observable entity) 8 Activity 9 C0441655

activity Stress
type: Class
subclass of: Nervous system and Mental function (Body measurement)
comment: 1 MD02596 2 activity Stress 3 None 4 activity Stress 5 405052004 6 stress level 7 Level of stress (observable entity) 8 Level of stress 9 C1319127

activity Type
type: Class
subclass of: Anatomic part
comment: 1 MD02595 2 activity Type 3 None 4 activity Type 5 280147009 6 type of activity 7 Type of activity (attribute) 8 Type of activity 9 C0459205

activity calories
type: Class
subclass of: Hospital information, examination/diagnosis/treatment data
comment: 1 MD01828 2 activity calories 3 None 4 activity calories 5 258790008 6 calorie 7 calorie (qualifier value) 8 Calories burned 9 C1631273

activity energy
type: Class
subclass of: Hospital information, examination/diagnosis/treatment data
comment: 1 MD01652 2 activity energy 3 None 4 activity energy 5 251833007 6 Energy expenditure 7 Energy expenditure (observable entity) 8 Energy 9 C1442080

activity sport
type: Class
subclass of: Sport
comment: 1 M01415 2 activity sport 3 None 4 activity sport 5 14468000 6 Sports activity 7 Sports activity (observable entity) 8 Sports 9 C0038039

activity time
type: Class
subclass of: Time
comment: 1 MD01190 2 activity time 3 active Time 4 activity time 5 24863003 6 After meal 7 Postprandial (qualifier value) 8 With or after meal 9 C0589085
alternative label: active Time

acx
type: Class
subclass of: Units
comment: 1 MD02822 2 acx 3 None 4 acx 5 246514001 6 units 7 Units (attribute) 8 Unit 9 C0439149

acy
type: Class
subclass of: Units
comment: 1 MD02823 2 acy 3 None 4 acy 5 246514001 6 units 7 Units (attribute) 8 Unit 9 C0439150

acz
type: Class
subclass of: Units
comment: 1 MD02824 2 acz 3 None 4 acz 5 246514001 6 units 7 Units (attribute) 8 Unit 9 C0439151

adduction
type: Class
subclass of: Musculoskeletal function (Body measurement)
comment: 1 MD03479 2 Adduction 3 adduction 4 adduction 5 11554009 6 Adduction 7 Adduction, function (observable entity) 8 Adduction 9 C0231457

adenopathies
type: Class
subclass of: Respiratory function (Symptom)
comment: 1 M02497 2 Adenopathy 3 None 4 adenopathies 5 57597008 6 Adenosis 7 Adenosis (morphologic abnormality) 8 Adenosis 9 C0334050

adrenal gland
type: Class
subclass of: Functions of Blood System, Metabolic system and Endocrine system (Body region)
comment: 1 MD06973 2 adrenal gland 3 None 4 adrenal gland 5 23451007 6 Adrenal gland 7 Adrenal structure (body structure) 8 Adrenal gland 9 C0001625

adrenal leukodystrophy
type: Class
subclass of: Hospital information, examination/diagnosis/treatment data
comment: 1 MD00271 2 adrenal leukodystrophy 3 None 4 adrenal leukodystrophy 5 192781003 6 Leukodystrophy 7 Leukodystrophy (disorder) 8 Adrenoleukodystrophy 9 C0162309

adrenogenital syndrome
type: Class
subclass of: Functions of Blood System, Metabolic system and Endocrine system (Symptom)
comment: 1 MD00319 2 adrenogenital syndrome 3 None 4 adrenogenital syndrome 5 267395000 6 Adrenogenital syndrome 7 Adrenogenital disorder (disorder) 8 Adrenogenital Syndrome 9 C0302280

aerobic
type: Class
subclass of: Aerobic Exercise
comment: 1 MD01238 2 aerobic 3 aerobics, Aerobics 4 aerobic 5 229072005 6 Aerobic exercises 7 Aerobic exercises (regime/therapy) 8 Aerobic 9 C1510824
comment: 1 MD02593 2 aerobic 3 aerobics, Aerobics 4 aerobic 5 229072005 6 aerobic exercises 7 Aerobic exercises (regime/therapy) 8 Exercise 9 C0015259
alternative label: Aerobics

aerobic fitness
type: Class
subclass of: Aerobic Exercise
comment: 1 MD01586 2 aerobic exercise 3 None 4 aerobic fitness 5 229072005 6 Aerobic exercises 7 Aerobic exercises (regime/therapy) 8 Exercise, Aerobic 9 C0001701

aerobics exercise
type: Class
subclass of: Aerobic Exercise
comment: 1 M00661 2 aerobic exercise 3 Aerobic exercises, aerobic fitness 4 aerobics exercise 5 229072005 6 Aerobic exercises 7 Aerobic exercises (regime/therapy) 8 Exercise, Aerobic 9 C0001701

affecive disorder nos
type: Class
subclass of: Nervous system and Mental function (Symptom)
comment: 1 M02599 2 affecive disorder nos 3 None 4 affecive disorder nos 5 46206005 6 Affective disorder 7 Mood disorder (disorder) 8 Mood Disorders 9 C0525045

affective mood disorders
type: Class
subclass of: Nervous system and Mental function (Symptom)
comment: 1 M02603 2 affective mood disorders 3 None 4 affective mood disorders 5 46206005 6 Affective disorder 7 Mood disorder (disorder) 8 Mood Disorders 9 C0525045

afternoon snack
type: Class
subclass of: Nutrient intake
comment: 1 MD01391 2 afternoon snack 3 None 4 afternoon snack 5 307164005 6 snack time 7 Snack time (qualifier value) 8 Snack time 9 C0585041

ag
type: Class
subclass of: Units
comment: 1 M03496 2 ag 3 None 4 ag 5 767525000 6 Unit 7 Unit (qualifier value) 8 Attogram 9 C1879754

age
type: Class
subclass of: Units
comment: 1 MD02082 2 age 3 None 4 age 5 397669002 6 Age 7 Age (qualifier value) 8 Age 9 C0001779
comment: 1 MD02082-1 2 age 3 None 4 age 5 424144002 6 Age 7 Current chronological age (observable entity) 8 Age 9 C0001779

agranulocytosis
type: Class
subclass of: Functions of Blood System, Metabolic system and Endocrine system (Symptom)
comment: 1 MD00307 2 agranulocytosis 3 None 4 agranulocytosis 5 17182001 6 Agranulocytosis 7 Agranulocytosis (disorder) 8 Agranulocytosis 9 C0001824

aiming ability
type: Class
subclass of: Musculoskeletal function (Body measurement)
comment: 1 MD05103 2 aiming ability 3 None 4 aiming ability 5 32082000 6 Competence 7 Competence (finding) 8 Ability 9 C0085732

air Temperature
type: Class
subclass of: Physical/Chemical Environment
comment: 1 MD02591 2 air Temperature 3 Ambient temperature 4 air Temperature 5 703421000 6 temperature 7 Temperature (observable entity) 8 Recorders, Environmental, Air Temperature 9 C2955734
alternative label: Ambient temperature

akat
type: Class
subclass of: Units
comment: 1 M02928 2 akat 3 None 4 akat 5 258783003 6 akat 7 Attokatal (qualifier value) 8 akat 9 C0439251

albumin
type: Class
subclass of: Functions of Blood System, Metabolic system and Endocrine system (Body measurement)
comment: 1 MD03026 2 albumin 3 None 4 albumin 5 52454007 6 Albumin 7 Albumin (substance) 8 Albumin 9 C0001924

alcohol
type: Class
subclass of: Nutritional management
comment: 1 MD01429 2 alcohol 3 None 4 alcohol 5 53041004 6 Alcohol 7 Alcohol (substance) 8 Alcohol 9 C0001975

alcohol does drinking
type: Class
subclass of: Sub-Cultural Level
comment: 1 M02466 2 alcohol does drinking 3 None 4 alcohol does drinking 5 228273003 6 Alcohol drinking behavior 7 Finding relating to alcohol drinking behavior (finding) 8 Finding relating to alcohol drinking behavior 9 C0565662

alcohol drinking stop
type: Class
subclass of: Sub-Cultural Level
comment: 1 M02313 2 alcohol drinking stop 3 None 4 alcohol drinking stop 5 160579004 6 Stopped drinking alcohol 7 Stopped drinking alcohol (finding) 8 Stopped drinking alcohol 9 C0425321

almost
type: Class
subclass of: Questionnaire
comment: 1 MD02208 2 almost 3 None 4 almost 5 272103003 6 Time patterns 7 Time patterns (qualifier value) 8 Nearly 9 C3828842

almost everyday
type: Class
subclass of: Questionnaire
comment: 1 MD02296 2 almost everyday 3 None 4 almost everyday 5 69620002 6 every day 7 Daily (qualifier value) 8 most every day 9 C5142862

alopecia
type: Class
subclass of: Sensory function, Pain and Skin function (Symptom)
comment: 1 MD01628 2 alopecia 3 alopecias, alopecia disorders 4 alopecia 5 56317004 6 Alopecia 7 Alopecia (disorder) 8 Alopecia 9 C0002170
alternative label: alopecia disorders
alternative label: alopecias

alpine skiing
type: Class
subclass of: Sport
comment: 1 MD01347 2 alpine skiing 3 None 4 alpine skiing 5 45033006 6 skiing 7 Skiing (qualifier value) 8 Skis and skiing 9 C3825671

altitude
type: Class
subclass of: Units
comment: 1 MD01297 2 altitude 3 None 4 altitude 5 76661004 6 Altitude 7 Altitude (physical force) 8 Altitude 9 C0002349

am - ante meridiem
type: Class
subclass of: Time
comment: 1 M06628 2 am - ante meridiem 3 AM 4 am - ante meridiem 5 73775008 6 am - ante meridiem 7 Morning (qualifier value) 8 am - ante meridiem 9 C0332170
alternative label: AM

american football
type: Class
subclass of: Sport
subclass of: Units
comment: Exercise Sports None 1 MD01324 2 american football 3 None 4 american football 5 413489002 6 American football 7 American football - sport (qualifier value) 8 Activity, american tackle football 9 C2712412
comment: Exercise Sports None 1 MD01324-1 2 american football 3 None 4 american football 5 413489002 6 American football 7 American football - sport (qualifier value) 8 Football game 9 C0016517

amol
type: Class
subclass of: Units
comment: 1 M02891 2 amol 3 None 4 amol 5 258723000 6 amol 7 attomole (qualifier value) 8 amol unit of substance 9 C0439193

amol unit of substance
type: Class
subclass of: Units
comment: 1 M03708 2 amol unit of substance 3 None 4 amol unit of substance 5 258723000 6 attomole 7 attomole (qualifier value) 8 attomole 9 C0439193

amount
type: Class
subclass of: Units
comment: 1 MD02284 2 amount 3 None 4 amount 5 246205007 6 Amount 7 Quantity (attribute) 8 Amount 9 C1265611

amount of activity
type: Class
subclass of: Hospital information, examination/diagnosis/treatment data
comment: 1 MD01296 2 amount of activity 3 None 4 amount of activity 5 257733005 6 Activity 7 Activity (observable entity) 8 Physical Activity Measurement 9 C4049938

amount of alcohol
type: Class
subclass of: Sub-Cultural Level
comment: 1 MD00860 2 amount of alcohol 3 None 4 amount of alcohol 5 63267000 6 Alcohol level 7 Alcohol measurement (procedure) 8 alcohols 9 C0001975

amount of intake
type: Class
subclass of: Units
comment: 1 MD01476 2 amount of intake 3 None 4 amount of intake 5 870690008 6 oral intake 7 Oral intake (observable entity) 8 intake 9 C1512806

amps
type: Class
subclass of: Units
comment: 1 M04464 2 amps 3 None 4 amps 5 278078000 6 amps 7 Ampere (qualifier value) 8 amps 9 C0457243

amputation stump
type: Class
subclass of: Musculoskeletal function (Body region)
comment: 1 MD04416 2 amputation stump 3 None 4 amputation stump 5 38033009 6 Amputation stump 7 Amputation stump (body structure) 8 Amputation stump 9 C0002690

amputation stump assessment
type: Class
subclass of: Tool
comment: 1 MD04415 2 amputation stump assessment 3 amputation stump status assessment 4 amputation stump assessment 5 225395003 6 Wound assessment 7 Wound assessment (procedure) 8 Wound assessment 9 C0558033
alternative label: amputation stump status assessment

amputation stump management assist device
type: Class
subclass of: Equipment
comment: 1 MD04425 2 amputation stump management assist device 3 None 4 amputation stump management assist device 5 1141802005 6 Assistive device 7 Assistive device (physical object) 8 assistive device/technology 9 C0872018

anaerobic
type: Class
subclass of: Muscle Strengthening Exercise
comment: 1 MD01459 2 anaerobic 3 None 4 anaerobic 5 229072005 6 aerobic exercises 7 Aerobic exercises (regime/therapy) 8 Anaerobic 9 C3641081

analysis
type: Class
subclass of: Health Related Factors
comment: 1 MD05501 2 analysis 3 None 4 analysis 5 272389005 6 Analysis 7 Analysis (qualifier value) 8 Analysis 9 C0002778

anatomical part
type: Class
subclass of: Hospital information, examination/diagnosis/treatment data
comment: 1 M01800 2 Anatomic part 3 None 4 anatomical part 5 272427006 6 Anatomical part descriptor 7 Anatomical part descriptor (qualifier value) 8 Body part 9 C0229962

anatomy shoulder
type: Class
subclass of: Musculoskeletal function (Body region)
comment: 1 M02135 2 anatomy shoulder 3 anatomies shoulder 4 anatomy shoulder 5 16982005 6 shoulder 7 Shoulder region structure (body structure) 8 Shoulder 9 C0037004
alternative label: anatomies shoulder

android
type: Class
subclass of: Units
comment: 1 MD03020 2 android 3 None 4 android 5 58153004 6 Android 7 Android, device (physical object) 8 Android 9 C0336541

anesthesia
type: Class
subclass of: Hospital information, examination/diagnosis/treatment data
comment: 1 MD00189 2 anesthesia 3 None 4 anesthesia 5 33653009 6 Anesthesia 7 Absence of sensation (finding) 8 Absence of sensation 9 C0278134

anesthetic fee
type: Class
subclass of: Hospital Administration
comment: 1 MD00149 2 anesthetic fee 3 None 4 anesthetic fee 5 308590000 6 Payment for service procedure 7 Payment for service procedure (procedure) 8 Fees, Medical 9 C0015754

angle
type: Class
subclass of: Units
comment: 1 MD02694 2 angle 3 None 4 angle 5 1483009 6 Angle 7 Angular (qualifier value) 8 Angle 9 C0205143

angst
type: Class
subclass of: Nervous system and Mental function (Symptom)
comment: 1 M05822 2 angst 3 None 4 angst 5 48694002 6 Anxiety 7 Anxiety (finding) 8 Anxiety 9 C0003467

angular
type: Class
subclass of: Units
comment: 1 MD03767 2 angular 3 None 4 angular 5 1483009 6 Angular 7 Angular (qualifier value) 8 Angular 9 C0205143

ankle
type: Class
subclass of: Musculoskeletal function (Body region)
comment: 1 MD03474 2 ankle 3 None 4 ankle 5 344001 6 Ankle 7 Ankle region structure (body structure) 8 Ankle 9 C0003086

ankle joint
type: Class
subclass of: Musculoskeletal function (Body region)
comment: 1 MD04397 2 ankle joint 3 None 4 ankle joint 5 70258002 6 Ankle joint 7 Ankle joint structure (body structure) 8 Ankle joint 9 C0003087

ankylosing spondylitis
type: Class
subclass of: Hospital information, examination/diagnosis/treatment data
comment: 1 MD00052 2 ankylosing spondylitis 3 spondylitis ankylopoietica 4 ankylosing spondylitis 5 9631008 6 Ankylosing spondylitis 7 Ankylosing spondylitis (disorder) 8 Ankylosing spondylitis 9 C0038013

annular upper extremity
type: Class
subclass of: Musculoskeletal function (Body region)
comment: 1 MD04643 2 annular upper extremity 3 None 4 annular upper extremity 5 53120007 6 Upper extremity 7 Upper limb structure (body structure) 8 Upper Extremity 9 C1140618

ante meridiem
type: Class
subclass of: Time
comment: 1 MD02589 2 ante meridiem 3 None 4 ante meridiem 5 73775008 6 ante meridiem 7 Morning (qualifier value) 8 ante meridiem 9 C0332170

anticoagulant
type: Class
subclass of: Hospital information, examination/diagnosis/treatment data
comment: 1 MD00254 2 anticoagulant 3 None 4 anticoagulant 5 372862008 6 Anticoagulant 7 Anticoagulant (substance) 8 Anticoagulants 9 C0003280

anx
type: Class
subclass of: Units
comment: 1 MD02828 2 anx 3 None 4 anx 5 246514001 6 units 7 Units (attribute) 8 Unit 9 C0439155

anxiety
type: Class
subclass of: Nervous system and Mental function (Symptom)
comment: 1 MD02272 2 anxiety 3 None 4 anxiety 5 48694002 6 Anxiety 7 Anxiety (finding) 8 Anxiety 9 C0003467

any
type: Class
subclass of: Units
comment: 1 MD02829 2 any 3 None 4 any 5 246514001 6 units 7 Units (attribute) 8 Unit 9 C0439156

anz
type: Class
subclass of: Units
comment: 1 MD02830 2 anz 3 None 4 anz 5 246514001 6 units 7 Units (attribute) 8 Unit 9 C0439157

aortic valves
type: Class
subclass of: Cardiovascular system function (Body region)
comment: 1 MD00368 2 aortic valves 3 None 4 aortic valves 5 34202007 6 Aortic valve 7 Aortic valve structure (body structure) 8 Aortic valve structure 9 C0003501

aplastic anemia
type: Class
subclass of: Hospital information, examination/diagnosis/treatment data
comment: 1 MD00044 2 aplastic anemia 3 None 4 aplastic anemia 5 306058006 6 Aplastic anemia 7 Aplastic anemia (disorder) 8 Aplastic anemia 9 C0002874

apnea obstructive sleep
type: Class
subclass of: Respiratory function (Symptom)
comment: 1 M02540 2 apnea obstructive sleep 3 apnea obstructive sleeping 4 apnea obstructive sleep 5 78275009 6 Obstructive sleep apnea 7 Obstructive sleep apnea syndrome (disorder) 8 Sleep Apnea, Obstructive 9 C0520679
alternative label: apnea obstructive sleeping

apostilb
type: Class
subclass of: Units
comment: 1 M03486 2 apostilb 3 None 4 apostilb 5 420617002 6 Apostilb 7 Apostilb (qualifier value) 8 Apostilb 9 C1719957

appearance
type: Class
subclass of: Units
comment: 1 MD00446 2 appearance 3 None 4 appearance 5 703248002 6 Appearance 7 Appearance (observable entity) 8 Appearance 9 C0700364
comment: 1 MD00446-1 2 appearance 3 None 4 appearance 5 718498007 6 Appearance 7 Appearance (property) (qualifier value) 8 Appearance 9 C0700364
comment: 1 MD00446-2 2 appearance 3 None 4 appearance 5 255412001 6 Appearances 7 Appearances (qualifier value) 8 Appearance 9 C0700364

appetite
type: Class
subclass of: Nutritional status
comment: 1 MD01613 2 appetite 3 None 4 appetite 5 33911006 6 Appetite 7 Food appetite, function (observable entity) 8 Desire for food 9 C0003618

appetite change
type: Class
subclass of: Health Related Factors
comment: 1 MD01612 2 appetite change 3 None 4 appetite change 5 249473004 6 Altered appetite 7 Altered appetite (finding) 8 Altered appetite 9 C0426587

archery
type: Class
subclass of: Sport
comment: 1 MD01377 2 archery 3 None 4 archery 5 44098006 6 Archery 7 Archery (qualifier value) 8 Archery 9 C0336717

arm
type: Class
subclass of: Musculoskeletal function (Body region)
comment: 1 MD00474 2 arm 3 arms 4 arm 5 53120007 6 Arm 7 Upper limb structure (body structure) 8 Upper Extremity 9 C1140618
alternative label: arms

arm curl
type: Class
subclass of: Sport
comment: 1 MD01370 2 arm-length jump 3 None 4 arm curl 5 256235009 6 exercise 7 Exercise (observable entity) 8 Exercise 9 C0015259

arm extension
type: Class
subclass of: Sport
subclass of: Units
comment: Exercise Sports None 1 MD01348 2 arm extension 3 None 4 arm extension 5 256235009 6 exercise 7 Exercise (observable entity) 8 Exercise 9 C0015259

arm joint motion
type: Class
subclass of: Limb
comment: 1 MD02859 2 arm joint motion 3 None 4 arm joint motion 5 183313002 6 joint movement/exercise 7 Joint movement/exercise (regime/therapy) 8 Joint mobility exercises 9 C0419122

arms and legs
type: Class
subclass of: Musculoskeletal function (Body region)
comment: 1 M00971 2 arms and legs 3 None 4 arms and legs 5 66019005 6 Limb structure 7 Limb structure (body structure) 8 Limb structure 9 C0015385

arrangements
type: Class
subclass of: Health Related Factors
comment: 1 MD05398 2 arrangements 3 None 4 arrangements 5 844005 6 Behavior finding 7 Behavior finding (finding) 8 Behavior 9 C0004927

arrhythmia
type: Class
subclass of: Cardiovascular system function (Symptom)
comment: 1 MD01615 2 arrhythmia 3 None 4 arrhythmia 5 698247007 6 Arrhythmia 7 Cardiac arrhythmia (disorder) 8 Cardiac Arrhythmia 9 C0003811

arthritis
type: Class
subclass of: Musculoskeletal function (Symptom)
comment: 1 MD00345 2 arthritis 3 None 4 arthritis 5 3723001 6 Arthritis 7 Arthritis (disorder) 8 Arthritis 9 C0003864

artificial kidney dialysis
type: Class
subclass of: Hospital information, examination/diagnosis/treatment data
comment: 1 MD00239 2 artificial kidney dialysis 3 None 4 artificial kidney dialysis 5 265764009 6 Artificial kidney dialysis 7 Renal dialysis (procedure) 8 Renal Dialysis 9 C4551529

artificial lighting
type: Class
subclass of: Questionnaire
comment: 1 MD05013 2 artificial lighting 3 None 4 artificial lighting 5 56242006 6 Light 7 Light, electromagnetic radiation (physical force) 8 Light 9 C0023693

arts martial
type: Class
subclass of: Sport
comment: 1 M01639 2 arts martial 3 None 4 arts martial 5 6351001 6 Martial arts 7 Martial arts (qualifier value) 8 Martial arts 9 C0079801

asana-group action
type: Class
subclass of: Conditioning exercise
comment: 1 MD02847 2 asana-group action 3 None 4 asana-group action 5 129264002 6 action 7 Action (qualifier value) 8 control act - action 9 C1552007

asana-personal action
type: Class
subclass of: Conditioning exercise
comment: 1 MD02839 2 asana-personal action 3 None 4 asana-personal action 5 129264002 6 action 7 Action (qualifier value) 8 control act - action 9 C1552007

asleep
type: Class
subclass of: Individual Related Factors
comment: 1 MD01777 2 asleep 3 None 4 asleep 5 248220008 6 Asleep 7 Asleep (finding) 8 Asleep 9 C0424522

assembly
type: Class
subclass of: Health Related Factors
comment: 1 MD05095 2 assembly 3 None 4 assembly 5 844005 6 Behavior finding 7 Behavior finding (finding) 8 Behavior 9 C0004927

assessment
type: Class
subclass of: Health Related Factors
comment: 1 MD04610 2 assessment 3 None 4 assessment 5 386053000 6 Assessment 7 Evaluation procedure (procedure) 8 Assessment 9 C1261322
comment: 1 MD04610-1 2 assessment 3 None 4 assessment 5 129265001 6 Assessment 7 Evaluation - action (qualifier value) 8 Assessment 9 C1261322

assessment task
type: Class
subclass of: Questionnaire
comment: 1 MD05496 2 assessment task 3 Assessment tasks 4 assessment task 5 261041009 6 Working 7 Working, function (observable entity) 8 Assignment - action 9 C1516050
alternative label: Assessment tasks

assignment
type: Class
subclass of: Questionnaire
comment: 1 MD05493 2 assignment 3 None 4 assignment 5 261041009 6 Working 7 Working, function (observable entity) 8 Assignment - action 9 C1516050

assist
type: Class
subclass of: Health Related Factors
comment: 1 MD03253 2 assist 3 None 4 assist 5 10904000 6 Assists 7 Orthostatic body position (finding) 8 Assist, unit 9 C3841982

assistance
type: Class
subclass of: Health Related Factors
comment: 1 MD05077 2 assistance 3 None 4 assistance 5 116697009 6 Assists 7 Assists (attribute) 8 Helping Behavior 9 C0018896

at dawn
type: Class
subclass of: Hour
comment: 1 MD02181 2 at dawn 3 None 4 at dawn 5 272103003 6 Time patterns 7 Time patterns (qualifier value) 8 Time patterns 9 C0439545

atm
type: Class
subclass of: Units
comment: 1 M03299 2 atm 3 None 4 atm 5 304607008 6 atm 7 atmosphere (qualifier value) 8 Atmosphere, unit of pressure 9 C0678214

atresia
type: Class
subclass of: Hospital information, examination/diagnosis/treatment data
comment: 1 MD00365 2 atresia 3 None 4 atresia 5 56457002 6 Atresia 7 Congenital atresia (morphologic abnormality) 8 Atresia 9 C0243066

attacks syncopal
type: Class
subclass of: Nervous system and Mental function (Symptom)
comment: 1 M01452 2 attacks syncopal 3 None 4 attacks syncopal 5 271594007 6 Syncope 7 Syncope (finding) 8 Head 9 C0018670

attention
type: Class
subclass of: Nervous system and Mental function (Body measurement)
comment: 1 MD05145 2 attention 3 Attention functions 4 attention 5 6769007 6 Attention 7 Attention function (observable entity) 8 Attention 9 C0004268
alternative label: Attention functions

atv
type: Class
subclass of: Units
comment: 1 MD02588 2 atv 3 None 4 atv 5 256235009 6 Exercise 7 Exercise (observable entity) 8 Exercise 9 C0015259

audiometruc test
type: Class
subclass of: Tool
comment: 1 MD03967 2 audiometruc test 3 None 4 audiometruc test 5 21727005 6 Audiometric test 7 Audiometric test (procedure) 8 Hearing Tests 9 C0018786

auto
type: Class
subclass of: Units
comment: 1 MD02587 2 auto 3 None 4 auto 5 256235009 6 Exercise 7 Exercise (observable entity) 8 Auto 9 C1441488

auto racing
type: Class
subclass of: Sport
comment: 1 MD02586 2 auto racing 3 None 4 auto racing 5 14468000 6 sports 7 Sports activity (observable entity) 8 Sports 9 C0038039

automatic motion detection
type: Class
subclass of: Tool
comment: 1 MD01840 2 automatic motion detection 3 None 4 automatic motion detection 5 1231194004 6 Normal visual motion detection 7 Normal visual motion detection (finding) 8 Equipment 9 C0014672

automatic stress measurement
type: Class
subclass of: Tool
comment: 1 MD01845 2 automatic stress measurement 3 None 4 automatic stress measurement 5 713137006 6 Assessment of stress level 7 Assessment of stress level (procedure) 8 Assessment of stress level 9 C4076401

autonomic nervous system
type: Class
subclass of: Hospital information, examination/diagnosis/treatment data
comment: 1 MD00421 2 autonomic nervous system 3 None 4 autonomic nervous system 5 72167002 6 Autonomic nervous system 7 Autonomic nervous system structure (body structure) 8 Autonomic nervous system 9 C0004388

availability
type: Class
subclass of: Questionnaire
comment: 1 MD04882 2 availability 3 None 4 availability 5 103328004 6 Availability of 7 Availability of (contextual qualifier) (qualifier value) 8 Data: Availability 9 C4035953

average
type: Class
subclass of: Units
comment: 1 MD01904 2 average 3 None 4 average 5 255586005 6 Mean 7 Mean (qualifier value) 8 Average 9 C1510992

average Stress Level
type: Class
subclass of: Units
comment: 1 MD02583 2 average Stress Level 3 None 4 average Stress Level 5 405052004 6 stress level 7 Level of stress (observable entity) 8 Level of stress 9 C1319127

average beats per minutes
type: Class
subclass of: Units
comment: 1 MD01793 2 average beats per minutes 3 None 4 average beats per minutes 5 258983007 6 BPM - beats per minute 7 Beats/minute (qualifier value) 8 beats per minute 9 C0439385

average calories
type: Class
subclass of: Musculoskeletal function (Body region)
comment: 1 MD01463 2 abdominal muscle 3 None 4 average calories 5 818995003 6 abdominal skeletal muscle 7 Structure of skeletal muscle of abdomen (body structure) 8 Abdominal Muscles 9 C0000739
alternative label: after a meal

average daily walk
type: Class
subclass of: Aerobic Exercise
comment: 1 MD01285 2 average daily walk 3 None 4 average daily walk 5 129006008 6 walking 7 Walking (observable entity) 8 Walking (activity) 9 C0080331
comment: 1 MD01285-1 2 average daily walk 3 None 4 average daily walk 5 870595007 6 walking 7 Walking (qualifier value) 8 Walking (activity) 9 C0080331

average distance
type: Class
subclass of: Units
comment: 1 MD01300 2 average distance 3 None 4 average distance 5 246132006 6 Distance 7 Distance (qualifier value) 8 Distance 9 C0012751

average heart rate
type: Class
subclass of: Cardiovascular system function (Body measurement)
comment: 1 MD01489 2 average heart rate 3 None 4 average heart rate 5 364075005 6 Heart rate 7 Heart rate (observable entity) 8 heart rate average 9 C0744676

average of 1 day
type: Class
subclass of: Day
comment: 1 MD04935 2 average of 1 day 3 None 4 average of 1 day 5 255586005 6 Mean 7 Mean (qualifier value) 8 Average 9 C1510992

average speed
type: Class
subclass of: Units
comment: 1 MD01887 2 average speed 3 None 4 average speed 5 870597004 6 Speed 7 Distance per time (property) (qualifier value) 8 Speed (motion) 9 C0678536

average steps
type: Class
subclass of: Musculoskeletal function (Body measurement)
comment: 1 MD01788 2 average steps 3 None 4 average steps 5 398298007 6 Step 7 Step (qualifier value) 8 Step (specific stage) 9 C1261552

average walking speed
type: Class
subclass of: Units
comment: 1 MD03784 2 average walking speed 3 None 4 average walking speed 5 724237005 6 Gait speed 7 Gait speed (observable entity) 8 Normal or Average Walking Pace 9 C4288584

avid flush
type: Class
subclass of: Sensory function, Pain and Skin function (Symptom)
comment: 1 MD01617 2 avid flush 3 None 4 avid flush 5 198436008 6 Hot flushes 7 Menopausal flushing (finding) 8 Hot flushes 9 C0600142

awake
type: Class
subclass of: Individual Related Factors
comment: 1 MD01843 2 awake 3 None 4 awake 5 248218005 6 Awake 7 Awake (finding) 8 Awake (finding) 9 C0234422

back
type: Class
subclass of: Sensory function, Pain and Skin function (Body region)
comment: 1 MD01465 2 back 3 None 4 back 5 77568009 6 Back 7 Structure of back of trunk (body structure) 8 Back structure, excluding neck 9 C1995000

back extension
type: Class
subclass of: Sport
comment: 1 MD01326 2 back extension 3 None 4 back extension 5 256235009 6 exercise 7 Exercise (observable entity) 8 Exercise 9 C0015259

back of the abdomen cavity
type: Class
subclass of: Musculoskeletal function (Body region)
comment: 1 M02111 2 back of the abdomen cavity 3 None 4 back of the abdomen cavity 5 818983003 6 abdomen 7 Structure of abdominopelvic cavity and/or content of abdominopelvic cavity and/or anterior abdominal wall (body structure) 8 Abdomen 9 C0000726

back packing
type: Class
subclass of: Sport
comment: 1 MD01327 2 back packing 3 None 4 back packing 5 256235009 6 exercise 7 Exercise (observable entity) 8 Exercise 9 C0015259

back pain during a break
type: Class
subclass of: Sensory function, Pain and Skin function (Symptom)
comment: 1 MD04260 2 back pain during a break 3 None 4 back pain during a break 5 161891005 6 Back pain 7 Backache (finding) 8 Back pain 9 C0004604

back pocket
type: Class
subclass of: Equipment
comment: 1 MD04526 2 back pocket 3 None 4 back pocket 5 246137000 6 Equipment 7 Equipment (attribute) 8 Equipment 9 C0014672

backcountry skiing
type: Class
subclass of: Sport
comment: 1 MD02581 2 backcountry skiing 3 backcountry skiing snowboarding 4 backcountry skiing 5 45033006 6 skiing 7 Skiing (qualifier value) 8 Skiing (recreational activity) 9 C0037264
alternative label: Back-country skiing
alternative label: backcountry skiing snowboarding

bad
type: Class
subclass of: Questionnaire
comment: 1 MD01445 2 bad 3 None 4 bad 5 556001 6 Bad 7 Bad (qualifier value) 8 Bad 9 C0205169

bad dream
type: Class
subclass of: Individual Related Factors
comment: 1 MD02200 2 bad dream 3 None 4 bad dream 5 419748005 6 Bad dream 7 Unpleasant dream (finding) 8 Unpleasant dream 9 C1636655

bag
type: Class
subclass of: Equipment
comment: 1 MD04518 2 bag 3 None 4 bag 5 37284003 6 Bag 7 Bag, device (physical object) 8 Bag 9 C0179196
comment: 1 MD04518-1 2 bag 3 None 4 bag 5 37284003 6 Bag 7 Bag, device (physical object) 8 Bag 9 C1706249
comment: 1 MD04518-2 2 bag 3 None 4 bag 5 37284003 6 Bag 7 Bag, device (physical object) 8 Bag 9 C4319630
comment: 1 MD04518-3 2 bag 3 None 4 bag 5 428672001 6 Bag 7 Bag - unit of product usage (qualifier value) 8 Bag 9 C0179196
comment: 1 MD04518-4 2 bag 3 None 4 bag 5 428672001 6 Bag 7 Bag - unit of product usage (qualifier value) 8 Bag 9 C1706249
comment: 1 MD04518-5 2 bag 3 None 4 bag 5 428672001 6 Bag 7 Bag - unit of product usage (qualifier value) 8 Bag 9 C4319630
comment: 1 MD04518-6 2 bag 3 None 4 bag 5 732982009 6 Bag 7 Bag (unit of presentation) 8 Bag 9 C0179196
comment: 1 MD04518-7 2 bag 3 None 4 bag 5 732982009 6 Bag 7 Bag (unit of presentation) 8 Bag 9 C1706249
comment: 1 MD04518-8 2 bag 3 None 4 bag 5 732982009 6 Bag 7 Bag (unit of presentation) 8 Bag 9 C4319630

balance
type: Class
subclass of: Units
comment: 1 MD02908 2 balance 3 None 4 balance 5 78933003 6 Balance 7 Balanced (qualifier value) 8 Balance 9 C0014653
comment: 1 MD02908-1 2 balance 3 None 4 balance 5 78933003 6 Balance 7 Balanced (qualifier value) 8 Balance 9 C0179199
comment: 1 MD02908-2 2 balance 3 None 4 balance 5 78933003 6 Balance 7 Balanced (qualifier value) 8 Balance 9 C0205415
comment: 1 MD02908-3 2 balance 3 None 4 balance 5 249982003 6 Balance 7 Balance (observable entity) 8 Balance 9 C0014653
comment: 1 MD02908-4 2 balance 3 None 4 balance 5 249982003 6 Balance 7 Balance (observable entity) 8 Balance 9 C0179199
comment: 1 MD02908-5 2 balance 3 None 4 balance 5 249982003 6 Balance 7 Balance (observable entity) 8 Balance 9 C0205415
comment: 1 MD02908-6 2 balance 3 None 4 balance 5 705235004 6 Balance 7 Balance (physical object) 8 Balance 9 C0014653
comment: 1 MD02908-7 2 balance 3 None 4 balance 5 705235004 6 Balance 7 Balance (physical object) 8 Balance 9 C0179199
comment: 1 MD02908-8 2 balance 3 None 4 balance 5 705235004 6 Balance 7 Balance (physical object) 8 Balance 9 C0205415

balance ball training
type: Class
subclass of: Aerobic Exercise
comment: 1 MD02793 2 balance ball training 3 None 4 balance ball training 5 386293009 6 balance exercise 7 Balance exercises (regime/therapy) 8 Balance exercises 9 C0150219

ballet
type: Class
subclass of: Sport
comment: 1 MD01325 2 Ballet 3 None 4 ballet 5 256235009 6 exercise 7 Exercise (observable entity) 8 Ballet 9 C0871967

ballpoint pen
type: Class
subclass of: Equipment
comment: 1 MD05097 2 ballpoint pen 3 None 4 ballpoint pen 5 257266008 6 Pencil 7 Pencil (physical object) 8 Pencil 9 C0441059

ballroom dance
type: Class
subclass of: Sport
comment: 1 MD01332 2 ballroom dance 3 None 4 ballroom dance 5 256235009 6 exercise 7 Exercise (observable entity) 8 Exercise 9 C0015259

bandage
type: Class
subclass of: Equipment
comment: 1 MD04427 2 bandage 3 None 4 bandage 5 63995005 6 Bandage 7 Bandage, device (physical object) 8 Bandage 9 C0004726

bank account
type: Class
subclass of: Tool
comment: 1 MD05434 2 bank account 3 None 4 bank account 5 246137000 6 equipment 7 Equipment (attribute) 8 account book 9 C0376646

bar
type: Class
subclass of: Units
comment: 1 M03455 2 bar 3 None 4 bar 5 428003006 6 Bar 7 Bar - unit of product usage (qualifier value) 8 Bar form 9 C0993613
comment: 1 M03455-1 2 bar 3 None 4 bar 5 428003006 6 Bar 7 Bar - unit of product usage (qualifier value) 8 Bar Dosing Unit 9 C1704759

basal body temperature
type: Class
subclass of: Sensory function, Pain and Skin function (Body measurement)
comment: 1 MD01566 2 basal body temperature 3 None 4 basal body temperature 5 300076005 6 Basal body temperature 7 Basal body temperature (observable entity) 8 Basal body temperature 9 C0576806

basal metabolic rate
type: Class
subclass of: Functions of Blood System, Metabolic system and Endocrine system (Body measurement)
comment: 1 MD01815 2 basal metabolic rate 3 Basal metabolic rate (BMR) 4 basal metabolic rate 5 165109007 6 Basal metabolic rate 7 Basal metabolic rate (observable entity) 8 Basal metabolic rate 9 C0678121
alternative label: Basal metabolic rate (BMR)

basic dining table
type: Class
subclass of: Hospital Administration
comment: 1 MD00182 2 basic dining table 3 None 4 basic dining table 5 37824006 6 Basic hospital diet 7 Basic hospital diet (finding) 8 basic dining table 9 C0301561

bathing
type: Class
subclass of: Health Related Factors
comment: 1 MD05177 2 bathing 3 None 4 bathing 5 129002005 6 Bathing 7 Bathing (observable entity) 8 Bathing 9 C0518460

be good at locking doors without the help of others
type: Class
subclass of: Questionnaire
comment: 1 MD05307 2 be good at locking doors without the help of others 3 None 4 be good at locking doors without the help of others 5 273389003 6 Daily activities questionnaire 7 Daily activities questionnaire (assessment scale) 8 Daily activities questionnaire 9 C0451094

be unable to travel a long distances
type: Class
subclass of: Questionnaire
comment: 1 MD05260 2 be unable to travel a long distances 3 None 4 be unable to travel a long distances 5 273389003 6 Daily activities questionnaire 7 Daily activities questionnaire (assessment scale) 8 questionnaire 9 C0034394

beach volleyball
type: Class
subclass of: Sport
comment: 1 MD01331 2 beach volleyball 3 None 4 beach volleyball 5 256235009 6 exercise 7 Exercise (observable entity) 8 Exercise 9 C0015259

beat heart normal
type: Class
subclass of: Cardiovascular system function (Body measurement)
comment: 1 M01937 2 beat heart normal 3 None 4 beat heart normal 5 76863004 6 Normal heart beat 7 Normal heart rate (finding) 8 Normal heart beat 9 C2712144

bed
type: Class
subclass of: Equipment
comment: 1 MD04570 2 bed 3 None 4 bed 5 229772003 6 Bed 7 Bed (physical object) 8 Bed 9 C0004916

bed preparation time
type: Class
subclass of: Time
comment: 1 MD01869 2 bed preparation time 3 None 4 bed preparation time 5 21029003 6 Bedtime 7 Bedtime (qualifier value) 8 Before Bedtime 9 C1879793

bedtime
type: Class
subclass of: Time
comment: 1 MD01417 2 bedtime 3 None 4 bedtime 5 21029003 6 Bedtime 7 Bedtime (qualifier value) 8 Bedtime (qualifier value) 9 C0521112

bedtime alarm
type: Class
subclass of: Units
comment: 1 MD01780 2 bedtime alarm 3 None 4 bedtime alarm 5 39869006 6 Alarm 7 Alarm, device (physical object) 8 Bedtime (qualifier value) 9 C0521112

before
type: Class
subclass of: Units
comment: 1 MD00809 2 before 3 None 4 before 5 288556008 6 Before 7 Before (attribute) 8 Before 9 C0332152
comment: 1 MD00809-1 2 before 3 None 4 before 5 288556008 6 Before 7 Before (attribute) 8 Before - dosing instruction fragment 9 C1705850
comment: 1 MD00809-2 2 before 3 None 4 before 5 421718005 6 Before 7 Before - dosing instruction fragment (qualifier value) 8 Before 9 C0332152
comment: 1 MD00809-3 2 before 3 None 4 before 5 421718005 6 Before 7 Before - dosing instruction fragment (qualifier value) 8 Before - dosing instruction fragment 9 C1705850

behavior modification techniques
type: Class
subclass of: Tool
comment: 1 M00733 2 behavior modification techniques 3 None 4 behavior modification techniques 5 166002 6 Behaviour modification technique 7 Behavioral therapy (regime/therapy) 8 Behaviour modification technique 9 C0004934

behavior sleep
type: Class
subclass of: Sub-Cultural Level
comment: 1 M02481 2 behavior sleep 3 behaviors sleep, behaviour sleeping 4 behavior sleep 5 247950007 6 Sleep behavior 7 Sleep behavior finding (finding) 8 Sleep behavior finding 9 C0474396
alternative label: behaviors sleep
alternative label: behaviour sleeping

behavioral response to stimulus
type: Class
subclass of: Health Related Factors
comment: 1 M00718 2 behavioral response to stimulus 3 None 4 behavioral response to stimulus 5 844005 6 Behavioral finding 7 Behavior finding (finding) 8 Behavior 9 C0004927

behavioural response to stimulus
type: Class
subclass of: Health Related Factors
comment: 1 M00717 2 behavioural response to stimulus 3 None 4 behavioural response to stimulus 5 844005 6 Behavioral finding 7 Behavior finding (finding) 8 Behavior 9 C0004927

belongings
type: Class
subclass of: Equipment
comment: 1 MD05298 2 belongings 3 None 4 belongings 5 260787004 6 Objects 7 Physical object (physical object) 8 Physical object 9 C0347997

below the waist
type: Class
subclass of: Musculoskeletal function (Body measurement)
comment: 1 MD04809 2 below the waist 3 None 4 below the waist 5 54709006 6 Body measurement 7 Body measurement (procedure) 8 Body measurement 9 C0203910

bench press
type: Class
subclass of: Sport
comment: 1 MD01329 2 bench press 3 None 4 bench press 5 229115003 6 Bench press 7 Bench press (regime/therapy) 8 Bench press 9 C0454326

best
type: Class
subclass of: Questionnaire
comment: 1 MD01448 2 best 3 None 4 best 5 371912002 6 best value 7 Best value - numeric estimation technique (qualifier value) 8 best (quality) 9 C1522427

between shoulder blades
type: Class
subclass of: Musculoskeletal function (Body region)
comment: 1 MD04844 2 between shoulder blades 3 None 4 between shoulder blades 5 52530000 6 Body region 7 Body region structure (body structure) 8 Body regions 9 C0005898

beverage
type: Class
subclass of: Nutritional management
comment: 1 MD01430 2 beverage 3 None 4 beverage 5 226465004 6 drinks 7 Drinks (substance) 8 Beverages 9 C0005329

bibyble
type: Class
subclass of: Sport
comment: 1 M00748 2 bibyble 3 None 4 bibyble 5 70224005 6 Bicycle 7 Bicycle, device (physical object) 8 Bicycle 9 C0005375

bicycle
type: Class
subclass of: Equipment
comment: 1 MD02800 2 bicycle 3 Bicycling 4 bicycle 5 70224005 6 Bicycle 7 Bicycle, device (physical object) 8 Bicycle 9 C0005375
alternative label: Bicycling

bicycle wheel speed
type: Class
subclass of: Units
comment: 1 MD01552 2 bicycle wheel speed 3 None 4 bicycle wheel speed 5 870597004 6 Speed 7 Distance per time (property) (qualifier value) 8 Speed (motion) 9 C0678536

bike
type: Class
subclass of: Device
comment: 1 MD02578 2 bike 3 biking, Biking 4 bike 5 70224005 6 Bike 7 Bicycle, device (physical object) 8 Bike 9 C0005375
alternative label: Biking

bike To Run Transition
type: Class
subclass of: Sport
comment: 1 MD02576 2 bike To Run Transition 3 None 4 bike To Run Transition 5 365351009 6 exercise 7 Exercise (observable entity) 8 Exercise 9 C0015259

bile duct
type: Class
subclass of: Digestive function (Body region)
comment: 1 MD00439 2 bile duct 3 None 4 bile duct 5 28273000 6 Bile duct 7 Bile duct structure (body structure) 8 Bile duct structure 9 C0005400

biliary
type: Class
subclass of: Digestive function (Body region)
comment: 1 MD00426 2 biliary 3 None 4 biliary 5 70150004 6 Bile 7 Bile (substance) 8 Biliary 9 C0521378

biotin
type: Class
subclass of: Nutritional management
comment: 1 MD01700 2 biotin 3 None 4 biotin 5 8919000 6 Biotin 7 Biotin (substance) 8 Biotin 9 C0005575

bladder
type: Class
subclass of: Digestive function (Body region)
comment: 1 MD05182 2 bladder 3 None 4 bladder 5 89837001 6 Bladder 7 Urinary bladder structure (body structure) 8 Bladder 9 C0005682

blood alcohol content
type: Class
subclass of: Functions of Blood System, Metabolic system and Endocrine system (Body measurement)
comment: 1 MD01578 2 blood alcohol content 3 None 4 blood alcohol content 5 442321000 6 blood alcohol level 7 Measurement of alcohol in blood specimen (procedure) 8 Blood alcohol concentration 9 C0684262

blood coughed
type: Class
subclass of: Functions of Blood System, Metabolic system and Endocrine system (Symptom)
comment: 1 M01098 2 blood coughed 3 None 4 blood coughed 5 66857006 6 Coughing up blood 7 Hemoptysis (finding) 8 Hemoptysis 9 C0019079

blood count low
type: Class
subclass of: Functions of Blood System, Metabolic system and Endocrine system (Body measurement)
comment: 1 M02734 2 blood count low 3 blood counts low, Low blood count 4 blood count low 5 88308000 6 Blood cell count 7 Blood cell count (procedure) 8 blood count low 9 C0850869
alternative label: Low blood count
alternative label: blood counts low

blood glucose
type: Class
subclass of: Functions of Blood System, Metabolic system and Endocrine system (Body measurement)
comment: 1 MD01156 2 blood glucose 3 None 4 blood glucose 5 365812005 6 blood glucose level 7 Finding of blood glucose level (finding) 8 Blood Glucose 9 C0005802

blood oxygen concentration
type: Class
subclass of: Functions of Blood System, Metabolic system and Endocrine system (Body measurement)
comment: 1 MD01827 2 blood oxygen concentration 3 None 4 blood oxygen concentration 5 250555002 6 Blood oxygen concentration 7 Blood oxygen concentration measurement (procedure) 8 Blood oxygen concentration measurement 9 C0428180

blood oxygen saturation
type: Class
subclass of: Functions of Blood System, Metabolic system and Endocrine system (Body measurement)
comment: 1 MD01499 2 blood oxygen saturation 3 saturation oxygen blood 4 blood oxygen saturation 5 103228002 6 Blood oxygen saturation 7 Hemoglobin saturation with oxygen (observable entity) 8 Blood oxygen saturation (calculated) 9 C0428174
alternative label: saturation oxygen blood

blood pressure
type: Class
subclass of: Cardiovascular system function (Body measurement)
comment: 1 MD00700 2 blood pressure 3 Blood pressure finding, Blood pressure functions Blood Pressure Result, Blood pressures BP - Blood pressure 4 blood pressure 5 75367002 6 Blood pressure 7 Blood pressure (observable entity) 8 Blood pressure 9 C0005823
alternative label: BP - Blood pressure
alternative label: Blood pressure functions
alternative label: Blood pressure finding
alternative label: Blood Pressure Result
alternative label: Blood pressures

blood pressure drop
type: Class
subclass of: Cardiovascular system function (Symptom)
comment: 1 M01192 2 blood pressure drop 3 blood drop pressure, blood dropping pressure, blood drops pressure, blood falling pressure, blood falls pressure, drop in blood pressure, dropped blood pressure 4 blood pressure drop 5 45007003 6 Low blood pressure 7 Low blood pressure (disorder) 8 Hypotension 9 C0020649
alternative label: blood falls pressure
alternative label: blood drops pressure
alternative label: drop in blood pressure
alternative label: blood drop pressure
alternative label: blood falling pressure
alternative label: blood dropping pressure
alternative label: dropped blood pressure

blood spit up
type: Class
subclass of: Digestive function (Symptom)
comment: 1 M01101 2 blood spit up 3 None 4 blood spit up 5 270031000 6 Haemoptysis 7 Hemoptysis (finding) 8 Hemoptysis 9 C0019079

blood spitting up
type: Class
subclass of: Digestive function (Symptom)
comment: 1 M01102 2 blood spitting up 3 None 4 blood spitting up 5 270031000 6 Haemoptysis 7 Hemoptysis (finding) 8 Hemoptysis 9 C0019079

blood sugar level
type: Class
subclass of: Functions of Blood System, Metabolic system and Endocrine system (Body measurement)
comment: 1 M02346 2 blood sugar level 3 blood sugar levels 4 blood sugar level 5 33747003 6 Blood sugar level 7 Glucose measurement, blood (procedure) 8 Blood glucose measurement 9 C0392201
alternative label: blood sugar levels

blood type
type: Class
subclass of: Functions of Blood System, Metabolic system and Endocrine system (Body measurement)
comment: 1 MD01561 2 blood type 3 None 4 blood type 5 365642005 6 blood group antigen type 7 Finding of blood group antigen type (finding) 8 Blood Types 9 C1383165

blow
type: Class
subclass of: Health Related Factors
comment: 1 M02213 2 blow 3 Blowing, blows 4 blow 5 125667009 6 blow 7 Contusion (disorder) 8 Contusions 9 C0009938
alternative label: Blowing
alternative label: blows

bmr
type: Class
subclass of: Units
comment: 1 MD02574 2 bmr 3 None 4 bmr 5 165109007 6 bmr-masal metabolic rate 7 Basal metabolic rate (observable entity) 8 Basal metabolic rate index 9 C1976995

bmr Kilocalories
type: Class
subclass of: Units
comment: 1 MD02573 2 bmr Kilocalories 3 None 4 bmr Kilocalories 5 258791007 6 Kilocalories 7 kilocalorie (qualifier value) 8 Kilocalories 9 C0439259

bmx
type: Class
subclass of: Hospital information, examination/diagnosis/treatment data
comment: 1 MD02572 2 bmx 3 None 4 bmx 5 415577004 6 sports 7 Sport (qualifier value) 8 spors 9 C0038039

boating
type: Class
subclass of: Sport
comment: 1 MD02571 2 boating 3 None 4 boating 5 21249000 6 Rowing boat 7 Rowboat, device (physical object) 8 boating (activity) 9 C1176319

body
type: Class
subclass of: Sensory function, Pain and Skin function (Body region)
comment: Body region Sensory function, Pain and Skin function None 1 MD02977 2 body 3 Body 4 body 5 38866009 6 Body part 7 Body part structure (body structure) 8 Body part 9 C0229962

body ache
type: Class
subclass of: Sensory function, Pain and Skin function (Symptom)
comment: 1 MD01599 2 body ache 3 None 4 body ache 5 82991003 6 Generalized body aches 7 Generalized aches and pains (finding) 8 BODY ACHE 9 C0741585

body balance
type: Class
subclass of: Nervous system and Mental function (Body measurement)
comment: 1 MD03661 2 body balance 3 None 4 body balance 5 249982003 6 Balance 7 Balance (observable entity) 8 examination of balance 9 C2174421

body composition
type: Class
subclass of: Sensory function, Pain and Skin function (Body measurement)
comment: 1 MD01816 2 body composition 3 None 4 body composition 5 68592003 6 Body composition 7 Body composition (observable entity) 8 Body composition 9 C0005885

body fat
type: Class
subclass of: Hospital information, examination/diagnosis/treatment data
comment: 1 MD03657 2 body fat 3 body fats 4 body fat 5 248300009 6 Body fat 7 Body fat observable (observable entity) 8 Body fat 9 C0344335
alternative label: body fats

body fat weight
type: Class
subclass of: Sensory function, Pain and Skin function (Body measurement)
comment: 1 MD01567 2 body fat weight 3 None 4 body fat weight 5 248361005 6 total body fat 7 Total body fat (observable entity) 8 Total body fat 9 C0424677

body mass
type: Class
subclass of: Hospital information, examination/diagnosis/treatment data
comment: 1 MD03968 2 body mass 3 None 4 body mass 5 60621009 6 Body mass index 7 Body mass index (observable entity) 8 Body mass index 9 C1305855

body mass index
type: Class
subclass of: Hospital information, examination/diagnosis/treatment data
comment: 1 MD01271 2 body mass index 3 None 4 body mass index 5 60621009 6 Body mass index 7 Body mass index (observable entity) 8 Body mass index 9 C1305855

body measurement
type: Class
subclass of: Hospital information, examination/diagnosis/treatment data
comment: 1 MD01969 2 body measurement 3 Body Measure Body measure procedure Body Measures 4 body measurement 5 54709006 6 Body measurement 7 Body measurement (procedure) 8 Body measure procedure 9 C0203910
alternative label: Body Measure
alternative label: Body measure procedure
alternative label: Body Measures

body size
type: Class
subclass of: Hospital information, examination/diagnosis/treatment data
comment: 1 MD01970 2 body size 3 None 4 body size 5 246115007 6 Size 7 Size (attribute) 8 Body Size 9 C0005901

body surface
type: Class
subclass of: Sensory function, Pain and Skin function (Body measurement)
comment: 1 MD00542 2 body surface 3 Body surface area 4 body surface 5 301898006 6 Body surface area 7 Body surface area (observable entity) 8 Body Surface Area 9 C0005902
alternative label: Body surface area

body temperature
type: Class
subclass of: Sensory function, Pain and Skin function (Body measurement)
comment: 1 MD01546 2 body temperature 3 None 4 body temperature 5 386725007 6 Body temperature 7 Body temperature (observable entity) 8 Body temperature 9 C0005903

body water
type: Class
subclass of: Hospital information, examination/diagnosis/treatment data
comment: 1 MD01817 2 body water 3 Body Waters water body 4 body water 5 38348009 6 Body water 7 Body water (substance) 8 Body water (substance) 9 C0005909
alternative label: Bodies of water
alternative label: water body
alternative label: Body Waters

body weight
type: Class
subclass of: Musculoskeletal function (Body measurement)
comment: 1 MD03119 2 body weight 3 None 4 body weight 5 27113001 6 Body weight 7 Body weight (observable entity) 8 Body weight 9 C0005910

bone
type: Class
subclass of: Musculoskeletal function (Body region)
comment: 1 MD00513 2 bone 3 Bones 4 bone 5 128530007 6 Entire bone 7 Entire bony skeleton (body structure) 8 Bone and Bones 9 C0005931
comment: 1 MD02566 2 Body bone 3 Bones 4 bone 5 119186007 6 bone part 7 Bone part (body structure) 8 Bone and Bones 9 C0005931
comment: 1 MD03009 2 Body bone 3 Bones 4 bone 5 82882003 6 Boneset 7 Eupatorium perfoliatum (organism) 8 Entire bone (organ) 9 C1266908

bone marrow
type: Class
subclass of: Immune system function (Body region)
comment: 1 MD06938 2 bone marrow 3 None 4 bone marrow 5 14016003 6 Bone marrow 7 Bone marrow structure (body structure) 8 Bone marrow 9 C0005953

bookmark
type: Class
subclass of: Units
comment: 1 MD02565 2 bookmark 3 None 4 bookmark 5 844005 6 Behavior finding 7 Behavior finding (finding) 8 Behavior 9 C0004927

both hands
type: Class
subclass of: Musculoskeletal function (Body region)
comment: Body region Musculoskeletal function None 1 MD04495 2 both hands 33 Both hands (pair) 4 both hands 5 12861001 6 Both hands 7 Both hands (body structure) 8 Both hands 9 C0230377
alternative label: pair
alternative label: Both hands (pair)

bother
type: Class
subclass of: Questionnaire
comment: 1 MD02204 2 bother 3 None 4 bother 5 261017006 6 Interrupted 7 Interrupted (qualifier value) 8 Interrupted 9 C0443239

bottle - unit dose
type: Class
subclass of: Units
comment: 1 M05159 2 bottle - unit dose 3 None 4 bottle - unit dose 5 68276008 6 Bottle 7 Bottle, device (physical object) 8 Bottle 9 C0179375

bottle feed
type: Class
subclass of: Units
comment: 1 M04619 2 bottle feed 3 bottle feeding 4 bottle feed 5 228946009 6 bottles/feed 7 bottles/feed (qualifier value) 8 bottles/feed (qualifier value) 9 C0560694
alternative label: bottle feeding

bottle lid
type: Class
subclass of: Equipment
comment: 1 MD04522 2 bottle lid 3 None 4 bottle lid 5 68276009 6 Bottle 7 Bottle, device (physical object) 8 Bottle, device 9 C0179376

bouldering
type: Class
subclass of: Sport
comment: 1 MD02564 2 bouldering 3 None 4 bouldering 5 256235009 6 exercise 7 Exercise (observable entity) 8 exercise 9 C0015259

bowel
type: Class
subclass of: Digestive function (Body region)
comment: 1 MD05183 2 bowel 3 None 4 bowel 5 113276009 6 Bowel 7 Intestinal structure (body structure) 8 Bowel 9 C0021853

bowel ostomy
type: Class
subclass of: Hospital information, examination/diagnosis/treatment data
comment: 1 MD00091 2 bowel ostomy 3 None 4 bowel ostomy 5 245857005 6 Stoma 7 Stoma (morphologic abnormality) 8 Intestinal Fistula 9 C0021833

bowel ostomy and urostomy disorders
type: Class
subclass of: Structures of disability
comment: 1 MD00090 2 bowel ostomy and urostomy disorders 3 None 4 bowel ostomy and urostomy disorders 5 64572001 6 Disorders 7 Disease (disorder) 8 Disease 9 C0012634

bowl
type: Class
subclass of: Device
comment: 1 M02112 2 bowl 3 None 4 bowl 5 708542002 6 exercise equipment and/or device 7 Exercise equipment and/or device (physical object) 8 Bowls (device) 9 C0179395

boxing
type: Class
subclass of: Sport
comment: 1 MD01307 2 boxing 3 Boxings 4 boxing 5 29506000 6 Boxing 7 Boxing (qualifier value) 8 Boxing 9 C0006080
alternative label: Boxings

bpm
type: Class
subclass of: Units
comment: 1 MD01123 2 bpm 3 (HealthVault) beat per minute 4 bpm 5 258983007 6 Beats/minute 7 Beats/minute (qualifier value) 8 beat per minutes 9 C0439385
alternative label: (HealthVault) beat per minute

bread
type: Class
subclass of: Nutritional management
comment: 1 MD05356 2 bread 3 None 4 bread 5 226559002 6 Bread 7 Bread (substance) 8 Bread 9 C0006138

break time
type: Class
subclass of: Time
comment: 1 MD04940 2 break time 3 None 4 break time 5 263678003 6 At rest 7 At rest (qualifier value) 8 At rest (qualifier value) 9 C0443144

breakfast
type: Class
subclass of: Nutritional management
comment: 1 MD01385 2 breakfast 3 None 4 breakfast 5 769561004 6 Breakfast 7 With breakfast (qualifier value) 8 With breakfast 9 C4553621
comment: 1 MD01385-1 2 breakfast 3 None 4 breakfast 5 769561004 6 Breakfast 7 With breakfast (qualifier value) 8 Breakfast 9 C2698559

breast pain
type: Class
subclass of: Sensory function, Pain and Skin function (Symptom)
comment: 1 MD01621 2 breast pain 3 None 4 breast pain 5 53430007 6 Breast pain 7 Pain of breast (finding) 8 Mastodynia 9 C0024902

breath work
type: Class
subclass of: Units
comment: 1 MD02563 2 breath work 3 None 4 breath work 5 78064003 6 Breathing 7 Respiratory function (observable entity) 8 braeth 9 C0225386

breathing exercises
type: Class
subclass of: Aerobic Exercise
comment: 1 MD01802 2 breathing exercises 3 None 4 breathing exercises 5 12895002 6 Breathing exercises 7 Physiotherapeutic breathing exercise (regime/therapy) 8 Breathing exercises 9 C0006155

breathing rate
type: Class
subclass of: Respiratory function (Body measurement)
comment: 1 MD01761 2 breathing rate 3 None 4 breathing rate 5 86290005 6 Breathing rate 7 Respiratory rate (observable entity) 8 Respiratory rate 9 C0231832

briefcase
type: Class
subclass of: Equipment
comment: 1 MD04223 2 briefcase 3 None 4 briefcase 5 246137000 6 equipment 7 Equipment (attribute) 8 equipment 9 C0014672

brunch
type: Class
subclass of: Nutritional management
comment: 1 MD01424 2 brunch 3 None 4 brunch 5 309611000 6 mealtimes 7 Mealtimes (qualifier value) 8 Mealtimes 9 C0587119

buffy test
type: Class
subclass of: Sport
comment: 1 MD01328 2 buffy test 3 None 4 buffy test 5 256235009 6 exercise 7 Exercise (observable entity) 8 Exercise 9 C0015259

burdensome
type: Class
subclass of: Questionnaire
comment: 1 MD04951 2 burdensome 3 None 4 burdensome 5 264931009 6 Symptomatic 7 Symptomatic (qualifier value) 8 Burden 9 C2828008

burn
type: Class
subclass of: Hospital information, examination/diagnosis/treatment data
comment: 1 MD00552-1 2 burn 3 Burns 4 burn 5 125666000 6 Burn 7 Burn (disorder) 8 Burn injury 9 C0006434
comment: 1 MD00552-2 2 burn 3 Burns 4 burn 5 48333001 6 Burn 7 Burn injury (morphologic abnormality) 8 Burn injury 9 C0006434
alternative label: Burns

business owner
type: Class
subclass of: Questionnaire
comment: 1 MD04902 2 business owner 3 None 4 business owner 5 308169002 6 Business - top men 7 Business - top men (occupation) 8 occupation: business owner 9 C4028181

butterfly posture
type: Class
subclass of: Conditioning exercise
comment: 1 MD02845 2 butterfly posture 3 None 4 butterfly posture 5 256235009 6 exercise 7 Exercise (observable entity) 8 Exercise 9 C0015259

buying
type: Class
subclass of: Health Related Factors
comment: 1 MD05233 2 buying 3 None 4 buying 5 844005 6 Behavior finding 7 Behavior finding (finding) 8 Behavior 9 C0004927

buying goods
type: Class
subclass of: Health Related Factors
comment: 1 MD05231 2 buying goods 3 None 4 buying goods 5 844005 6 Behavior finding 7 Behavior finding (finding) 8 Behavior 9 C0004927

cL
type: Class
subclass of: Units
comment: 1 M03095 2 cL 3 None 4 cL 5 258772007 6 cL 7 Centiliter (qualifier value) 8 centiliter 9 C0475212

cadence
type: Class
subclass of: Units
comment: 1 MD01101 2 cadence 3 None 4 cadence 5 260698009 6 Method of cycling 7 Method of cycling (attribute) 8 cadence 9 C4716180

caffeine
type: Class
subclass of: Nutritional management
comment: 1 MD01719 2 caffeine 3 None 4 caffeine 5 255641001 6 Caffeine 7 Caffeine (substance) 8 Caffeine 9 C0006644

calcium
type: Class
subclass of: Nutritional management
comment: 1 MD01131 2 calcium 3 None 4 calcium 5 5540006 6 Calcium 7 Calcium (substance) 8 Calcium 9 C0006675

calculated value
type: Class
subclass of: Units
comment: 1 MD00751 2 calculated value 3 None 4 calculated value 5 258090004 6 Calculated (qualifier value) 7 Calculated (qualifier value) 8 Calculated 9 C0444686

calendar
type: Class
subclass of: Units
comment: 1 MD02560 2 calendar 3 None 4 calendar 5 426200007 6 Unit of calendar time 7 Unit of calendar time (qualifier value) 8 calendar 9 C1516147

calendar Date
type: Class
subclass of: Day
comment: 1 MD02559 2 calendar Date 3 None 4 calendar Date 5 426200007 6 Unit of calendar time 7 Unit of calendar time (qualifier value) 8 calendar 9 C1516147

call taxi
type: Class
subclass of: Equipment
comment: 1 MD05477 2 call taxi 3 None 4 call taxi 5 52387005 6 Taxi 7 Taxi, device (physical object) 8 Taxi 9 C0336814

calm
type: Class
subclass of: Nervous system and Mental function (Symptom)
comment: 1 MD01768 2 calm 3 None 4 calm 5 386226007 6 Calming 7 Calming (procedure) 8 Sedation 9 C5400562

calorie
type: Class
subclass of: Units
comment: 1 M05369 2 calorie 3 cal calori calories caloris calory cals 4 calorie 5 258790008 6 calorie 7 calorie (qualifier value) 8 calorie 9 C1879985
alternative label: calori
alternative label: caloris
alternative label: calory
alternative label: calories
alternative label: cal
alternative label: cals

calorie consumption
type: Class
subclass of: Units
comment: 1 MD01555 2 calorie consumption 3 consumed Calories 4 calorie consumption 5 258790008 6 calorie 7 calorie (qualifier value) 8 calorie (physics) 9 C0599791
alternative label: consumed Calories

calorie unit of energy
type: Class
subclass of: Units
comment: 1 M05368 2 calorie unit of energy 3 None 4 calorie unit of energy 5 258790008 6 calorie 7 calorie (qualifier value) 8 calorie 9 C1879985

calories burned
type: Class
subclass of: Hospital information, examination/diagnosis/treatment data
comment: 1 MD01097 2 calories burned 3 None 4 calories burned 5 22280007 6 Caloric response, function 7 Caloric response, function (observable entity) 8 Calories burned 9 C1631273

can t up waking
type: Class
subclass of: Nervous system and Mental function (Symptom)
comment: 1 M02284 2 can t up waking 3 None 4 can t up waking 5 248261008 6 Cannot wake up 7 Oversleeps (disorder) 8 Oversleeps 9 C0424572

canal inguinal
type: Class
subclass of: Sensory function, Pain and Skin function (Body region)
comment: 1 M01754 2 canal inguinal 3 None 4 canal inguinal 5 90785001 6 Inguinal canal 7 Inguinal canal structure (body structure) 8 Inguinal canal structure 9 C0021445

cancer
type: Class
subclass of: Hospital information, examination/diagnosis/treatment data
comment: 1 MD00021 2 cancer 3 None 4 cancer 5 86049000 6 Cancer 7 Malignant neoplasm, primary (morphologic abnormality) 8 Malignant Neoplasms 9 C0006826
comment: 1 MD00021-1 2 cancer 3 None 4 cancer 5 363346000 6 Cancer 7 Malignant neoplastic disease (disorder) 8 Malignant Neoplasms 9 C0006826
comment: 1 MD00723-1 2 cancer 3 None 4 cancer 5 86049000 6 Cancer 7 Malignant neoplasm, primary (morphologic abnormality) 8 Primary malignant neoplasm 9 C1306459
comment: 1 MD00723-3 2 cancer 3 None 4 cancer 5 363346000 6 Cancer 7 Malignant neoplastic disease (disorder) 8 Primary malignant neoplasm 9 C1306459

cane
type: Class
subclass of: Equipment
comment: 1 MD04708 2 cane 3 None 4 cane 5 87405001 6 Cane 7 Cane, device (physical object) 8 Cane 9 C0006856

cannot breathe
type: Class
subclass of: Digestive function (Symptom)
comment: 1 MD02190 2 cannot breathe 3 None 4 cannot breathe 5 288849009 6 Unable to breathe 7 Unable to breathe (finding) 8 Unable to breathe 9 C0566271

cannot fall asleep
type: Class
subclass of: Individual Related Factors
comment: 1 MD02172 2 cannot fall asleep 3 Can't wake up 4 cannot fall asleep 5 59050008 6 Difficulty falling asleep 7 Initial insomnia (disorder) 8 Have Trouble Going To Sleep 9 C4526628
alternative label: Can't wake up

cap
type: Class
subclass of: Units
comment: 1 M05319 2 cap 3 None 4 cap 5 228254002 6 Cap 7 Cap (physical object) 8 Cap 9 C0179586

capable
type: Class
subclass of: Units
comment: 1 MD02218 2 capable 3 None 4 capable 5 371150009 6 Able 7 Able (qualifier value) 8 Able (finding) 9 C1299581

car
type: Class
subclass of: Equipment
comment: 1 MD05040 2 car 3 None 4 car 5 71783008 6 Car 7 Automobile, device (physical object) 8 Car 9 C0004381

carbohydrate
type: Class
subclass of: Nutritional management
comment: 1 MD01268 2 carbohydrate 3 None 4 carbohydrate 5 2331003 6 Carbohydrate 7 Carbohydrate (substance) 8 Carbohydrate 9 C0007004

carbonate
type: Class
subclass of: Functions of Blood System, Metabolic system and Endocrine system (Body measurement)
comment: 1 MD03056 2 carbonate 3 None 4 carbonate 5 259094000 6 Carbonate 7 Carbonate (substance) 8 Carbonate 9 C0007026

cardiac chambers
type: Class
subclass of: Cardiovascular system function (Body region)
comment: 1 MD00361 2 cardiac chambers 3 None 4 cardiac chambers 5 91744000 6 cardiac chamber 7 Cardiac chamber structure (body structure) 8 Cardiac chamber structure 9 C0729936

cardiac rehabilitation therapy
type: Class
subclass of: Cardiovascular system function (Therapy)
comment: 1 M02685 2 cardiac rehabilitation therapy 3 Cardiac rehabilitation treatment cardiac rehabilitation treatments rehabilitation cardiac Heart Diseases--Rehabilitation therapy cardiac rehabilitation Cardiac care: rehabilitative Cardiovascular rehabilitation procedure Cardiac rehabilitation 4 cardiac rehabilitation therapy 5 313395003 6 Cardiac rehabilitation (regime/therapy) 7 Cardiac rehabilitation (regime/therapy) 8 Cardiac rehabilitation 9 C0700431
alternative label: Cardiac care: rehabilitative
alternative label: therapy cardiac rehabilitation
alternative label: cardiac rehabilitation treatments
alternative label: Cardiac rehabilitation
alternative label: Heart Diseases--Rehabilitation
alternative label: Cardiovascular rehabilitation procedure
alternative label: rehabilitation cardiac
alternative label: Cardiac rehabilitation treatment

cardio
type: Class
subclass of: Cardiovascular system function (Body region)
comment: 1 MD01776 2 cardio 3 None 4 cardio 5 94579002 6 Cardiology 7 Cardiology (qualifier value) 8 Cardiology department 9 C0587453
comment: 1 MD02558 2 cardio 3 None 4 cardio 5 256235009 6 exercise 7 Exercise (observable entity) 8 exercise 9 C0015259

care
type: Class
subclass of: Health Related Factors
comment: 1 MD05539 2 care 3 None 4 care 5 844005 6 Behavior finding 7 Behavior finding (finding) 8 Behavior 9 C0004927
comment: 1 MD05539-1 2 care 3 None 4 care 5 161056001 6 In care 7 In care (finding) 8 In care (finding) 9 C0580931

care institutions
type: Class
subclass of: Classification of Hospital
comment: 1 MD00567 2 care institutions 3 None 4 care institutions 5 385437003 6 Institution 7 Institution (social concept) 8 Institution 9 C2607850

care nutritional
type: Class
subclass of: Nutritional management
comment: 1 M02020 2 care nutritional 3 None 4 care nutritional 5 278906000 6 Nutritional support 7 Nutritional support (regime/therapy) 8 Nutritional Support 9 C0242739

care on commission
type: Class
subclass of: Classification of Hospital
comment: 1 MD00566 2 care on commission 3 None 4 care on commission 5 161056001 6 In care 7 In care (finding) 8 Clinical 9 C0205210

carry a shopping bag or briefcase
type: Class
subclass of: Questionnaire
comment: 1 MD04221 2 carry a shopping bag or briefcase 3 None 4 carry a shopping bag or briefcase 5 288345009 6 Does carry 7 Does carry (finding) 8 Does carry 9 C0699809

cash withdrawal
type: Class
subclass of: Health Related Factors
comment: 1 MD05432 2 cash withdrawal 3 None 4 cash withdrawal 5 844005 6 Behavior finding 7 Behavior finding (finding) 8 Behavior 9 C0004927

cast
type: Class
subclass of: Hospital information, examination/diagnosis/treatment data
comment: 1 MD00198 2 cast 3 Casts 4 cast 5 21718009 6 Cast 7 Cast (morphologic abnormality) 8 Orthopedic Cast 9 C0179686
comment: 1 MD00198-1 2 cast 3 Casts 4 cast 5 21718009 6 Cast 7 Cast (morphologic abnormality) 8 Casts body substance 9 C0302143
comment: 1 MD00198-2 2 cast 3 Casts 4 cast 5 118643004 6 Cast 7 Cast device (physical object) 8 Orthopedic Cast 9 C0179686
comment: 1 MD00198-3 2 cast 3 Casts 4 cast 5 118643004 6 Cast 7 Cast device (physical object) 8 Casts body substance 9 C0302143
comment: 1 MD00198-4 2 cast 3 Casts 4 cast 5 413771002 6 Cast 7 Casts (qualifier value) 8 Orthopedic Cast 9 C0179686
comment: 1 MD00198-5 2 cast 3 Casts 4 cast 5 413771002 6 Cast 7 Casts (qualifier value) 8 Casts body substance 9 C0302143
alternative label: Casts

casual
type: Class
subclass of: Units
comment: 1 MD02557 2 casual 3 None 4 casual 5 870595007 6 Walking 7 Walking (qualifier value) 8 Casual walking 9 C3843786

casual walking
type: Class
subclass of: Aerobic Exercise
comment: 1 MD02556 2 casual walking 3 None 4 casual walking 5 129006008 6 walking 7 Walking (observable entity) 8 casual walking 9 C3843786

cat
type: Class
subclass of: Units
comment: 1 MD02780 2 cat 3 None 4 cat 5 844005 6 behavior finding 7 Behavior finding (finding) 8 Behavior 9 C0004927

cat strech
type: Class
subclass of: trunk
comment: 1 MD02779 2 cat strech 3 None 4 cat strech 5 229070002 6 stretching exercises 7 Stretching exercises (regime/therapy) 8 Stretching exercises 9 C0600080

cataplexy
type: Class
subclass of: Nervous system and Mental function (Symptom)
comment: 1 MD00523 2 cataplexy 3 None 4 cataplexy 5 46263000 6 Cataplexy 7 Cataplexy (disorder) 8 Cataplexy 9 C0007384

category
type: Class
subclass of: Units
comment: 1 MD02967 2 category 3 None 4 category 5 272396007 6 Ranked categories 7 Ranked categories (qualifier value) 8 Categories 9 C0683312

category of business
type: Class
subclass of: Hospital Administration
comment: 1 MD04911 2 category of business 3 None 4 category of business 5 272396007 6 Ranked categories 7 Ranked categories (qualifier value) 8 Categories 9 C0683312

cauda equina
type: Class
subclass of: Nervous system and Mental function (Body region)
comment: 1 MD06845 2 cauda equina 3 None 4 cauda equina 5 7173007 6 Cauda equina 7 Cauda equina structure (body structure) 8 Cauda equina 9 C0007458

cc
type: Class
subclass of: Units
comment: 1 M03800 2 cc 3 None 4 cc 5 258773002 6 cc 7 Milliliter (qualifier value) 8 cc 9 C0439242

ccr diving
type: Class
subclass of: Aerobic Exercise
comment: 1 MD02555 2 ccr diving 3 None 4 ccr diving 5 63498000 6 diving 7 Diving (qualifier value) 8 Diving (activity) 9 C0012823

cd
type: Class
subclass of: Units
comment: 1 M03302 2 cd 3 None 4 cd 5 39154008 6 CD 7 Clinical diagnosis (contextual qualifier) (qualifier value) 8 Diagnosis, clinical 9 C0332140
comment: 1 M03302-1 2 cd 3 None 4 cd 5 39154008 6 CD 7 Clinical diagnosis (contextual qualifier) (qualifier value) 8 candela 9 C0700300
comment: 1 M03302-2 2 cd 3 None 4 cd 5 282254003 6 cd 7 candela (qualifier value) 8 Diagnosis, clinical 9 C0332140
comment: 1 M03302-3 2 cd 3 None 4 cd 5 282254003 6 cd 7 candela (qualifier value) 8 candela 9 C0700300

celsius
type: Class
subclass of: Units
comment: 1 MD01534 2 celsius 3 None 4 celsius 5 258710007 6 degrees celsius 7 Degrees Celsius (qualifier value) 8 degrees Celsius 9 C0439237

celsius temperature
type: Class
subclass of: Units
comment: 1 M03789 2 Celsius temperature 3 None 4 celsius temperature 5 258710007 6 degrees C 7 Degrees Celsius (qualifier value) 8 degrees C 9 C0439237

centering
type: Class
subclass of: Aerobic Exercise
comment: 1 MD02706 2 Do you go out to nearby stores, mineral springs, senior citizen centers, etc. without using transportation without help? 3 None 4 centering 5 256235009 6 exercise 7 Exercise (observable entity) 8 Exercise 9 C0015259

centimeter of water
type: Class
subclass of: Units
comment: 1 M04327 2 centimeter of water 3 centimetre of water Centimeters of Water 4 centimeter of water 5 259019009 6 centimeter of water 7 Centimeter of water (qualifier value) 8 centimeter of water 9 C0439476
alternative label: Centimeters of Water
alternative label: centimetre of water

centimorgan
type: Class
subclass of: Units
comment: 1 M03293 2 centimorgan 3 None 4 centimorgan 5 304617003 6 centimorgan 7 centimorgan (qualifier value) 8 centimorgan 9 C0582522

central alveolar hypoventilation
type: Class
subclass of: Respiratory function (Symptom)
comment: 1 M02550 2 central alveolar hypoventilation 3 None 4 central alveolar hypoventilation 5 105191000119100 6 Acquired central alveolar hypoventilation 7 Acquired central alveolar hypoventilation (disorder) 8 Acquired central alveolar hypoventilation 9 C4039046

central nervous system
type: Class
subclass of: Nervous system and Mental function (Symptom)
comment: 1 MD00296 2 central nervous system 3 None 4 central nervous system 5 21483005 6 Central nervous system 7 Structure of central nervous system (body structure) 8 Central Nervous System 9 C3714787

central position
type: Class
subclass of: Units
comment: 1 MD03224 2 central position 3 None 4 central position 5 246268007 6 position 7 Position (attribute) 8 In position 9 C1550045

central venous pressure
type: Class
subclass of: Cardiovascular system function (Body measurement)
comment: 1 M02808 2 central venous pressure 3 None 4 central venous pressure 5 71420008 6 Central venous pressure 7 Central venous pressure (observable entity) 8 Central venous pressure 9 C0428640
alternative label: central pressure venous

cerebrovascular disease
type: Class
subclass of: Hospital information, examination/diagnosis/treatment data
comment: 1 MD00460 2 cerebrovascular disease 3 None 4 cerebrovascular disease 5 62914000 6 Cerebrovascular disease 7 Cerebrovascular disease (disorder) 8 Cerebrovascular Disorders 9 C0007820

cervical cancer test
type: Class
subclass of: Tool
comment: 1 MD00026 2 cervical cancer test 3 None 4 cervical cancer test 5 171149006 6 Screening for malignant neoplasm of cervix 7 Screening for malignant neoplasm of cervix (procedure) 8 Screening for malignant neoplasm of cervix (procedure) 9 C0420020

cervical spinal cord
type: Class
subclass of: Nervous system and Mental function (Body region)
comment: 1 MD06842 2 cervical spinal cord 3 None 4 cervical spinal cord 5 54785003 6 Cervical spinal cord 7 Cervical spinal cord structure (body structure) 8 Cervical spinal cord 9 C0581619

cervix
type: Class
subclass of: Urogenital function (Body region)
comment: 1 MD00737 2 cervix 3 None 4 cervix 5 71252005 6 Cervix 7 Cervix uteri structure (body structure) 8 Cervix Uteri 9 C0007874

cg
type: Class
subclass of: Units
comment: 1 M03307 2 cg 3 None 4 cg 5 396156008 6 cg 7 Centigram (qualifier value) 8 centigram 9 C1275572

chair
type: Class
subclass of: Equipment
comment: 1 MD04569 2 chair 3 None 4 chair 5 706699008 6 Chair 7 Chair (physical object) 8 Chair 9 C0179847

challenge
type: Class
subclass of: Hospital information, examination/diagnosis/treatment data
comment: 1 MD01794 2 challenge 3 None 4 challenge 5 128967005 6 Exercise challenge 7 Exercise challenge (procedure) 8 Challenge 9 C0805586

change
type: Class
subclass of: Health Related Factors
comment: 1 MD04589 2 change 3 changing 4 change 5 263703002 6 Changed 7 Changed status (qualifier value) 8 Changed status 9 C0443172
alternative label: changing

change in performance
type: Class
subclass of: Health Related Factors
comment: 1 MD04587 2 change in performance 3 None 4 change in performance 5 263703002 6 Change in 7 Changed status (qualifier value) 8 Changed status 9 C0443172

change in satisfaction
type: Class
subclass of: Health Related Factors
comment: 1 MD04590 2 change in satisfaction 3 None 4 change in satisfaction 5 263703002 6 Change in 7 Changed status (qualifier value) 8 Changed status 9 C0443172

changing diapers
type: Class
subclass of: Health Related Factors
comment: 1 MD05416 2 changing diapers 3 None 4 changing diapers 5 733923007 6 Change of diaper 7 Change of diaper (procedure) 8 Change of diaper 9 C4508963

check the score at the time of the most severe shoulder pain in daily activities over the last 24 hours
type: Class
subclass of: Questionnaire
comment: 1 MD04798 2 check the score at the time of the most severe shoulder pain in daily activities over the last 24 hours 3 None 4 check the score at the time of the most severe shoulder pain in daily activities over the last 24 hours 5 273389003 6 Daily activities questionnaire 7 Daily activities questionnaire (assessment scale) 8 Daily activities questionnaire 9 C0451094

checkup date
type: Class
subclass of: Day
comment: 1 MD00912 2 checkup date 3 Health check-up date 4 checkup date 5 840643003 6 Date of last examination 7 Date of last examination (observable entity) 8 Date of last examination 9 C5395479
alternative label: Health check-up date

chest
type: Class
subclass of: Musculoskeletal function (Body region)
comment: 1 MD02888 2 chest 3 Chests 4 chest 5 51185008 6 Chest 7 Thoracic structure (body structure) 8 Chest 9 C0817096
alternative label: Chests

chest and upper back
type: Class
subclass of: Musculoskeletal function (Body region)
comment: 1 M02234 2 chest and upper back 3 None 4 chest and upper back 5 60413009 6 thoracic cage 7 Thoracic cage structure (body structure) 8 Chest 9 C0817096

chest pain
type: Class
subclass of: Respiratory function (Symptom)
comment: 1 MD01590 2 chest pain 3 Pain in chest, Chest Pains, PAIN CHEST, PAIN IN CHEST 4 chest pain 5 29857009 6 Chest pain 7 Chest pain (finding) 8 Chest pain 9 C0008031
alternative label: PAIN CHEST
alternative label: Pain in chest
alternative label: PAIN IN CHEST
alternative label: Chest Pains

chest radiography
type: Class
subclass of: Functions of Blood System, Metabolic system and Endocrine system (Body measurement)
subclass of: Hospital information, examination/diagnosis/treatment data
comment: Clinical+Disability Hospital information, examination/diagnosis/treatment data None 1 MD00829 2 chest radiography 3 None 4 chest radiography 5 399208008 6 Radiography of chest 7 Plain chest X-ray (procedure) 8 Plain chest X-ray 9 C0039985
comment: Clinical+Disability Hospital information, examination/diagnosis/treatment data None 1 MD00712 2 chest radiography 3 None 4 chest radiography 5 399208008 6 Radiography of chest 7 Plain chest X-ray (procedure) 8 Radiography, Thoracic 9 C3665494

child rearing
type: Class
subclass of: Health Related Factors
comment: 1 MD05532 2 child rearing 3 None 4 child rearing 5 225599005 6 Social behavior 7 Social behavior (finding) 8 Child Rearing 9 C0008091

chill
type: Class
subclass of: Sensory function, Pain and Skin function (Symptom)
comment: 1 MD01618 2 chill 3 None 4 chill 5 43724002 6 Chill 7 Chill (finding) 8 Chills 9 C0085593

chin-up
type: Class
subclass of: Sport
comment: 1 MD01367 2 chin-up 3 None 4 chin-up 5 256235009 6 exercise 7 Exercise (observable entity) 8 Chin up 9 C4068929

chloride
type: Class
subclass of: Nutritional management
comment: 1 MD01713 2 chloride 3 None 4 chloride 5 50213009 6 Chloride 7 Chloride salt (substance) 8 Chlorides 9 C0008203

cholesterol
type: Class
subclass of: Functions of Blood System, Metabolic system and Endocrine system (Body measurement)
comment: 1 MD01133 2 cholesterol 3 None 4 cholesterol 5 84698008 6 Cholesterol 7 Cholesterol (substance) 8 Cholesterol 9 C0008377

chromium
type: Class
subclass of: Nutritional management
comment: 1 MD01722 2 chromium 3 None 4 chromium 5 111070004 6 Chromium 7 Chromium (substance) 8 Chromium 9 C0008574

chromosome
type: Class
subclass of: Hospital information, examination/diagnosis/treatment data
comment: 1 MD00472 2 chromosome 3 None 4 chromosome 5 91272006 6 Chromosome 7 Chromosome (cell structure) 8 Chromosomes 9 C0008633

chronical disease
type: Class
subclass of: Hospital information, examination/diagnosis/treatment data
comment: 1 MD00591 2 chronical disease 3 None 4 chronical disease 5 64572001 6 Disease 7 Disease (disorder) 8 Chronic disease 9 C0008679

cigarette
type: Class
subclass of: Questionnaire
comment: 1 MD02298 2 cigarette 3 cigarettes 4 cigarette 5 722496004 6 Cigarette 7 Cigarette (physical object) 8 Cigarette 9 C0677453
alternative label: cigarettes

circles
type: Class
subclass of: Health Related Factors
comment: 1 MD02765 2 circles 3 None 4 circles 5 229152003 6 leg exercise 7 Lower limb exercises (regime/therapy) 8 Exercise 9 C0015259
comment: Equipment/Device/Tool/Questionnaire Equipment None 1 MD02784 2 circles 3 None 4 circles 5 278104001 6 Ring pattern 7 Ring pattern (qualifier value) 8 Ring pattern 9 C0457269

circuit training
type: Class
subclass of: Sport
comment: 1 MD01334 2 Circuit training 3 None 4 circuit training 5 229199005 6 Circuit training in water 7 Circuit training in water (regime/therapy) 8 Circuit Training 9 C2712423

circulatory system
type: Class
subclass of: Functions of Blood System, Metabolic system and Endocrine system (Body region)
comment: 1 MD00360 2 circulatory system 3 None 4 circulatory system 5 113257007 6 Circulatory system 7 Structure of cardiovascular system (body structure) 8 Cardiovascular system 9 C0007226

circumference
type: Class
subclass of: Sensory function, Pain and Skin function (Body measurement)
comment: 1 MD03965 2 circumference 3 None 4 circumference 5 74551000 6 Circumference 7 Circumference (qualifier value) 8 Circumference 9 C0332520

circumference measurement
type: Class
subclass of: Sensory function, Pain and Skin function (Body measurement)
comment: 1 MD04421 2 circumference measurement 3 None 4 circumference measurement 5 248365001 6 Circumference measurements 7 Circumference measure (observable entity) 8 Circumference measure 9 C0424682

circumference measurement of amputation stump
type: Class
subclass of: Musculoskeletal function (Body measurement)
comment: 1 MD04687 2 circumference measurement of amputation stump 3 None 4 circumference measurement of amputation stump 5 248365001 6 Circumference measurements 7 Circumference measure (observable entity) 8 Circumference measure 9 C0424682

circumference occipital frontal
type: Class
subclass of: Musculoskeletal function (Body measurement)
comment: 1 M02030 2 circumference occipital frontal 3 Occipital-Frontal Circumference, OFC - Occipitofrontal circumference 4 circumference occipital frontal 5 363812007 6 head circumference 7 Head circumference (observable entity) 8 Head circumference 9 C0262499
alternative label: OFC - Occipitofrontal circumference
alternative label: Occipital-Frontal Circumference

cirrhosis
type: Class
subclass of: Hospital information, examination/diagnosis/treatment data
comment: 1 MD00427 2 cirrhosis 3 None 4 cirrhosis 5 1761006 6 Biliary cirrhosis 7 Biliary cirrhosis (disorder) 8 Cirrhosis 9 C1623038

classification
type: Class
subclass of: Health Related Factors
comment: 1 MD05505 2 classification 3 None 4 classification 5 278201002 6 Classification 7 Classification (attribute) 8 Classification 9 C0008902

classify
type: Class
subclass of: Units
comment: 1 MD04417 2 classify 3 None 4 classify 5 278201002 6 Classification 7 Classification (attribute) 8 Classification 9 C0008902

clean
type: Class
subclass of: Health Related Factors
comment: 1 MD05382 2 clean 3 None 4 clean 5 844005 6 Behavior finding 7 Behavior finding (finding) 8 Behavior 9 C0004927

cleaning the bathroom
type: Class
subclass of: Health Related Factors
comment: 1 MD05388 2 cleaning the bathroom 3 None 4 cleaning the bathroom 5 844005 6 Behavior finding 7 Behavior finding (finding) 8 Behavior 9 C0004927

cleaning up
type: Class
subclass of: Health Related Factors
comment: 1 MD05531 2 cleaning up 3 None 4 cleaning up 5 224269009 6 Clean home 7 Clean home (finding) 8 Cleaning (activity) 9 C1947930

climbing stairs
type: Class
subclass of: Sport
comment: 1 MD01641 2 climbing stairs 3 stair climbing, floors Climbed, floor climbing, Climbing the Stairs 4 climbing stairs 5 129016000 6 Climbing stairs 7 Climbing stairs (observable entity) 8 Climbing stairs 9 C1290942
alternative label: floor climbing
alternative label: Climbing the Stairs
alternative label: stair climbing
alternative label: floors Climbed

clock
type: Class
subclass of: Units
comment: 1 MD02552 2 clock 3 None 4 clock 5 54709006 6 Body measurement 7 Body measurement (procedure) 8 Body measure procedure 9 C0203910

clothes
type: Class
subclass of: Equipment
comment: 1 MD04558 2 clothes 3 None 4 clothes 5 272180002 6 Clothes 7 Garment (physical object) 8 Clothes 9 C0009072

clumsy
type: Class
subclass of: Questionnaire
comment: 1 MD00817 2 clumsy 3 None 4 clumsy 5 7006003 6 Clumsiness 7 Clumsiness (finding) 8 Clumsy 9 C4693372

cm
type: Class
subclass of: Units
comment: 1 M03093 2 cm 3 None 4 cm 5 258672001 6 cm 7 Centimeter (qualifier value) 8 centimeter 9 C0475210

cm3
type: Class
subclass of: Units
comment: 1 M03799 2 cm3 3 None 4 cm3 5 258773002 6 cm3 7 Milliliter (qualifier value) 8 cm3 9 C0439242

cmH2O
type: Class
subclass of: Units
comment: 1 M03030 2 cmH2O 3 None 4 cmH2O 5 259019009 6 cmH2O 7 Centimeter of water (qualifier value) 8 cmH2O 9 C0439476

cochlea
type: Class
subclass of: Sensory function, Pain and Skin function (Body region)
comment: 1 MD06880 2 cochlea 3 None 4 cochlea 5 80169004 6 Cochlea 7 Cochlear structure (body structure) 8 Cochlea 9 C0009195

coffee
type: Class
subclass of: Nutritional management
comment: 1 MD05353 2 coffee 3 None 4 coffee 5 29263009 6 Coffee 7 Coffee (substance) 8 Coffee 9 C0009237

cognitive behavior modification
type: Class
subclass of: Nervous system and Mental function (Therapy)
comment: 1 M00814 2 cognitive behavior modification 3 None 4 cognitive behavior modification 5 228557008 6 Cognitive-behavior therapy 7 Cognitive and behavioral therapy (regime/therapy) 8 cognitive behavior modification 9 C0009244

cognitive behavior therapy
type: Class
subclass of: Nervous system and Mental function (Therapy)
comment: 1 M00816 2 cognitive behavior therapy 3 Cognitive Behavior Therapies behavioral cognitive therapy CBT - Cognitive - behavior therapy CBT - Cognitive - behaviour therapy cognitive behavioral therapy cognitive behaviour therapy therapy behavior cognitive behaviour cognitive therapy 4 cognitive behavior therapy 5 228557008 6 Cognitive-behavior therapy 7 Cognitive and behavioral therapy (regime/therapy) 8 Cognitive Therapy 9 C0009244
alternative label: CBT - Cognitive - behaviour therapy
alternative label: therapy behavior cognitive
alternative label: behavioral cognitive therapy
alternative label: cognitive behaviour therapy
alternative label: Cognitive Behavior Therapies
alternative label: CBT - Cognitive - behavior therapy
alternative label: cognitive behavioral therapy
alternative label: behaviour cognitive therapy

cognitive psychotherapy
type: Class
subclass of: Nervous system and Mental function (Therapy)
comment: 1 M00821 2 cognitive psychotherapy 3 Cognitive Psychotherapies 4 cognitive psychotherapy 5 183383008 6 Psychotherapy - cognitive 7 Psychotherapy - cognitive (regime/therapy) 8 Cognitive Therapy 9 C0009244
alternative label: Cognitive Psychotherapies

cold
type: Class
subclass of: Sensory function, Pain and Skin function (Symptom)
comment: 1 MD02196 2 cold 3 None 4 cold 5 84162001 6 Cold 7 Cold sensation quality (qualifier value) 8 Cold 9 C0009443
comment: 1 MD02196-1 2 cold 3 None 4 cold 5 84162001 6 Cold 7 Cold sensation quality (qualifier value) 8 Cold 9 C0234192
comment: 1 MD02196-2 2 cold 3 None 4 cold 5 82272006 6 Cold 7 Common cold (disorder) 8 Cold 9 C0009443
comment: 1 MD02196-3 2 cold 3 None 4 cold 5 82272006 6 Cold 7 Common cold (disorder) 8 Cold 9 C0234192

cold sweat
type: Class
subclass of: Sensory function, Pain and Skin function (Symptom)
comment: 1 MD01614 2 cold sweat 3 None 4 cold sweat 5 83547004 6 Cold sweat 7 Cold sweat (finding) 8 Cold sweat 9 C0232431

collapse syncope
type: Class
subclass of: Nervous system and Mental function (Symptom)
comment: 1 M01454 2 collapse syncope 3 None 4 collapse syncope 5 271594007 6 Syncope 7 Syncope (finding) 8 Head 9 C0018670

colleaques
type: Class
subclass of: Units
comment: 1 MD00872 2 colleaques 3 None 4 colleaques 5 62071000 6 Companion 7 Companion (occupation) 8 Companions 9 C0335343

colonels
type: Class
subclass of: Classification of Patient
comment: 1 MD00577 2 colonels 3 None 4 colonels 5 302314004 6 Military personnel 7 Military personnel (occupation) 8 military person 9 C1554199

color classification
type: Class
subclass of: Sensory function, Pain and Skin function (Body measurement)
comment: 1 MD05108 2 color classification 3 None 4 color classification 5 301979008 6 Finding of color vision 7 Finding of color vision (finding) 8 Finding of color vision 9 C0578653

combined aerobic exercise
type: Class
subclass of: Aerobic Exercise
comment: 1 MD01861 2 combined aerobic exercise 3 None 4 combined aerobic exercise 5 229072005 6 Aerobic exercises 7 Aerobic exercises (regime/therapy) 8 Exercise, Aerobic 9 C0001701

combing
type: Class
subclass of: Health Related Factors
comment: 1 MD04541 2 combing 3 None 4 combing 5 113149004 6 Combing of hair 7 Combing of hair (procedure) 8 Combing of hair 9 C0204714

comfortably
type: Class
subclass of: Nervous system and Mental function (Symptom)
comment: 1 MD02191 2 comfortably 3 None 4 comfortably 5 1148784009 6 Feeling comfortable 7 Feeling comfortable (finding) 8 Feeling comfortable 9 C5546696

comment
type: Class
subclass of: Questionnaire
comment: 1 MD05209 2 comment 3 None 4 comment 5 281296001 6 Result comments 7 Result comments (qualifier value) 8 Comment 9 C0947611

communication aids
type: Class
subclass of: Tool
comment: 1 MD05451 2 communication aids 3 None 4 communication aids 5 224900001 6 communication aid 7 Communication aid (physical object) 8 communication aid 9 C0542278

communication media
type: Class
subclass of: Equipment
comment: 1 MD05449 2 communication media 3 None 4 communication media 5 228654009 6 Media 7 Media (qualifier value) 8 Communication 9 C0009452

community
type: Class
subclass of: Characteristics of the community
comment: 1 MD02264 2 community 3 None 4 community 5 133928008 6 Community 7 Community (social concept) 8 Community 9 C0009462

community migration
type: Class
subclass of: Health Related Factors
comment: 1 MD05467 2 community migration 3 None 4 community migration 5 74118003 6 Migration 7 Migration, function (observable entity) 8 Migration 9 C1533574

company corporation
type: Class
subclass of: Hospital Administration
comment: 1 MD00625 2 company corporation 3 None 4 company corporation 5 389109008 6 Group 7 Group (social concept) 8 corporation 9 C0683758

completion status
type: Class
subclass of: Hospital information, examination/diagnosis/treatment data
comment: 1 MD00756 2 completion status 3 None 4 completion status 5 371001000 6 Patient cured 7 Patient cured (finding) 8 completion status 9 C0805732

complication
type: Class
subclass of: Hospital information, examination/diagnosis/treatment data
comment: 1 MD03951 2 complication 3 Complications 4 complication 5 263718001 6 Complication 7 Complication (attribute) 8 Complication 9 C2362589
alternative label: Complications

comportment
type: Class
subclass of: Health Related Factors
comment: 1 M00708 2 comportment 3 None 4 comportment 5 844005 6 Behavior finding 7 Behavior finding (finding) 8 Behavior 9 C0004927

comprehensive
type: Class
subclass of: Questionnaire
comment: 1 MD05143 2 comprehensive 3 None 4 comprehensive 5 737093003 6 Synthesis process 7 Synthesis process (qualifier value) 8 comprehensive 9 C1880156

comprehensive opinion
type: Class
subclass of: Questionnaire
comment: 1 MD05153 2 total opinion contants 3 None 4 comprehensive opinion 5 88952004 6 Thinking 7 Thinking, function (observable entity) 8 Opinions 9 C0871010
alternative label: total opinion contents

compressed socks
type: Class
subclass of: Equipment
comment: 1 MD04429 2 compressed socks 3 None 4 compressed socks 5 9096001 6 Support, device 7 Support, device (physical object) 8 Support, device 9 C0183683

compression stockings
type: Class
subclass of: Equipment
comment: 1 MD04428 2 compression stockings 3 None 4 compression stockings 5 183143005 6 compression stockings 7 Support stockings - garment (physical object) 8 compression stockings 9 C0038348

concentration
type: Class
subclass of: Health Related Factors
comment: 1 MD02163 2 concentration 3 concentrate 4 concentration 5 82742001 6 Concentration 7 Concentration, function (observable entity) 8 Concentration 9 C0086045
comment: 1 MD02163-1 2 concentration 3 concentrate 4 concentration 5 702942001 6 Concentration 7 Concentration (qualifier value) 8 Concentration 9 C0086045
comment: 1 MD02163-2 2 concentration 3 concentrate 4 concentration 5 838500001 6 Able to concentrate 7 Able to concentrate (finding) 8 Able to concentrate (finding) 9 C5241388

condition
type: Class
subclass of: Hospital information, examination/diagnosis/treatment data
comment: 1 MD01443 2 condition 3 None 4 condition 5 260905004 6 Condition 7 Condition (attribute) 8 Condition 9 C0348080

congenital malformation of the musculoskeletal system
type: Class
subclass of: Musculoskeletal function (Symptom)
comment: 1 MD00057 2 congenital malformation of the musculoskeletal system 3 Congenital malformations of musculoskeletal system, NEC 4 congenital malformation of the musculoskeletal system 5 73573004 6 Congenital musculoskeletal abnormality 7 Congenital anomaly of musculoskeletal system (disorder) 8 congenital malformation of the musculoskeletal system 9 C0478080
alternative label: Congenital malformations of musculoskeletal system, NEC

congestion
type: Class
subclass of: Functions of Blood System, Metabolic system and Endocrine system (Symptom)
comment: 1 MD01620 2 congestion 3 None 4 congestion 5 85804007 6 Congestion 7 Congestion (morphologic abnormality) 8 Congestion 9 C0700148

connections
type: Class
subclass of: Units
comment: 1 MD00362 2 connections 3 None 4 connections 5 263538003 6 Connection 7 Connection (attribute) 8 Connection 9 C0449379

connective tissue disorder
type: Class
subclass of: Hospital information, examination/diagnosis/treatment data
comment: 1 MD00346 2 connective tissue disorder 3 None 4 connective tissue disorder 5 105969002 6 Disorder of connective tissue 7 Disorder of connective tissue (disorder) 8 generalized disorders of connective tissue 9 C2317794

considered
type: Class
subclass of: Health Related Factors
comment: 1 MD04971 2 considered 3 None 4 considered 5 844005 6 Behavior finding 7 Behavior finding (finding) 8 Behavior 9 C0004927

considered later
type: Class
subclass of: Questionnaire
comment: 1 MD04969 2 considered later 3 None 4 considered later 5 225599005 6 Social behavior 7 Social behavior (finding) 8 Social Behavior 9 C0037397

constipation
type: Class
subclass of: Digestive function (Symptom)
comment: 1 MD01603 2 constipation 3 constipate Constipated constipating 4 constipation 5 14760008 6 Constipation 7 Constipation (finding) 8 Constipation 9 C0009806
alternative label: Constipated
alternative label: constipate
alternative label: constipating

constrict pupils
type: Class
subclass of: Sensory function, Pain and Skin function (Symptom)
comment: 1 M02691 2 constrict pupils 3 None 4 constrict pupils 5 301939004 6 Constricted pupil 7 Constricted pupil (finding) 8 Constricted pupil 9 C0728710

consultation
type: Class
subclass of: Questionnaire
comment: 1 MD04903 2 consultation 3 None 4 consultation 5 11429006 6 Consultation 7 Consultation (procedure) 8 Consultation 9 C0009818

consultation fee
type: Class
subclass of: Hospital Administration
comment: 1 MD00146 2 consultation fee 3 None 4 consultation fee 5 308590000 6 Payment for service procedure 7 Payment for service procedure (procedure) 8 Fees, Medical 9 C0015754

consultation with business owner
type: Class
subclass of: Questionnaire
comment: 1 MD04901 2 consultation with business owner 3 None 4 consultation with business owner 5 11429006 6 Consultation 7 Consultation (procedure) 8 Consultation 9 C0009818

consume
type: Class
subclass of: Health Related Factors
comment: 1 MD01516 2 consume 3 None 4 consume 5 844005 6 Behavior finding 7 Behavior finding (finding) 8 Behavior 9 C0004927

contact
type: Class
subclass of: Health Related Factors
comment: 1 MD02550 2 contact 3 None 4 contact 5 11723008 6 contact with 7 Contact with (contextual qualifier) (qualifier value) 8 contact with 9 C0332158
comment: 1 MD02550-1 2 contact 3 None 4 contact 5 11723008 6 Contact with 7 Contact with (contextual qualifier) (qualifier value) 8 Contact 9 C5187145

contact information
type: Class
subclass of: Units
comment: 1 MD03289 2 contact information 3 None 4 contact information 5 734005006 6 Telephone number 7 Telephone number (property) (qualifier value) 8 Telephone Number 9 C1515258

content
type: Class
subclass of: Units
comment: 1 MD00908 2 content 3 None 4 content 5 276824008 6 contents 7 Contents (attribute) 8 contents 9 C0456205

continuous peritoneal perfusion
type: Class
subclass of: Urogenital function (Therapy)
comment: 1 MD00241 2 continuous peritoneal perfusion 3 None 4 continuous peritoneal perfusion 5 238319001 6 Continuous cycling peritoneal dialysis 7 Continuous cycling peritoneal dialysis (procedure) 8 Continuous cycling peritoneal dialysis 9 C0405885

control
type: Class
subclass of: Health Related Factors
comment: 1 MD04562 2 control 3 None 4 control 5 246106000 6 Control 7 Control (attribute) 8 Control 9 C2587213

control ability
type: Class
subclass of: Health Related Factors
comment: 1 MD04287 2 control ability 3 None 4 control ability 5 122869004 6 Measurement 7 Measurement procedure (procedure) 8 measurement 9 C0242485

convulsive abdominal pain
type: Class
subclass of: Sensory function, Pain and Skin function (Symptom)
comment: 1 MD01592 2 convulsive abdominal pain 3 None 4 convulsive abdominal pain 5 21522001 6 Abdominal pain 7 Abdominal pain (finding) 8 Abdominal pain 9 C0000737

cool-down
type: Class
subclass of: Health Related Factors
comment: 1 MD02782 2 cool-down 3 None 4 cool-down 5 256235009 6 exercise 7 Exercise (observable entity) 8 Cool-Down Exercise 9 C3658227

coordination
type: Class
subclass of: Units
comment: 1 MD03217 2 coordination 3 None 4 coordination 5 85352007 6 Coordination 7 Coordination (observable entity) 8 Coordination 9 C0242414

copper
type: Class
subclass of: Nutritional management
comment: 1 MD01690 2 copper 3 None 4 copper 5 66925006 6 Copper 7 Copper (substance) 8 Copper 9 C0009968

core and balance
type: Class
subclass of: Musculoskeletal function (Body measurement)
comment: 1 MD02906 2 core and balance 3 None 4 core and balance 5 249982003 6 Balance 7 Balance (observable entity) 8 Core Stability 9 C5544419

core training
type: Class
subclass of: Muscle Strengthening Exercise
comment: 1 MD01676 2 core training 3 None 4 core training 5 118629009 6 Training 7 Functional training (procedure) 8 Training 9 C0220931

cornea
type: Class
subclass of: Sensory function, Pain and Skin function (Body region)
comment: 1 MD06859 2 cornea 3 None 4 cornea 5 28726007 6 Cornea 7 Corneal structure (body structure) 8 Cornea 9 C0010031

coronary artery
type: Class
subclass of: Cardiovascular system function (Body region)
comment: 1 MD00370 2 coronary artery 3 None 4 coronary artery 5 41801008 6 Coronary artery 7 Coronary artery structure (body structure) 8 Coronary artery 9 C0205042

cough
type: Class
subclass of: Digestive function (Symptom)
comment: 1 MD01596 2 cough 3 Functions of coughing coughed 4 cough 5 49727002 6 Cough 7 Cough (finding) 8 Coughing 9 C0010200
alternative label: Functions of coughing

cough up blood
type: Class
subclass of: Respiratory function (Symptom)
comment: 1 M01105 2 cough up blood 3 COUGHING BLOOD, Coughing up blood 4 cough up blood 5 66857006 6 Coughing up blood 7 Hemoptysis (finding) 8 Hemoptysis 9 C0019079

count low blood
type: Class
subclass of: Functions of Blood System, Metabolic system and Endocrine system (Body measurement)
comment: 1 M02736 2 count low blood 3 None 4 count low blood 5 88308000 6 Blood cell count 7 Blood cell count (procedure) 8 blood count low 9 C0850869

counting steps
type: Class
subclass of: Units
comment: 1 MD01981 2 counting steps 3 None 4 counting steps 5 301614006 6 Manages steps 7 Does manage steps (finding) 8 Does manage steps 9 C0578303

covid-19
type: Class
subclass of: Hospital information, examination/diagnosis/treatment data
comment: 1 MD00967 2 covid-19 3 None 4 covid-19 5 840539006 6 COVID-19 7 Disease caused by severe acute respiratory syndrome coronavirus 2 (disorder) 8 COVID19 (disease) 9 C5203670

cpm
type: Class
subclass of: Immune system function (Therapy)
comment: 1 M03567 2 cpm 3 None 4 cpm 5 258735001 6 cpm 7 Counts per minute (qualifier value) 8 Counts per minute 9 C0392412
comment: 1 M03567-1 2 cpm 3 None 4 cpm 5 258735001 6 cpm 7 Counts per minute (qualifier value) 8 cyclophosphamide 9 C0010583
comment: 1 M03567-2 2 cpm 3 None 4 cpm 5 387420009 6 CPM 7 Cyclophosphamide (substance) 8 Counts per minute 9 C0392412
comment: 1 M03567-3 2 cpm 3 None 4 cpm 5 387420009 6 CPM 7 Cyclophosphamide (substance) 8 cyclophosphamide 9 C0010583

create time
type: Class
subclass of: Time
comment: Time patterns Time None 1 MD02040 2 create time 3 None 4 create time 5 272103003 6 Time patterns 7 Time patterns (qualifier value) 8 Time patterns 9 C0439546

creatine
type: Class
subclass of: Urogenital function (Body measurement)
comment: 1 MD03058 2 creatine 3 None 4 creatine 5 14804005 6 Creatine 7 Creatine (substance) 8 Creatine 9 C0010286

cried
type: Class
subclass of: Nervous system and Mental function (Symptom)
comment: 1 MD02232 2 cried 3 None 4 cried 5 8263002 6 Crying 7 Crying (observable entity) 8 Crying 9 C0010399

cross-training
type: Class
subclass of: Muscle Strengthening Exercise
comment: 1 MD01677 2 cross-training 3 None 4 cross-training 5 118629009 6 Training 7 Functional training (procedure) 8 Training 9 C0220931

cross leg jump
type: Class
subclass of: Health Related Factors
comment: 1 MD02802 2 cross leg jump 3 None 4 cross leg jump 5 256235009 6 exercise 7 Exercise (observable entity) 8 Cool-Down Exercise 9 C3658227

crunch
type: Class
subclass of: Sport
comment: 1 MD01364 2 crunch 3 CRUNCHES 4 crunch 5 229144001 6 abdominal exercies 7 Abdominal exercises (regime/therapy) 8 Abdominal exercises 9 C0454354
alternative label: CRUNCHES

cu mm
type: Class
subclass of: Units
comment: 1 M03808 2 cu mm 3 None 4 cu mm 5 258774008 6 cubic millimeter 7 Microliter (qualifier value) 8 cubic millimeter 9 C0439243

cubic metre
type: Class
subclass of: Units
comment: 1 M04727 2 cubic metre 3 None 4 cubic metre 5 396154006 6 Cubic metre 7 Cubic meter (qualifier value) 8 Cubic metre 9 C1300554
alternative label: Cubic Meter

cup
type: Class
subclass of: Equipment
comment: 1 MD04539 2 cup 3 None 4 cup 5 428178003 6 Cup 7 Cup - unit of product usage (qualifier value) 8 Cup 9 C1880197
comment: 1 MD04539-1 2 cup 3 None 4 cup 5 428178003 6 Cup 7 Cup - unit of product usage (qualifier value) 8 Cup 9 C3853579
comment: 1 MD04539-2 2 cup 3 None 4 cup 5 428178003 6 Cup 7 Cup - unit of product usage (qualifier value) 8 Cup 9 C4319644
comment: 1 MD04539-3 2 cup 3 None 4 cup 5 706432008 6 Cup 7 Cup (physical object) 8 Cup 9 C1880197
comment: 1 MD04539-4 2 cup 3 None 4 cup 5 706432008 6 Cup 7 Cup (physical object) 8 Cup 9 C3853579
comment: 1 MD04539-5 2 cup 3 None 4 cup 5 706432008 6 Cup 7 Cup (physical object) 8 Cup 9 C4319644
comment: 1 MD04539-6 2 cup 3 None 4 cup 5 732991008 6 Cup 7 Cup (unit of presentation) 8 Cup 9 C1880197
comment: 1 MD04539-7 2 cup 3 None 4 cup 5 732991008 6 Cup 7 Cup (unit of presentation) 8 Cup 9 C3853579
comment: 1 MD04539-8 2 cup 3 None 4 cup 5 732991008 6 Cup 7 Cup (unit of presentation) 8 Cup 9 C4319644

cup capacity
type: Class
subclass of: Units
comment: 1 MD01282 2 cup capacity 3 None 4 cup capacity 5 118565006 6 Volume 7 Volume (property) (qualifier value) 8 Capacity 9 C1516240

current
type: Class
subclass of: Units
comment: 1 MD00856 2 current 3 None 4 current 5 15240007 6 Current 7 Current (qualifier value) 8 Current (present time) 9 C0521116

current total number of steps
type: Class
subclass of: Aerobic Exercise
comment: 1 MD01829 2 current total number of steps 3 None 4 current total number of steps 5 398298007 6 Step 7 Step (qualifier value) 8 Number of steps 9 C1651669

cushing syndrome
type: Class
subclass of: Functions of Blood System, Metabolic system and Endocrine system (Symptom)
comment: 1 MD00318 2 cushing syndrome 3 None 4 cushing syndrome 5 237735008 6 Cushing syndrome 7 Adrenal Cushing's syndrome (disorder) 8 Adrenal Cushing's syndrome 9 C0342443

cutaneous eruption on skin
type: Class
subclass of: Sensory function, Pain and Skin function (Symptom)
comment: 1 M00953 2 cutaneous eruption on skin 3 None 4 cutaneous eruption on skin 5 271807003 6 Eruption 7 Eruption of skin (disorder) 8 Eruption of skin present 9 C5395697

cutaneous vascular engorgement
type: Class
subclass of: Cardiovascular system function (Symptom)
comment: 1 M01030 2 cutaneous vascular engorgement 3 None 4 cutaneous vascular engorgement 5 400042000 6 Cutaneous vascular malformation 7 Cutaneous vascular malformation (disorder) 8 Cutaneous vascular malformation 9 C1302793

cycle
type: Class
subclass of: Frequency
comment: 1 MD01510 2 cycle 3 None 4 cycle 5 259025008 6 cycles/s 7 Hertz (qualifier value) 8 event cycle 9 C1511572
comment: 1 MD02078 2 cycle 3 None 4 cycle 5 259025008 6 cycles/s 7 Hertz (qualifier value) 8 Hertz (Hz) 9 C0439482

cycle prediction
type: Class
subclass of: Frequency
comment: 1 MD01511 2 cycle prediction 3 None 4 cycle prediction 5 259025008 6 cycles/s 7 Hertz (qualifier value) 8 event cycle 9 C1511572

cycling distance
type: Class
subclass of: Units
comment: 1 MD01647 2 cycling distance 3 None 4 cycling distance 5 246132006 6 Distance 7 Distance (qualifier value) 8 cycling distance 9 C5212380

cycling pedaling cadence
type: Class
subclass of: Units
comment: 1 MD01099 2 cycling pedaling cadence 3 cycling cadence 4 cycling pedaling cadence 5 260698009 6 Method of cycling 7 Method of cycling (attribute) 8 Method of cycling 9 C0449333
alternative label: cycling cadence

cycling pedaling cumulative
type: Class
subclass of: Sport
comment: 1 MD01102 2 cycling pedaling cumulative 3 cycling cumulative 4 cycling pedaling cumulative 5 260698009 6 Method of cycling 7 Method of cycling (attribute) 8 Method of cycling 9 C0449333
alternative label: cycling cumulative

cyclocross
type: Class
subclass of: Sport
comment: 1 MD02547 2 cyclocross 3 None 4 cyclocross 5 300648001 6 Rides a bicycle 7 Does ride a bicycle (finding) 8 Does ride a bicycle (finding) 9 C0577368

http://www.semanticweb.org/user/ontologies/2023/10/untitled-ontology-5#d
type: Class
subclass of: Units
comment: 1 M02913 2 d 3 None 4 d 5 257986001 6 d 7 Lower case Roman letter d (qualifier value) 8 Lower case Roman letter d 9 C0439129
comment: 1 M02913-1 2 d 3 None 4 d 5 257986001 6 d 7 Lower case Roman letter d (qualifier value) 8 Upper case Roman letter D 9 C0439107
comment: 1 M02913-2 2 d 3 None 4 d 5 421450004 6 D 7 Upper case Roman letter D (qualifier value) 8 Lower case Roman letter d 9 C0439129
comment: 1 M02913-3 2 d 3 None 4 d 5 421450004 6 D 7 Upper case Roman letter D (qualifier value) 8 Upper case Roman letter D 9 C0439107

dB
type: Class
subclass of: Units
comment: 1 M03037 2 dB 3 None 4 dB 5 259042002 6 dB 7 decibel (qualifier value) 8 decibel 9 C0439497

dB HL
type: Class
subclass of: Units
comment: 1 M03038 2 dB HL 3 None 4 dB HL 5 259043007 6 dB HL 7 decibel hearing level (qualifier value) 8 dB HL 9 C0439498

dB SPL
type: Class
subclass of: Units
comment: 1 M03039 2 dB SPL 3 None 4 dB SPL 5 259044001 6 dB SPL 7 decibel sound perception level (qualifier value) 8 dB SPL 9 C0439499

daily
type: Class
subclass of: Day
comment: 1 MD01286 2 daily 3 None 4 daily 5 69620002 6 Daily 7 Daily (qualifier value) 8 Daily 9 C0332173

daily activity time
type: Class
subclass of: Minute
comment: 1 MD01293 2 daily activity time 3 None 4 daily activity time 5 255257008 6 exercise time 7 Exercise time (qualifier value) 8 Time 9 C0040223

daily calorie
type: Class
subclass of: Units
comment: 1 MD01380 2 daily calorie 3 None 4 daily calorie 5 258790008 6 calorie 7 calorie (qualifier value) 8 calorie unit of energy 9 C1879985

daily condition score
type: Class
subclass of: Units
comment: 1 MD01741 2 daily condition score 3 None 4 daily condition score 5 246262008 6 Score (attribute) 7 Score (attribute) 8 Score 9 C0449820

daily life
type: Class
subclass of: Health Related Factors
comment: 1 MD02267 2 daily life 3 None 4 daily life 5 69620002 6 Daily 7 Daily (qualifier value) 8 Daily 9 C0332173
comment: 1 MD02267-1 2 daily life 3 None 4 daily life 5 129025006 6 Activity of daily living 7 Activity of daily living (observable entity) 8 Activities of Daily Living (activity) 9 C0001288

daily living
type: Class
subclass of: Health Related Factors
comment: 1 MD05335 2 daily living 3 None 4 daily living 5 129025006 6 Activity of daily living 7 Activity of daily living (observable entity) 8 Activities 9 C0441655

daily target attainment rate
type: Class
subclass of: Hospital information, examination/diagnosis/treatment data
comment: 1 MD01786 2 daily target attainment rate 3 None 4 daily target attainment rate 5 390800000 6 Goal achievement finding 7 Goal achievement finding (finding) 8 Goal achievement finding 9 C1272275

daily walk
type: Class
subclass of: Aerobic Exercise
comment: 1 MD01284 2 daily walk 3 None 4 daily walk 5 129006008 6 walking 7 Walking (observable entity) 8 Walking (activity) 9 C0080331
comment: 1 MD01284-1 2 daily walk 3 None 4 daily walk 5 870595007 6 walking 7 Walking (qualifier value) 8 Walking (activity) 9 C0080331

daily walk duration
type: Class
subclass of: Questionnaire
comment: 1 MD02099 2 daily walk duration 3 None 4 daily walk duration 5 282146009 6 Walks 7 Does walk (finding) 8 Does walk 9 C0600108

dance
type: Class
subclass of: Sport
comment: 1 M00849 2 dance 3 dances, Dancing, Dancings 4 dance 5 69711002 6 Dance therapy 7 Dance therapy (regime/therapy) 8 Dancing 9 C0010963
alternative label: Dancings
alternative label: Dancing
alternative label: dances

date
type: Class
subclass of: Day
comment: 1 MD00693 2 date 3 None 4 date 5 410671006 6 Date 7 Date (attribute) 8 Date in time 9 C0011008
comment: 1 MD00693-1 2 date 3 None 4 date 5 410672004 6 Date 7 Date property (qualifier value) 8 Date in time 9 C0011008

date of onset
type: Class
subclass of: Day
comment: 1 MD02637 2 date of onset 3 Onset Date 4 date of onset 5 298059007 6 Date of onset 7 Date of onset (observable entity) 8 Date of onset 9 C0574845
alternative label: Onset Date

date of registration
type: Class
subclass of: Day
comment: 1 MD00559 2 date of registration 3 None 4 date of registration 5 30782700 6 Registration status 7 Registration status (finding) 8 Registration status 9 C0585727

day
type: Class
subclass of: Questionnaire
comment: 1 MD02091 2 day 3 days 4 day 5 258703001 6 day 7 day (qualifier value) 8 day 9 C0439228
alternative label: days

day glasses
type: Class
subclass of: Units
comment: 1 M04614 2 day glasses 3 None 4 day glasses 5 228949002 6 glasses/day 7 glasses/day (qualifier value) 8 glasses/day 9 C0560658

day hour
type: Class
subclass of: Units
comment: 1 M04524 2 day hour 3 day hours 4 day hour 5 229788003 6 hours/day 7 hours/day (qualifier value) 8 hours/day 9 C0556975
alternative label: day hours

day job
type: Class
subclass of: Duration
comment: 1 MD04929 2 day job 3 None 4 day job 5 224361009 6 Type of job 7 Type of job (observable entity) 8 Type of job 9 C0557350

day mg
type: Class
subclass of: Units
comment: 1 M04207 2 day mg 3 None 4 day mg 5 258836006 6 Milligrams/24 hours 7 Milligrams/24 hours (qualifier value) 8 Milligrams/24 hours 9 C0439422

day of disaster
type: Class
subclass of: Day
comment: 1 MD04877 2 day of disaster 3 None 4 day of disaster 5 386477002 6 Triage: disaster 7 Triage: disaster (procedure) 8 Disasters 9 C0012618

day per time
type: Class
subclass of: Units
comment: 1 M04367 2 day per time 3 None 4 day per time 5 767525000 6 Unit 7 Unit (qualifier value) 8 times/day 9 C0439511

day time
type: Class
subclass of: Time
comment: 1 MD02049 2 day time 3 day times 4 day time 5 259083004 6 times/day 7 times/day (qualifier value) 8 times/day 9 C0439511
alternative label: day times

day year
type: Class
subclass of: Units
comment: 1 M04520 2 day year 3 days year 4 day year 5 229786004 6 days/year 7 days/year (qualifier value) 8 days/year 9 C0556972
alternative label: days year

days month
type: Class
subclass of: Units
comment: 1 M04518 2 days month 3 None 4 days month 5 229785000 6 days per month 7 days/month (qualifier value) 8 days per month 9 C0556971

days of walk
type: Class
subclass of: Questionnaire
comment: 1 MD02089 2 days of walk 3 None 4 days of walk 5 870595007 6 Walking 7 Walking (qualifier value) 8 Walking (activity) 9 C0080331

days per month
type: Class
subclass of: Units
comment: 1 M04517 2 days per month 3 days/month 4 days per month 5 229785000 6 days per month 7 days/month (qualifier value) 8 days per month 9 C0556971
alternative label: days/month

days week
type: Class
subclass of: Units
comment: 1 M04699 2 days week 3 None 4 days week 5 229784000 6 days per week 7 days/week (qualifier value) 8 days per week 9 C0677546

daytime
type: Class
subclass of: Time
comment: 1 MD02158 2 daytime 3 None 4 daytime 5 28017001 6 Daytime 7 Daytime (qualifier value) 8 Daytime 9 C0332169

deadlift
type: Class
subclass of: Sport
comment: 1 MD01309 2 deadlift 3 None 4 deadlift 5 258141001 6 lifting 7 Lifting (observable entity) 8 Lifting 9 C0206244

decibel
type: Class
subclass of: Units
comment: 1 M04353 2 decibel 3 decibels 4 decibel 5 259042002 6 decibel 7 decibel (qualifier value) 8 decibel 9 C0439497
alternative label: decibels

decibel hearing level
type: Class
subclass of: Units
comment: 1 M04354 2 decibel hearing level 3 None 4 decibel hearing level 5 259043007 6 decibel hearing level 7 decibel hearing level (qualifier value) 8 decibel hearing level 9 C0439498

decibel sound perception level
type: Class
subclass of: Units
comment: 1 M04355 2 decibel sound perception level 3 None 4 decibel sound perception level 5 259044001 6 decibel sound perception level 7 decibel sound perception level (qualifier value) 8 decibel sound perception level 9 C0439499

decline distance
type: Class
subclass of: Units
comment: 1 MD02061 2 decline distance 3 None 4 decline distance 5 246132006 6 Distance 7 Distance (qualifier value) 8 Distance 9 C0012752

decompression
type: Class
subclass of: Health Related Factors
comment: 1 MD02544 2 decompression 3 None 4 decompression 5 281613004 6 Decompression 7 Decompression - action (qualifier value) 8 Decompression 9 C1829459
comment: 1 MD02544-1 2 decompression 3 None 4 decompression 5 281613004 6 Decompression 7 Decompression - action (qualifier value) 8 Decompression 9 C1965697
comment: 1 MD02544-2 2 decompression 3 None 4 decompression 5 424128006 6 Decompression 7 Decompression (procedure) 8 Decompression 9 C1829459
comment: 1 MD02544-3 2 decompression 3 None 4 decompression 5 424128006 6 Decompression 7 Decompression (procedure) 8 Decompression 9 C1965697

decreased energy
type: Class
subclass of: Nutritional status
comment: 1 M00984 2 decreased energy 3 None 4 decreased energy 5 84229001 6 Fatigue 7 Fatigue (finding) 8 Fatigue 9 C0015672

decreased respiratory rate
type: Class
subclass of: Respiratory function (Body measurement)
comment: 1 M01876 2 decreased respiratory rate 3 None 4 decreased respiratory rate 5 86290005 6 Respiratory rate 7 Respiratory rate (observable entity) 8 Slow respiration 9 C0231837

deep Sleep
type: Class
subclass of: Individual Related Factors
comment: 1 MD02543 2 deep sleep 3 None 4 deep Sleep 5 60984000 6 Deep sleep 7 Non-rapid eye movement sleep, function (observable entity) 8 Deep sleep 9 C0234451

defecation
type: Class
subclass of: Health Related Factors
comment: 1 MD01449 2 defecation 3 Defecation functions 4 defecation 5 111989001 6 Defecation 7 Defecation (observable entity) 8 Defecation 9 C0011135
alternative label: Defecation functions

defect
type: Class
subclass of: Units
comment: 1 MD00304 2 defect 3 None 4 defect 5 241775008 6 Faulty 7 Faulty (qualifier value) 8 Faulty 9 C1280014

deficiency nutritional
type: Class
subclass of: Nutritional status
comment: 1 M01730 2 deficiency nutritional 3 deficiencies nutritional 4 deficiency nutritional 5 70241007 6 Nutritional deficiencies 7 Nutritional deficiency disorder (disorder) 8 Nutritional Deficiency 9 C4761312
alternative label: deficiencies nutritional

deformation
type: Class
subclass of: Hospital information, examination/diagnosis/treatment data
comment: 1 MD00375 2 deformation 3 deformity 4 deformation 5 6081001 6 Deformity 7 Deformity (morphologic abnormality) 8 Deformity 9 C0302142
alternative label: deformity

deg
type: Class
subclass of: Units
comment: 1 M03570 2 deg 3 None 4 deg 5 246173007 6 Degree 7 Degree (attribute) 8 Degree Unit of Plane Angle 9 C2348088

degree
type: Class
subclass of: Units
comment: 1 MD00540 2 degree 3 None 4 degree 5 246173007 6 Degree 7 Degree (attribute) 8 Degree or extent 9 C0449286

degree of disability
type: Class
subclass of: Hospital information, examination/diagnosis/treatment data
comment: 1 MD03299 2 degree of disability 3 None 4 degree of disability 5 246173007 6 Disability 7 Disability (finding) 8 degree 9 C0449286
comment: 1 MD03950 2 degree of disability 3 None 4 degree of disability 5 21134002 6 Disability 7 Disability (finding) 8 Disability 9 C0231170

degree of performance
type: Class
subclass of: Questionnaire
comment: 1 MD05164 2 degree of performance 3 None 4 degree of performance 5 241000124106 6 Performance measure status 7 Performance measure status (finding) 8 Performance measure status 9 C3266294

degrees C
type: Class
subclass of: Units
comment: 1 M03786 2 degrees C 3 None 4 degrees C 5 258710007 6 degrees C 7 Degrees Celsius (qualifier value) 8 degrees C 9 C0439237

degrees F
type: Class
subclass of: Units
comment: 1 M04400 2 degrees F 3 None 4 degrees F 5 258712004 6 degrees F 7 Degrees Fahrenheit (qualifier value) 8 degrees F 9 C0456628

degrees centigrade
type: Class
subclass of: Units
comment: 1 M03784 2 degrees centigrade 3 None 4 degrees centigrade 5 258710007 6 degrees C 7 Degrees Celsius (qualifier value) 8 Degrees Celsius 9 C0439237

deitary energy
type: Class
subclass of: Nutritional management
comment: 1 MD01711 2 deitary energy 3 None 4 deitary energy 5 405032000 6 Nutritional status: energy 7 Nutritional status: energy (observable entity) 8 Unit of dietary energy measurement 9 C0556600

density
type: Class
subclass of: Units
comment: 1 MD03010 2 density 3 None 4 density 5 125146005 6 Density 7 Density (qualifier value) 8 Density 9 C0178587

dental
type: Class
subclass of: Classification of Hospital
comment: 1 MD00196 2 dental 3 Dentistry 4 dental 5 738906000 6 Dental 7 Dental (intended site) 8 Dental 9 C0226984
alternative label: Dentistry

dental admission
type: Class
subclass of: Hospital Administration
comment: 1 MD00109 2 dental admission 3 None 4 dental admission 5 305298005 6 Admission by dental surgeon 7 Admission by dental surgeon (procedure) 8 Dental Health Services 9 C0011365

dental outpatient
type: Class
subclass of: Hospital Administration
comment: 1 MD00110 2 dental outpatient 3 None 4 dental outpatient 5 312887003 6 Attends outpatients 7 Attending clinic (finding) 8 Outpatient care management 9 C4545175

dental subtotal
type: Class
subclass of: Hospital Administration
comment: 1 MD00667 2 dental subtotal 3 None 4 dental subtotal 5 738906000 6 Dental 7 Dental (intended site) 8 Dental 9 C0226984

dentistry Clinic
type: Class
subclass of: Classification of Hospital
comment: 1 MD00134 2 dentistry Clinic 3 None 4 dentistry Clinic 5 702846002 6 Dental clinic 7 Dental clinic (environment) 8 Dental Clinics 9 C0011344

dentistry Korean traditional medicine
type: Class
subclass of: Classification of Hospital
comment: 1 MD00124 2 dentistry_Korean traditional medicine 3 None 4 dentistry_Korean traditional medicine 5 722163006 6 Dentistry 7 Dentistry (qualifier value) 8 Dentistry 9 C0011438

dentistry hospital
type: Class
subclass of: Classification of Hospital
comment: 1 MD00133 2 dentistry hospital 3 None 4 dentistry hospital 5 448399001 6 Dental hospital 7 Dental hospital (environment) 8 Dental hospital 9 C3164440

department
type: Class
subclass of: Hospital Administration
comment: 1 MD04914 2 department 3 None 4 department 5 257649000 6 Office 7 Office (environment) 8 department 9 C1704729

depression
type: Class
subclass of: Immune system function (Symptom)
subclass of: Nervous system and Mental function (Symptom)
comment: Symptom Nervous system and Mental function None 1 MD00947-1 2 depression 3 depressed 4 depression 5 255339005 6 Depression 7 Depression - motion (qualifier value) 8 Depression motion 9 C0460137
comment: Symptom Nervous system and Mental function None 1 MD00947-2 2 depression 3 depressed 4 depression 5 35489007 6 Depression 7 Depressive disorder (disorder) 8 Depressive disorder 9 C0011581
comment: Symptom Nervous system and Mental function None 1 MD00947-3 2 depression 3 depressed 4 depression 5 35489007 6 Depression 7 Depressive disorder (disorder) 8 Depression motion 9 C0460137
comment: Symptom Immune system function None 1 MD02221 2 depression 3 None 4 depression 5 35489007 6 Depressed 7 Depressive disorder (disorder) 8 Depressed 9 C0344315
comment: Symptom Nervous system and Mental function None 1 MD00947 2 depression 3 depressed 4 depression 5 255339005 6 Depression 7 Depression - motion (qualifier value) 8 Depressive disorder 9 C0011581

depth of respiration
type: Class
subclass of: Respiratory function (Body measurement)
comment: 1 MD05875 2 depth of respiration 3 None 4 depth of respiration 5 271626009 6 Depth of respiration 7 Depth of respiration (observable entity) 8 Depth of respiration 9 C0520826

descent
type: Class
subclass of: Units
comment: 1 MD02541 2 descent 3 None 4 descent 5 255518004 6 down 7 Down (qualifier value) 8 descent 9 C0680043

desired
type: Class
subclass of: Health Related Factors
comment: 1 MD04957 2 desired 3 None 4 desired 5 410526009 6 Wanted 7 Wanted (qualifier value) 8 Wanted 9 C1444647

dessert
type: Class
subclass of: Nutritional management
comment: 1 MD01428 2 dessert 3 None 4 dessert 5 227682004 6 Dessert 7 Dessert (substance) 8 Dessert 9 C0453505

detailed action
type: Class
subclass of: Questionnaire
comment: 1 MD05551 2 detailed action 3 Detailed actions, Detailed motion 4 detailed action 5 129264002 6 Action 7 Action (qualifier value) 8 Abate (action) 9 C3853704
alternative label: Detailed motion
alternative label: Detailed actions

developmental disorder
type: Class
subclass of: Hospital information, examination/diagnosis/treatment data
comment: 1 MD02831 2 developmental disorder 3 None 4 developmental disorder 5 5294002 6 Developmental disorder 7 Developmental disorder (disorder) 8 Developmental disorder 9 C0008073

device
type: Class
subclass of: Device
comment: 1 MD02540 2 device 3 None 4 device 5 49062001 6 Device 7 Device (physical object) 8 Device 9 C0699733

device Name
type: Class
subclass of: Units
comment: 1 MD02539 2 device Name 3 None 4 device Name 5 49062001 6 decvice 7 Device (physical object) 8 decvice 9 C0699733

diagnosis
type: Class
subclass of: Hospital information, examination/diagnosis/treatment data
comment: 1 MD03296 2 Diagnosis 3 diagnosis 4 diagnosis 5 439401001 6 Diagnosis 7 Diagnosis (observable entity) 8 Diagnosis 9 C0011900

diagnosis date
type: Class
subclass of: Day
comment: 1 MD00884 2 diagnosis date 3 None 4 diagnosis date 5 432213005 6 date of diagnosis 7 Date of diagnosis (observable entity) 8 date of diagnosis 9 C2316983
alternative label: date of diagnosis

diapers
type: Class
subclass of: Questionnaire
comment: 1 MD05417 2 diapers 3 None 4 diapers 5 52065008 6 Diaper 7 Diaper, device (physical object) 8 Diaper 9 C0180416

diaphragm
type: Class
subclass of: Respiratory function (Body region)
comment: 1 MD06951 2 diaphragm 3 Functions of the diaphragm 4 diaphragm 5 5798000 6 Diaphragm 7 Diaphragm structure (body structure) 8 Diaphragm 9 C0011980
alternative label: Functions of the diaphragm

diarrhea
type: Class
subclass of: Digestive function (Symptom)
comment: 1 MD01608 2 diarrhea 3 None 4 diarrhea 5 62315008 6 Diarrhea 7 Diarrhea (finding) 8 Diarrhea 9 C0011991

diarrhea running
type: Class
subclass of: Digestive function (Symptom)
comment: 1 M00853 2 diarrhea running 3 None 4 diarrhea running 5 62315008 6 Diarrhea 7 Diarrhea (finding) 8 Diarrhea 9 C0011991

diastematomyelia
type: Class
subclass of: Nervous system and Mental function (Symptom)
comment: 1 MD00438 2 diastematomyelia 3 None 4 diastematomyelia 5 445308004 6 Diastematomyelia 7 Split spinal cord malformation (disorder) 8 Diastematomyelia 9 C0011999

diastolic hypotension
type: Class
subclass of: Cardiovascular system function (Body measurement)
comment: 1 M02360 2 diastolic hypotension 3 None 4 diastolic hypotension 5 271650006 6 Diastolic blood pressure 7 Diastolic blood pressure (observable entity) 8 Diastolic blood pressure 9 C0428883

diet
type: Class
subclass of: Nutritional management
comment: 1 MD01262 2 diet 3 None 4 diet 5 41829006 6 Diet 7 Dietary finding (finding) 8 Diet 9 C0012155
comment: 1 MD01266 2 Sodium 3 None 4 sodium 5 39972003 6 Sodium 7 Sodium (substance) 8 Sodium 9 C0037473

diet classification
type: Class
subclass of: Nutritional management
comment: 1 MD01422 2 diet classification 3 None 4 diet classification 5 41829006 6 Diet 7 Dietary finding (finding) 8 Diet 9 C0012156

diet score
type: Class
subclass of: Nutritional management
comment: 1 MD01421 2 diet score 3 None 4 diet score 5 41829006 6 Diet 7 Dietary finding (finding) 8 Diet 9 C0012155

dietary fiber
type: Class
subclass of: Nutritional management
comment: 1 MD01134 2 dietary fiber 3 None 4 dietary fiber 5 226268004 6 Dietary fiber requirement 7 Dietary fiber requirement (observable entity) 8 dietary fiber 9 C0012173

dietary sugars
type: Class
subclass of: Nutritional management
comment: 1 MD01710 2 dietary sugars 3 None 4 dietary sugars 5 74801000 6 Sugar 7 Simple carbohydrate (substance) 8 dietary sugars 9 C0376596

dinner
type: Class
subclass of: Nutrient intake
subclass of: Nutritional management
comment: 1 MD01387 2 dinner 3 None 4 dinner 5 769559008 6 Dinner 7 With dinner (qualifier value) 8 With dinner 9 C4552592
comment: Nutrition Nutritional management None 1 MD01426 2 dinner 3 None 4 dinner 5 769559008 6 Dinner 7 With dinner (qualifier value) 8 Dinner 9 C4048877

dinner snack
type: Class
subclass of: Nutrient intake
comment: 1 MD01392 2 dinner snack 3 None 4 dinner snack 5 307164005 6 snack time 7 Snack time (qualifier value) 8 Snack time 9 C0585041

diopters
type: Class
subclass of: Units
comment: 1 M04342 2 diopters 3 diopter dioptres dioptre 4 diopters 5 259047008 6 Diopters 7 Diopters (qualifier value) 8 Diopters 9 C0439484
alternative label: dioptre
alternative label: dioptres
alternative label: diopter

disability
type: Class
subclass of: Body functions of disability
comment: 1 MD02855 2 disability 3 None 4 disability 5 21134002 6 Disability 7 Disability (finding) 8 Disability 9 C0231170

disability rating
type: Class
subclass of: Hospital Administration
comment: 1 MD00573 2 disability rating 3 None 4 disability rating 5 273421001 6 Disability rating scale 7 Disability rating scale (assessment scale) 8 Disability rating scale 9 C0451125

disabled person
type: Class
subclass of: Units
comment: 1 MD04312 2 disabled person 3 Disabled Persons 4 disabled person 5 21134002 6 Disability 7 Disability (finding) 8 disabled persons 9 C0018576

disaster victims
type: Class
subclass of: Hospital information, examination/diagnosis/treatment data
comment: 1 MD04895 2 disaster victims 3 None 4 disaster victims 5 698719009 6 Victim of tsunami 7 Victim of tsunami (finding) 8 Disaster Victims 9 C1405990
comment: 1 MD04946 2 disaster victims 3 None 4 disaster victims 5 900000000000446008 6 Description type 7 Description type (core metadata concept) 8 Job Description 9 C0022396

discus
type: Class
subclass of: Sport
comment: 1 MD01245 2 discus 3 None 4 discus 5 256235009 6 Exercise 7 Exercise (observable entity) 8 Discus 9 C1036711

disease recognition
type: Class
subclass of: Hospital information, examination/diagnosis/treatment data
comment: 1 MD00786 2 disease recognition 3 None 4 disease recognition 5 312020002 6 Recognition 7 Recognition, funtion (obserable entity) 8 Identity Recognition 9 C4046107

disorder of adrenal gland
type: Class
subclass of: Functions of Blood System, Metabolic system and Endocrine system (Symptom)
comment: 1 MD00320 2 disorder of adrenal gland 3 None 4 disorder of adrenal gland 5 30171000 6 Disorder of adrenal gland 7 Disorder of adrenal gland (disorder) 8 Adrenal Gland Diseases 9 C0001621

disorders mood
type: Class
subclass of: Nervous system and Mental function (Symptom)
comment: 1 M02608 2 disorders mood 3 None 4 disorders mood 5 46206005 6 Mood disorder 7 Mood disorder (disorder) 8 Mood Disorders 9 C0525045

disorders syncope
type: Class
subclass of: Nervous system and Mental function (Symptom)
comment: 1 M01456 2 disorders syncope 3 None 4 disorders syncope 5 271594007 6 Syncope 7 Syncope (finding) 8 Head 9 C0018670

distance
type: Class
subclass of: Units
comment: 1 MD02047 2 Distance 3 distance 4 distance 5 246132006 6 Distance 7 Distance (qualifier value) 8 Distance 9 C0012751

distance traveled
type: Class
subclass of: Units
comment: 1 MD02725 2 distance traveled 3 None 4 distance traveled 5 246132006 6 distance 7 Distance (qualifier value) 8 Distance 9 C0012751

disturbances
type: Class
subclass of: Body functions of disability
comment: 1 MD02930 2 disturbances 3 None 4 disturbances 5 40226000 6 Impairment 7 Impairment (finding) 8 Disturbance 9 C2699787

diving
type: Class
subclass of: Aerobic Exercise
comment: 1 MD02536 2 diving 3 dive, Divings 4 diving 5 63498000 6 Diving 7 Diving (qualifier value) 8 Diving 9 C0012823
alternative label: Divings
alternative label: dive

dizziness
type: Class
subclass of: Nervous system and Mental function (Symptom)
comment: 1 MD01633 2 dizziness 3 None 4 dizziness 5 404640003 6 Dizziness 7 Dizziness (finding) 8 Dizziness 9 C0012833

dm3
type: Class
subclass of: Units
comment: 1 M04484 2 dm3 3 None 4 dm3 5 767525000 6 Unit 7 Unit (qualifier value) 8 Unit 9 C0439148

dmol
type: Class
subclass of: Units
comment: 1 M03569 2 dmol 3 None 4 dmol 5 258717005 6 mole 7 mole - unit (qualifier value) 8 Decimole 9 C2348083

do not lock the door
type: Class
subclass of: Questionnaire
comment: 1 MD05310 2 do not lock the door 3 None 4 do not lock the door 5 273389003 6 Daily activities questionnaire 7 Daily activities questionnaire (assessment scale) 8 Daily activities questionnaire 9 C0451094

do not manage money at all
type: Class
subclass of: Questionnaire
comment: 1 MD05280 2 do not manage money at all 3 None 4 do not manage money at all 5 273389003 6 Daily activities questionnaire 7 Daily activities questionnaire (assessment scale) 8 Daily activities questionnaire 9 C0451094

do or do not No
type: Class
subclass of: Questionnaire
comment: 1 MD05341 2 do or do not No 3 None 4 do or do not No 5 373067005 6 No 7 No (qualifier value) 8 No 9 C1298908

do or do not yes
type: Class
subclass of: Questionnaire
comment: 1 MD05344 2 do or do not yes 3 None 4 do or do not yes 5 373066001 6 Yes 7 Yes (qualifier value) 8 Yes 9 C1298907

doctor
type: Class
subclass of: Hospital information, examination/diagnosis/treatment data
comment: 1 MD04984 2 doctor 3 None 4 doctor 5 158965000 6 Doctor 7 Medical practitioner (occupation) 8 Doctor 9 C0031831

dog posture
type: Class
subclass of: Conditioning exercise
comment: 1 MD02844 2 dog posture 3 None 4 dog posture 5 256235009 6 exercise 7 Exercise (observable entity) 8 Exercise 9 C0015259

doing housework
type: Class
subclass of: Health Related Factors
comment: 1 MD05249 2 doing housework 3 None 4 doing housework 5 129014002 6 Doing housework 7 Doing housework (observable entity) 8 Doing housework 9 C1571726

donor
type: Class
subclass of: Classification of Patient
comment: 1 MD00277 2 donor 3 None 4 donor 5 430792005 6 Stem cell donor 7 Stem cell donor (person) 8 Donor person 9 C0013018

door
type: Class
subclass of: Equipment
comment: 1 MD04546 2 door 3 None 4 door 5 224751004 6 Door 7 Door (physical object) 8 Door 9 C0557698

dorsiflexion
type: Class
subclass of: Health Related Factors
comment: 1 MD03463 2 dorsiflexion 3 Dorsiflexion 4 dorsiflexion 5 71496008 6 Dorsiflexion of ankle 7 Dorsiflexion of foot, function (observable entity) 8 right ankle dorsiflexion 9 C2196482
comment: 1 MD03463-1 2 dorsiflexion 3 Dorsiflexion 4 dorsiflexion 5 71496008 6 Dorsiflexion of ankle 7 Dorsiflexion of foot, function (observable entity) 8 Left ankle dorsiflexion 9 C2139371
comment: 1 MD03463-2 2 dorsiflexion 3 Dorsiflexion 4 dorsiflexion 5 19876005 6 Ankle dorsiflexion test 7 Ankle dorsiflexion test (procedure) 8 Ankle dorsiflexion test 9 C0231771

dosing fee
type: Class
subclass of: Hospital Administration
comment: 1 MD00147 2 dosing fee 3 None 4 dosing fee 5 308590000 6 Payment for service procedure 7 Payment for service procedure (procedure) 8 Fees, Medical 9 C0015754

double leg circles
type: Class
subclass of: Health Related Factors
comment: 1 MD02763 2 double leg circles 3 None 4 double leg circles 5 229152003 6 leg exercise 7 Lower limb exercises (regime/therapy) 8 Lower limb exercises 9 C0454361

double straight leg strech
type: Class
subclass of: Limb
comment: 1 MD02769 2 double straight leg strech 3 None 4 double straight leg strech 5 229477008 6 lower limb stretching 7 Lower limb stretching (procedure) 8 Lower limb stretching 9 C0556824

double support time
type: Class
subclass of: Time
comment: 1 MD01686 2 double support time 3 None 4 double support time 5 410670007 6 Time 7 Time (attribute) 8 Time 9 C0040223

downhill
type: Class
subclass of: Physical/Chemical Environment
comment: 1 MD02535 2 downhill 3 None 4 downhill 5 282507001 6 does run down hill 7 Does run down hill (finding) 8 Does run down hill 9 C0580832

downhill biking
type: Class
subclass of: Aerobic Exercise
comment: 1 MD02534 2 downhill biking 3 Downhill skiing 4 downhill biking 5 300648001 6 Rides a bicycle 7 Does ride a bicycle (finding) 8 Does ride a bicycle (finding) 9 C0577368
alternative label: Downhill skiing

downhill snow sports street
type: Class
subclass of: Units
comment: 1 MD01643 2 downhill snow sports street 3 None 4 downhill snow sports street 5 258670009 6 Kilometer 7 Kilometer (qualifier value) 8 Kilometer 9 C0439198

draft
type: Class
subclass of: Physical/Chemical Environment
comment: 1 MD05021 2 draft 3 None 4 draft 5 285141008 6 Work environment 7 Work environment (environment) 8 Draft 9 C5400015

draw
type: Class
subclass of: Health Related Factors
comment: 1 MD02785 2 draw 3 None 4 draw 5 844005 6 behavior finding 7 Behavior finding (finding) 8 Behavior 9 C0004927

dressing
type: Class
subclass of: Health Related Factors
comment: 1 MD05283-1 2 dressing 3 None 4 dressing 5 129003000 6 Dressing 7 Dressing (observable entity) 8 Dressing 9 C0278286
comment: 1 MD05283-2 2 dressing 3 None 4 dressing 5 129003000 6 Dressing 7 Dressing (observable entity) 8 Dressing 9 C1305428
comment: 1 MD05283-3 2 dressing 3 None 4 dressing 5 129003000 6 Dressing 7 Dressing (observable entity) 8 Dressing 9 C4321376
comment: 1 MD05283-4 2 dressing 3 None 4 dressing 5 3895009 6 Dressing 7 Application of dressing (procedure) 8 Dressing 9 C0278286
comment: 1 MD05283-5 2 dressing 3 None 4 dressing 5 3895009 6 Dressing 7 Application of dressing (procedure) 8 Dressing 9 C1305428
comment: 1 MD05283-6 2 dressing 3 None 4 dressing 5 3895009 6 Dressing 7 Application of dressing (procedure) 8 Dressing 9 C4321376
comment: 1 MD05283-7 2 dressing 3 None 4 dressing 5 732993006 6 Dressing 7 Dressing (unit of presentation) 8 Dressing 9 C0278286
comment: 1 MD05283-8 2 dressing 3 None 4 dressing 5 732993006 6 Dressing 7 Dressing (unit of presentation) 8 Dressing 9 C1305428
comment: 1 MD05283-9 2 dressing 3 None 4 dressing 5 732993006 6 Dressing 7 Dressing (unit of presentation) 8 Dressing 9 C4321376

drinking
type: Class
subclass of: Sub-Cultural Level
comment: 1 MD00727 2 drinking 3 drink, Drinking function, Drinkings 4 drinking 5 30953006 6 Drinking 7 Drinking (observable entity) 8 Drinking function 9 C0684271
alternative label: Drinking function
alternative label: Drinkings
alternative label: drink

drinking status
type: Class
subclass of: Sub-Cultural Level
comment: 1 MD03294 2 drinking status 3 None 4 drinking status 5 219006 6 Current drinker of alcohol 7 Current drinker of alcohol (finding) 8 drinking status 9 C4289666

drinking water
type: Class
subclass of: Health Related Factors
comment: 1 MD04524 2 drinking water 3 None 4 drinking water 5 890302005 6 Drinking water 7 Potable water (substance) 8 Drinking water 9 C3179004

driving
type: Class
subclass of: Health Related Factors
comment: 1 MD02533 2 driving 3 None 4 driving 5 129060000 6 Driving 7 Driving (observable entity) 8 Driving 9 C0004379

driving a car
type: Class
subclass of: Health Related Factors
comment: 1 MD05039 2 driving a car 3 None 4 driving a car 5 300636004 6 Drives a car 7 Does drive a car (finding) 8 Drives a car 9 C0577356

driving a lorry
type: Class
subclass of: Health Related Factors
comment: 1 MD05045 2 driving a lorry 3 None 4 driving a lorry 5 300636004 6 Drives a car 7 Does drive a car (finding) 8 Does drive a car 9 C0577356

driving general
type: Class
subclass of: Aerobic Exercise
comment: 1 MD02532 2 driving general 3 None 4 driving general 5 129060000 6 driving 7 Driving (observable entity) 8 Driving 9 C0004379

driving other vehicle
type: Class
subclass of: Health Related Factors
comment: 1 MD05042 2 driving other vehicle 3 None 4 driving other vehicle 5 129060000 6 Driving 7 Driving (observable entity) 8 Driving 9 C0004379

drone
type: Class
subclass of: Equipment
comment: 1 MD02531 2 drone 3 None 4 drone 5 61284002 6 machine 7 Machine, device (physical object) 8 machine 9 C0336779

drug
type: Class
subclass of: Hospital information, examination/diagnosis/treatment data
comment: 1 MD01564 2 drug 3 Drugs 4 drug 5 410942007 6 Drug 7 Drug or medicament (substance) 8 Drug 9 C0013227
alternative label: Drugs

drug administration
type: Class
subclass of: Hospital information, examination/diagnosis/treatment data
comment: 1 MD00249 2 drug administration 3 None 4 drug administration 5 182832007 6 Drug administration 7 Procedure related to management of drug administration (procedure) 8 Medication Management 9 C0150270

drug formulation
type: Class
subclass of: Hospital information, examination/diagnosis/treatment data
comment: 1 MD00891 2 drug formulation 3 None 4 drug formulation 5 408352006 6 Drug formulation appropriate 7 Drug formulation appropriate (finding) 8 Drug formulation appropriate 9 C1319485

drug treatment
type: Class
subclass of: Health Related Factors
subclass of: Hospital information, examination/diagnosis/treatment data
comment: Clinical+Disability Hospital information, examination/diagnosis/treatment data None 1 MD00819 2 drug treatment 3 Drug treatment 4 drug treatment 5 182832007 6 Medication management 7 Procedure related to management of drug administration (procedure) 8 medication history (history) 9 C5238735
comment: Lifestyle Health Related Factors None 1 MD00944 2 drug treatment 3 None 4 drug treatment 5 18629005 6 Medication treatment 7 Administration of drug or medicament (procedure) 8 On Treatment 9 C4684449

dryness of the vagina
type: Class
subclass of: Urogenital function (Symptom)
comment: 1 MD01624 2 dryness of the vagina 3 None 4 dryness of the vagina 5 31908003 6 Vaginal dryness 7 Vaginal dryness (disorder) 8 Vaginal dryness 9 C0241633

dumbbell
type: Class
subclass of: Device
comment: Equipment/Device/Tool/Questionnaire Equipment None 1 MD02879 2 dumbbell 3 Dumbbells 4 dumbbell 5 462529009 6 hand-held free weight exerciser 7 Hand-held free weight exerciser (physical object) 8 Hand-held free weight exerciser 9 C3877965
comment: Equipment/Device/Tool/Questionnaire Device None 1 MD02891 2 dumbbell 3 Dumbbells 4 dumbbell 5 246137000 6 Equipment 7 Equipment (attribute) 8 Equipment 9 C0014672
alternative label: Dumbbells

dumbbell arm exercise
type: Class
subclass of: Limb
comment: 1 MD02882 2 dumbbell arm exercise 3 None 4 dumbbell arm exercise 5 229109003 6 arm exercises 7 Upper limb exercises (regime/therapy) 8 Upper limb exercises 9 C0454320

dumbbell chest workout
type: Class
subclass of: trunk
comment: 1 MD02886 2 dumbbell chest workout 3 None 4 dumbbell chest workout 5 256235009 6 Exercise 7 Exercise (observable entity) 8 Exercise 9 C0015259

dumbbell shoulder exercise
type: Class
subclass of: Limb
comment: 1 MD02878 2 dumbbell shoulder exercise 3 None 4 dumbbell shoulder exercise 5 229112000 6 shoulder exercises 7 Shoulder exercises (regime/therapy) 8 Shoulder exercises 9 C0454323

during rest
type: Class
subclass of: Health Related Factors
comment: 1 MD04440 2 during rest 3 during a break 4 during rest 5 258157001 6 Rest 7 Rest (observable entity) 8 during rest 9 C0035253
alternative label: during a break

dysmorphic
type: Class
subclass of: Hospital information, examination/diagnosis/treatment data
comment: 1 MD00387 2 dysmorphic 3 None 4 dysmorphic 5 253978002 6 Dysmorphic features 7 Dysmorphic features (finding) 8 Dysmorphic features 9 C0432072

dysphasia
type: Class
subclass of: Body functions of disability
comment: 1 MD00081 2 dysphasia 3 None 4 dysphasia 5 20301004 6 Dysphasia 7 Dysphasia (finding) 8 Dysphasia 9 C0973461

dystrophic
type: Class
subclass of: Hospital information, examination/diagnosis/treatment data
comment: 1 MD00444 2 dystrophic 3 None 4 dystrophic 5 4720007 6 Dystrophy 7 Dystrophy (morphologic abnormality) 8 dystrophic 9 C0333607

easy
type: Class
subclass of: Sensory function, Pain and Skin function (Symptom)
comment: 1 MD01474 2 easy 3 None 4 easy 5 36203004 6 Easy 7 Easy (qualifier value) 8 Easy 9 C0332219

eat
type: Class
subclass of: Health Related Factors
comment: 1 MD02209 2 eat 3 None 4 eat 5 48263008 6 Eating 7 Eating (observable entity) 8 Eating 9 C0013470

eating
type: Class
subclass of: Health Related Factors
comment: 1 MD05189 2 eating 3 None 4 eating 5 48263008 6 Eating 7 Eating (observable entity) 8 Eating 9 C0013470

educational foundation
type: Class
subclass of: Hospital Administration
comment: 1 MD00619 2 educational foundation 3 None 4 educational foundation 5 409073007 6 Education 7 Education (procedure) 8 Educational process of instructing 9 C0039401

efficiency
type: Class
subclass of: Units
comment: 1 MD02071 2 efficiency 3 None 4 efficiency 5 260375008 6 Efficient 7 Efficient (qualifier value) 8 Efficiency 9 C0013682

efflorescence
type: Class
subclass of: Sensory function, Pain and Skin function (Symptom)
comment: 1 M00955 2 efflorescence 3 None 4 efflorescence 5 271807003 6 Eruption 7 Eruption of skin (disorder) 8 Exanthema 9 C0015230

elapsed time
type: Class
subclass of: Time
comment: 1 MD02529 2 elapsed time 3 None 4 elapsed time 5 469139007 6 Elapsed-time clock, electronic 7 Elapsed-time clock, electronic (physical object) 8 elapsed time 9 C2826303

elbow
type: Class
subclass of: Musculoskeletal function (Body region)
comment: 1 MD02624 2 elbow 3 None 4 elbow 5 127949000 6 Elbow 7 Elbow region structure (body structure) 8 Elbow 9 C0013769

elbow strain
type: Class
subclass of: Questionnaire
comment: 1 MD05068 2 elbow strain 3 None 4 elbow strain 5 273389003 6 Daily activities questionnaire 7 Daily activities questionnaire (assessment scale) 8 questionnaire 9 C0034394

elderly Physical function
type: Class
subclass of: Hospital information, examination/diagnosis/treatment data
comment: 1 MD00949 2 elderly Physical function 3 None 4 elderly Physical function 5 68130003 6 Physical activity 7 Physical activity (observable entity) 8 Physical activity 9 C0026606
comment: 1 MD00966 2 vaccine name 3 None 4 vaccine name 5 787859002 6 vaccine product 7 Vaccine product (medicinal product) 8 vaccines 9 C0042210

electric wheelchair
type: Class
subclass of: Equipment
comment: 1 MD05471 2 electric wheelchair 3 None 4 electric wheelchair 5 705423000 6 Electric-motor-driven wheelchair 7 Electric-motor-driven wheelchair (physical object) 8 Wheelchair (manual or electric) 9 C4534422

electric wheelchair ride
type: Class
subclass of: Health Related Factors
comment: 1 MD05470 2 electric wheelchair ride 3 None 4 electric wheelchair ride 5 424226004 6 Using device 7 Using device (attribute) 8 Using device 9 C1828349

electrocardiogram
type: Class
subclass of: Cardiovascular system function (Body measurement)
subclass of: Hospital information, examination/diagnosis/treatment data
comment: Body measurement Cardiovascular system function None 1 MD01581 2 electrocardiogram 3 EKG 4 electrocardiogram 5 29303009 6 Electrocardiogram 7 Electrocardiographic procedure (procedure) 8 Electrocardiogram 9 C0013798
comment: Clinical+Disability Hospital information, examination/diagnosis/treatment data None 1 MD00716 2 electrocardiogram 3 EKG 4 electrocardiogram 5 29303009 6 Electrocardiogram 7 Electrocardiographic procedure (procedure) 8 Electrocardiography 9 C1623258
alternative label: EKG

electrodermal Activity
type: Class
subclass of: Hospital information, examination/diagnosis/treatment data
comment: 1 MD01569 2 electrodermal Activity 3 None 4 electrodermal Activity 5 257733005 6 Activity 7 Activity (observable entity) 8 electrodermal testing 9 C0695451

electronic cigarettes
type: Class
subclass of: Questionnaire
comment: 1 MD02299 2 electronic cigarettes 3 None 4 electronic cigarettes 5 722498003 6 Electronic cigarette 7 Electronic cigarette (physical object) 8 Electronic cigarette 9 C3849993

elevation
type: Class
subclass of: Musculoskeletal function (Body measurement)
comment: 1 MD03378 2 elevation 3 None 4 elevation 5 103720008 6 Elevation 7 Elevation (procedure) 8 Elevation 9 C0439775
comment: 1 MD03378-1 2 elevation 3 None 4 elevation 5 103720008 6 Elevation 7 Elevation (procedure) 8 Elevation 9 C0702240
comment: 1 MD03378-2 2 elevation 3 None 4 elevation 5 255456001 6 Elevation 7 Elevation - value (qualifier value) 8 Elevation 9 C0439775
comment: 1 MD03378-3 2 elevation 3 None 4 elevation 5 255456001 6 Elevation 7 Elevation - value (qualifier value) 8 Elevation 9 C0702240

elevator
type: Class
subclass of: Equipment
comment: 1 MD05474 2 elevator 3 None 4 elevator 5 30012001 6 Elevator 7 Elevator, device (physical object) 8 Elevator 9 C0013890

elliptical
type: Class
subclass of: Anatomic part
comment: 1 MD01359 2 elliptical 3 None 4 elliptical 5 256235009 6 exercise 7 Exercise (observable entity) 8 Activity, elliptical and stepper machines 9 C2977562
comment: 1 MD02527 2 elliptical 3 Elliptical 4 elliptical 5 300842002 6 shape 7 Shape (attribute) 8 Ellipse (shape) 9 C1947977

email
type: Class
subclass of: Equipment
comment: 1 MD05465 2 email 3 None 4 email 5 445678009 6 Email report 7 Email report (record artifact) 8 Email 9 C0013849

emergency medicine
type: Class
subclass of: Classification of Hospital
comment: 1 MD00653 2 emergency medicine 3 None 4 emergency medicine 5 773568002 6 Emergency medicine 7 Emergency medicine (qualifier value) 8 emergency medicine (field) 9 C0013964

emergency medicine of Korean Medicine
type: Class
subclass of: Classification of Hospital
comment: 1 MD00676 2 emergency medicine of Korean Medicine 3 None 4 emergency medicine of Korean Medicine 5 773568002 6 Emergency medicine 7 Emergency medicine (qualifier value) 8 emergency medicine (field) 9 C0013964

emergency situations
type: Class
subclass of: Physical/Chemical Environment
comment: 1 MD05521 2 emergency situations 3 None 4 emergency situations 5 25721000087108 6 Emergency shelter 7 Emergency shelter (environment) 8 Emergency Situation 9 C0013956

encephalopathy
type: Class
subclass of: Nervous system and Mental function (Symptom)
comment: 1 MD00482 2 encephalopathy 3 None 4 encephalopathy 5 81308009 6 Encephalopathy 7 Disorder of brain (disorder) 8 Encephalopathies 9 C0085584

end date of prescription
type: Class
subclass of: Day
comment: 1 MD00893 2 end date of prescription 3 None 4 end date of prescription 5 442137000 6 Procedure end time 7 Completion time of procedure (observable entity) 8 Start of care date 9 C1830429

end of menstruation
type: Class
subclass of: Day
comment: 1 MD01866 2 end of menstruation 3 Cessation of menstruation 4 end of menstruation 5 769564007 6 Menstrual cycle 7 Onset of menstrual cycle (qualifier value) 8 menstrual cycle process 9 C1818634
alternative label: Cessation of menstruation

end of treatment
type: Class
subclass of: Hospital Administration
comment: 1 MD00226 2 end of treatment 3 None 4 end of treatment 5 182992009 6 Treatment completed 7 Treatment completed (situation) 8 Treatment completed 9 C0580352

end time
type: Class
subclass of: Time
comment: 1 MD02670-1 2 End Time 3 None 4 end time 5 272103003 6 Time patterns 7 Time patterns (qualifier value) 8 End Time 9 C1522314

endocrine gland part
type: Class
subclass of: Functions of Blood System, Metabolic system and Endocrine system (Symptom)
comment: 1 MD00314 2 endocrine gland part 3 None 4 endocrine gland part 5 119261009 6 Endocrine gland part 7 Endocrine gland part (body structure) 8 Endocrine gland part 9 C1268159

energy
type: Class
subclass of: Units
comment: 1 MD01514 2 energy 3 None 4 energy 5 258784009 6 Unit of energy 7 Unit of energy (qualifier value) 8 energy 9 C1442080

energy to start
type: Class
subclass of: Nervous system and Mental function (Symptom)
comment: 1 MD02236 2 energy to start 3 None 4 energy to start 5 41991300 6 Vigorously 7 Vigorously (qualifier value) 8 Energy 9 C1442080

enjoyed life
type: Class
subclass of: Nervous system and Mental function (Symptom)
comment: 1 MD02231 2 enjoyed life 3 None 4 enjoyed life 5 247794008 6 Enjoyment of life 7 Enjoyment of life (observable entity) 8 Able to Enjoy Life 9 C2984051

enteropathic arthropathies
type: Class
subclass of: Musculoskeletal function (Symptom)
comment: 1 MD00528 2 enteropathic arthropathies 3 None 4 enteropathic arthropathies 5 399269003 6 Arthropathy 7 Arthropathy (disorder) 8 Other enteropathic arthropathies 9 C0477544

environmental modifications
type: Class
subclass of: Health Related Factors
subclass of: Questionnaire
comment: 1 MD05207 2 environmental modifications 3 None 4 environmental modifications 5 719861005 6 Modification of social environment 7 Modification of social environment (regime/therapy) 8 Modification of social environment 9 C4304386
comment: 1 MD05584 2 environmental modifications 3 None 4 environmental modifications 5 18307000 6 Modified 7 Altered (qualifier value) 8 Home modification 9 C0850398

equilibrium ability
type: Class
subclass of: Nervous system and Mental function (Body measurement)
comment: 1 MD02739 2 equilibrium ability 3 None 4 equilibrium ability 5 7205007 6 equilibrium 7 Equilibrium, function (observable entity) 8 Equilibrium (Physiology) 9 C3826392

equivalents per unit time
type: Class
subclass of: Units
comment: 1 M03180 2 equivalents per unit time 3 None 4 equivalents per unit time 5 282393005 6 equivalents per unit time 7 equivalents per unit time (qualifier value) 8 equivalents per unit time 9 C0560278

equivalents per unit volume
type: Class
subclass of: Units
comment: 1 M03173 2 equivalents per unit volume 3 None 4 equivalents per unit volume 5 282378006 6 equivalents per unit volume 7 equivalents per unit volume (qualifier value) 8 equivalents per unit volume 9 C0560266

ergometer
type: Class
subclass of: Units
comment: 1 MD03714 2 ergometer 3 None 4 ergometer 5 429560009 6 Arm ergometer, device 7 Arm ergometer, device (physical object) 8 ergometers 9 C0180748

esophageal swallowing
type: Class
subclass of: Digestive function (Body measurement)
comment: 1 MD05916 2 esophageal swallowing 3 None 4 esophageal swallowing 5 405036002 6 Swallowing status: esophageal phase 7 Swallowing status: esophageal phase (observable entity) 8 Oesophageal swallowing 9 C2371117

et
type: Class
subclass of: Units
comment: 1 MD02819 2 et 3 None 4 et 5 246514001 6 units 7 Units (attribute) 8 Unit 9 C0439149

evaluation
type: Class
subclass of: Health Related Factors
comment: 1 MD02249 2 Evaluation 3 None 4 evaluation 5 129265001 6 Evaluation 7 Evaluation - action (qualifier value) 8 Evaluation 9 C0220825

evaluation criteria
type: Class
subclass of: Units
comment: 1 MD05567 2 evaluation criteria 3 None 4 evaluation criteria 5 717350000 6 Centor criteria 7 Centor criteria (assessment scale) 8 evaluation criteria 9 C0935549

evaluation paper
type: Class
subclass of: Questionnaire
comment: 1 MD05564 2 evaluation paper 3 None 4 evaluation paper 5 50833004 6 Paper 7 Paper, device (physical object) 8 Paper 9 C0030351

evaluation task
type: Class
subclass of: Questionnaire
comment: 1 MD05550 2 evaluation task 3 None 4 evaluation task 5 261041009 6 Working 7 Working, function (observable entity) 8 Work 9 C0043227

evening drive
type: Class
subclass of: Health Related Factors
comment: 1 MD01953 2 afternoon drive 3 None 4 evening drive 5 256235009 6 Exercise 7 Exercise (observable entity) 8 Exercise 9 C0015259
alternative label: Power Assist Beep

evening roll
type: Class
subclass of: Units
comment: 1 MD01951 2 evening roll 3 None 4 evening roll 5 165309004 6 Behavior assessment 7 Behavior assessment (procedure) 8 Behavior assessment 9 C1160858

eversion
type: Class
subclass of: Musculoskeletal function (Body measurement)
comment: 1 MD03494 2 eversion 3 None 4 eversion 5 4196002 6 Eversion 7 Eversion (morphologic abnormality) 8 Eversion 9 C0015211

everyday
type: Class
subclass of: Day
comment: 1 M03629 2 everyday 3 QD 4 everyday 5 69620002 6 Every day 7 Daily (qualifier value) 8 Daily 9 #REF!

ex smoker
type: Class
subclass of: Classification of Patient
comment: 1 M02142 2 ex smoker 3 ex smokers 4 ex smoker 5 8517006 6 ex-smoker 7 Ex-smoker (finding) 8 Ex-Smokers 9 C4555205
alternative label: ex smokers
alternative label: Ex-cigarette smoker

excess
type: Class
subclass of: Questionnaire
comment: 1 MD01436 2 excess 3 None 4 excess 5 260378005 6 excessive 7 Excessive (qualifier value) 8 Excessive (qualifier value) 9 C0442802

excess post oxygen consumption
type: Class
subclass of: Respiratory function (Body measurement)
comment: 1 MD01521 2 excess post oxygen consumption 3 None 4 excess post oxygen consumption 5 251832002 6 Body oxygen consumption 7 Body oxygen consumption (observable entity) 8 Oxygen Consumption 9 C0030055

excluding
type: Class
subclass of: Health Related Factors
comment: 1 MD00252 2 excluding 3 None 4 excluding 5 77765009 6 Exclude 7 Exclude (qualifier value) 8 Exclusion 9 C2828389

execute
type: Class
subclass of: Health Related Factors
comment: 1 MD04459 2 execute 3 executive function 4 execute 5 844005 6 Behavior finding 7 Behavior finding (finding) 8 Behavior 9 C0004927
alternative label: executive function

execute to wearing of prosthesis or assist device
type: Class
subclass of: Questionnaire
comment: 1 MD04457 2 execute to wearing of prosthesis or assist device 5 None 4 execute to wearing of prosthesis or assist device 5 844005 6 Behavior finding 7 Behavior finding (finding) 8 Behavior 9 C0004927

execute to without prosthesis or assist device
type: Class
subclass of: Health Related Factors
comment: 1 MD04644 2 execute to without prosthesis or assist device 3 None 4 execute to without prosthesis or assist device 5 844005 6 Behavior finding 7 Behavior finding (finding) 8 Behavior 9 C0004927

exemption
type: Class
subclass of: Health Related Factors
comment: 1 MD00565 2 exemption 3 None 4 exemption 5 260400001 6 Reduced 7 Reduced (qualifier value) 8 Exemption 9 C2348482

exercise - squat
type: Class
subclass of: Muscle Strengthening Exercise
comment: 1 MD03779 2 exercise - squat 3 None 4 exercise - squat 5 282961006 6 Does squat (finding) 7 Does squat (finding) 8 Does squat (finding) 9 C0241236

exercise - stand up
type: Class
subclass of: Aerobic Exercise
comment: 1 MD03777 2 exercise - stand up 3 None 4 exercise - stand up 5 258148007 6 Standing up (observable entity) 7 Standing up (observable entity) 8 Standing up 9 C0444796

exercise balance
type: Class
subclass of: Musculoskeletal function (Body measurement)
comment: 1 MD01763 2 exercise balance 3 None 4 exercise balance 5 249982003 6 Balance 7 Balance (observable entity) 8 Balance exercises 9 C0150219

exercise calorie
type: Class
subclass of: Units
comment: 1 MD01379 2 exercise calorie 3 None 4 exercise calorie 5 258790008 6 calorie 7 calorie (qualifier value) 8 calorie unit of energy 9 C1879985

exercise knee
type: Class
subclass of: Limb
comment: 1 M02449 2 Knee exercises 3 exercises knee, exercise knees, exercises knees, knee exercise 4 exercise knee 5 229155001 6 Knee exercises 7 Knee exercises (regime/therapy) 8 Knee exercises 9 C0454364

exercise knees
type: Class
subclass of: Limb
comment: 1 M02448 2 Knee exercises 3 exercises knee, exercise knee, exercises knees, knee exercise 4 exercise knees 5 229155001 6 Knee exercises 7 Knee exercises (regime/therapy) 8 Knee exercises 9 C0454364

exercise part
type: Class
subclass of: Anatomic part
comment: 1 MD01460 2 exercise part 3 None 4 exercise part 5 38866009 6 body part 7 Body part structure (body structure) 8 Body part 9 C0229962

exercise start time
type: Class
subclass of: Time
comment: 1 MD01454 2 exercise start time 3 None 4 exercise start time 5 398201009 6 Start time 7 Start time (qualifier value) 8 Start time 9 C1301880

exercise strengthen
type: Class
subclass of: Muscle Strengthening Exercise
comment: 1 M02378 2 exercise strengthen 3 exercises strengthening, exercise strengthened, exercise strengthening, exercise strengthens, exercises strengthen, Strengthening exercises 4 exercise strengthen 5 6397004 6 Strengthening exercises 7 Muscular strength development exercise (regime/therapy) 8 Muscular strength development exercise 9 C0452260
alternative label: exercise strengthened
alternative label: exercises strengthen
alternative label: exercises strengthening
alternative label: Strengthening exercises
alternative label: exercise strengthening
alternative label: exercise strengthens

exercise time
type: Class
subclass of: Time
comment: 1 MD00861 2 exercise time 3 None 4 exercise time 5 255257008 6 Exercise time 7 Exercise time (qualifier value) 8 Exercise time 9 C0439587

exercise tracking
type: Class
subclass of: Aerobic Exercise
comment: 1 MD01818 2 exercise tracking 3 None 4 exercise tracking 5 256235009 6 Exercise 7 Exercise (observable entity) 8 Fitness Trackers 9 C3856555

exercises isotonic
type: Class
subclass of: Muscle Strengthening Exercise
comment: 1 M02392 2 exercises isotonic 3 None 4 exercises isotonic 5 16709005 6 Isokinetic exercises 7 Isotonic exercise (regime/therapy) 8 Isotonic exercise 9 C0454287

exercises knees
type: Class
subclass of: Limb
comment: Exercise Exercise Type Head and neck structure 1 M02450 2 Knee exercises 3 exercises knee, exercise knees, exercise knee, knee exercise 4 exercises knees 5 229155001 6 Knee exercises 7 Knee exercises (regime/therapy) 8 Knee exercises 9 C0454364

expressions
type: Class
subclass of: Health Related Factors
comment: 1 MD05536 2 expressions 3 None 4 expressions 5 10012005 6 Expression 7 Expression (procedure) 8 Expression - value symbols 9 C2911684

extension
type: Class
subclass of: Musculoskeletal function (Body measurement)
comment: 1 MD03594 2 extension 3 None 4 extension 5 255536004 6 Extension 7 Extension (qualifier value) 8 Extension 9 C0231448

external nose
type: Class
subclass of: Sensory function, Pain and Skin function (Body region)
comment: 1 MD06889 2 external nose 3 None 4 external nose 5 44032009 6 External nose 7 External nose structure (body structure) 8 External nose 9 C0458561

extra dining table
type: Class
subclass of: Hospital Administration
comment: 1 MD00183 2 extra dining table 3 None 4 extra dining table 5 464517004 6 Assistive dining table 7 Assistive dining table (physical object) 8 Assistive dining table 9 C3878229

extreme
type: Class
subclass of: Questionnaire
comment: 1 MD04247 2 extreme 3 extremely 4 extreme 5 12565001 6 Extreme 7 Extreme (qualifier value) 8 Extreme 9 C0205403
alternative label: extremely

exudative
type: Class
subclass of: Hospital information, examination/diagnosis/treatment data
comment: 1 MD00465 2 exudative 3 None 4 exudative 5 255305006 6 Exudative 7 Exudative (qualifier value) 8 Exudative 9 C0311438

eye
type: Class
subclass of: Sensory function, Pain and Skin function (Body region)
comment: 1 MD03216 2 eye 3 eyes, Eye part, eye parts 4 eye 5 81745001 6 Eye 7 Structure of eye proper (body structure) 8 Eye 9 C0015392
alternative label: eye parts
alternative label: Eye part
alternative label: eyes

eye exercise
type: Class
subclass of: Head and neck structure
comment: 1 M02464 2 eye exercise 3 exercises eye, exercise eye 4 eye exercise 5 225702009 6 Eye exercises 7 Eye exercises (regime/therapy) 8 Eye exercises 9 C0455247
alternative label: exercises eye
alternative label: exercise eye

eyeblink
type: Class
subclass of: Individual Related Factors
comment: 1 M00752 2 eyeblink 3 None 4 eyeblink 5 3585009 6 Blinking 7 Blinking (finding) 8 Blinking 9 C0005757

eyelid
type: Class
subclass of: Sensory function, Pain and Skin function (Body region)
comment: 1 MD06868 2 eyelid 3 None 4 eyelid 5 80243003 6 Eyelid 7 Eyelid structure (body structure) 8 Eyelid 9 C0015426

eyesight test
type: Class
subclass of: Sensory function, Pain and Skin function (Body measurement)
comment: 1 MD03966 2 eyesight test 3 None 4 eyesight test 5 36228007 6 eye examination 7 Ophthalmic examination and evaluation (procedure) 8 Ophthalmic examination and evaluation 9 C0200149

face
type: Class
subclass of: Sensory function, Pain and Skin function (Body region)
comment: 1 MD00545 2 face 3 Entire face, facial 4 face 5 89545001 6 Face 7 Face structure (body structure) Face 9 C0015450
alternative label: Entire face
alternative label: facial

face weakness
type: Class
subclass of: Musculoskeletal function (Symptom)
comment: 1 M02327 2 face weakness 3 None 4 face weakness 5 95666008 6 Weakness of face muscles 7 Weakness of face muscles (finding) 8 Facial Paresis 9 C0427055

facial muscles weakness
type: Class
subclass of: Musculoskeletal function (Symptom)
comment: 1 M02331 2 Weakness of face muscle 3 Weakness of the facial muscles Facial muscle weakness 4 facial muscles weakness 5 95666008 6 Facial weakness 7 Weakness of face muscles (finding) 8 Facial Paresis 9 C0427055

facilities
type: Class
subclass of: Questionnaire
comment: 1 MD05546 2 facilities 3 None 4 facilities 5 224278003 6 Domestic facilities Domestic facilities (observable entity) 8 Facility (object) 9 C1547538

faecal continence
type: Class
subclass of: Digestive function (Body measurement)
comment: 1 MD05936 2 faecal continence 3 None 4 faecal continence 5 24029004 6 Faecal continence 7 Bowels: fully continent (finding) 8 Faecal continence 9 C0429956

failure
type: Class
subclass of: Nervous system and Mental function (Symptom)
comment: 1 MD02225 2 failure 3 None 4 failure 5 76797004 6 Failure 7 Failure (finding) 8 Failure 9 C0231174

fainting syncope
type: Class
subclass of: Nervous system and Mental function (Symptom)
comment: 1 M01462 2 fainting syncope 3 attacks fainting, fainting attacks, FAINTING EPISODES, Fainting/syncope, syncope fainting 4 fainting syncope 5 271594007 6 Faint 7 Syncope (finding) 8 Faint 9 C0039070
alternative label: syncope fainting
alternative label: FAINTING EPISODES
alternative label: Fainting/syncope
alternative label: fainting attacks
alternative label: attacks fainting

fair
type: Class
subclass of: Questionnaire
comment: 1 MD04059 2 fair 3 None 4 fair 5 9726003 6 Equal 7 Equal (qualifier value) 8 Fair 9 C2911689

falls out
type: Class
subclass of: Nervous system and Mental function (Symptom)
comment: 1 M01467 2 falls out 3 FALLING OUT 4 falls out 5 271594007 6 Syncope 7 Syncope (finding) 8 Head 9 C0018670
alternative label: FALLING OUT

family history
type: Class
subclass of: Hospital information, examination/diagnosis/treatment data
comment: 1 MD03953 2 family history 3 None 4 family history 5 57177007 6 FH-Family history 7 Family history with explicit context (situation) 8 Family history (finding) 9 C0241889

family medicine
type: Class
subclass of: Classification of Hospital
comment: 1 MD00652 2 family medicine 3 None 4 family medicine 5 419772000 6 Family medicine 7 Family practice (qualifier value) 8 family medicine (field) 9 C0015607

fast heart rate
type: Class
subclass of: Cardiovascular system function (Symptom)
comment: 1 M01484 2 fast heart rate 3 Heart rate fast, fast heart beat 4 fast heart rate 5 86651002 6 Pulse fast 7 Pulse fast (finding) 8 Tachycardia 9 C0039231
alternative label: fast heart beat

fastfood
type: Class
subclass of: Questionnaire
comment: 1 MD02128 2 fastfood 3 None 4 fastfood 5 227998008 6 Fast food 7 Convenience food (substance) 8 Fast Foods 9 C0344355

fat
type: Class
subclass of: Nutritional status
comment: 1 MD02978 2 fat 3 fatness 4 fat 5 256674009 6 Fat 7 Fat (substance) 8 Fat 9 C0015677
comment: Nutrition Nutritional management None 1 MD01270 2 fat 3 fatness 4 fat 5 256674009 6 Fat 7 Fat (substance) 8 Fatty acid glycerol esters 9 C0015677
alternative label: fatness

fatigue extreme
type: Class
subclass of: Nutritional status
comment: 1 M00987 2 fatigue extreme 3 extreme fatigue 4 fatigue extreme 5 84229001 6 Fatigue 7 Fatigue (finding) 8 Fatigue 9 C0015672
alternative label: extreme fatigue

fatigueability
type: Class
subclass of: Nervous system and Mental function (Symptom)
comment: 1 M01810 2 fatigue 3 Fatiguability, Fatigability, fatigued, fatigues, fatiguing 4 fatigueability 5 84229001 6 Fatigue 7 Fatigue (finding) 8 Fatigability 9 C0231230

fatigued
type: Class
subclass of: Nutritional status
comment: 1 M00988 2 fatigue 3 Fatiguability, Fatigability, fatigues, fatiguing, fatigueability 4 fatigued 5 84229001 6 Fatigue 7 Fatigue (finding) 8 Fatigue 9 C0015672

fatigues
type: Class
subclass of: Nutritional status
comment: 1 M00989 2 fatigue 3 Fatiguability, Fatigability, fatigued, fatiguing, fatigueability 4 fatigues 5 84229001 6 Fatigue 7 Fatigue (finding) 8 Fatigue 9 C0015672

fatiguing
type: Class
subclass of: Nutritional status
comment: 1 M00990 2 fatigue 3 Fatiguability, Fatigability, fatigued, fatigues, fatigueability 4 fatiguing 5 84229001 6 Fatigue 7 Fatigue (finding) 8 Fatigue 9 C0015672

fear
type: Class
subclass of: Nervous system and Mental function (Symptom)
comment: 1 MD02226 2 fear 3 None 4 fear 5 1402001 6 Fear 7 Fear (finding) 8 Fear 9 C0015726

feeding pets
type: Class
subclass of: Health Related Factors
comment: 1 MD05420 2 feeding pets 3 None 4 feeding pets 5 129007004 6 Feeding 7 Feeding (observable entity) 8 Feeding Activity 9 C2987508

feet
type: Class
subclass of: Sensory function, Pain and Skin function (Body region)
comment: 1 M02861 2 feet 3 None 4 feet 5 259051005 6 feet 7 Foot (qualifier value) 8 Feet, unit of measurement 9 C0347981

feet per second
type: Class
subclass of: Units
comment: 1 M04547 2 feet per second 3 ft/s 4 feet per second 5 282134005 6 feet per second 7 Feet/second (qualifier value) 8 feet per second 9 C0560030
alternative label: ft/s

felt difficult
type: Class
subclass of: Nervous system and Mental function (Symptom)
comment: 1 MD02222 2 felt difficult 3 None 4 felt difficult 5 52925006 6 Difficult 7 Difficult (qualifier value) 8 Difficult (qualifier value) 9 C0332218

female
type: Class
subclass of: Units
comment: 1 MD00985 2 female 3 None 4 female 5 1086007 6 Female 7 Female structure (body structure) 8 Females 9 C0086287
comment: 1 MD00985-1 2 female 3 None 4 female 5 248152002 6 Female 7 Female (finding) 8 Females 9 C0086287

femoral pulses
type: Class
subclass of: Cardiovascular system function (Body measurement)
comment: 1 M01920 2 femoral pulses 3 None 4 femoral pulses 5 429784004 6 Femoral pulses equal 7 Femoral pulses equal (finding) 8 Femoral pulse 9 C0232148

fencing
type: Class
subclass of: Sport
comment: 1 MD01680 2 fencing 3 None 4 fencing 5 14468000 6 Sports 7 Sports activity (observable entity) 8 Sports 9 C0038039

fever
type: Class
subclass of: Sensory function, Pain and Skin function (Symptom)
comment: 1 MD01602 2 fever 3 fevered, feverish, Fevers, Feels feverish 4 fever 5 386661006 6 Fever 7 Fever (finding) 8 Fever 9 C0015967
alternative label: Fevers
alternative label: feverish
alternative label: fevered
alternative label: Feels feverish

fiber
type: Class
subclass of: Nutritional management
comment: 1 MD01708 2 fiber 3 None 4 fiber 5 37202001 6 Fiber 7 Plant fiber (substance) 8 Fiber 9 C0225326

financial management
type: Class
subclass of: Health Related Factors
comment: 1 MD05517 2 financial management 3 None 4 financial management 5 224200006 6 Management of financial affairs 7 Management of financial affairs (observable entity) 8 Management of financial affairs 9 C0557193

find
type: Class
subclass of: Health Related Factors
comment: 1 MD03223 2 find 3 None 4 find 5 246106000 6 control 7 Control (attribute) 8 Ability to control position 9 C0560751

finger
type: Class
subclass of: Musculoskeletal function (Body region)
comment: 1 MD04155 2 finger 3 None 4 finger 5 7569003 6 Finger 7 Finger structure (body structure) 8 Finger 9 C0016129

finger grip strength
type: Class
subclass of: Musculoskeletal function (Body measurement)
comment: 1 MD04669 2 finger grip strength 3 finger grip 4 finger grip strength 5 251433001 6 Grip strength 7 Grip strength (observable entity) 8 Grip strength 9 C0429271
alternative label: finger grip

finishing exercise
type: Class
subclass of: Conditioning exercise
comment: Exercise Exercise Type "Conditioning exercise " 1 MD02943 2 finishing exercise 3 finishing workout 4 finishing exercise 5 255214003 6 After exercise 7 After exercise (qualifier value) 8 post exercise 9 C1979962
alternative label: finishing workout

fishing
type: Class
subclass of: Aerobic Exercise
comment: 1 MD02523 2 fishing 3 None 4 fishing 5 1137717005 6 Fishing 7 Fishing (qualifier value) 8 Fishing 9 C5445286

fit
type: Class
subclass of: Musculoskeletal function (Symptom)
comment: 1 M01341 2 fit 3 fits fit's fitted 4 fit 5 91175000 6 Fit 7 Seizure (finding) 8 Fit 9 C0036572
alternative label: fit's
alternative label: fits
alternative label: fitted

fitness
type: Class
subclass of: Aerobic Exercise
comment: 1 MD02522 2 fitness 3 None 4 fitness 5 719333006 6 Fitness for activity 7 Fitness for activity (observable entity) 8 fitness 9 C1456706

fitness Age
type: Class
subclass of: Units
comment: 1 MD02521 2 fitness Age 3 None 4 fitness Age 5 397669002 6 age 7 Age (qualifier value) 8 age 9 C0001779

fitness course
type: Class
subclass of: Aerobic Exercise
comment: 1 MD01538 2 fitness course 3 None 4 fitness course 5 719333006 6 Fitness for activity 7 Fitness for activity (observable entity) 8 Fitness 9 C1456706

fitness equipment
type: Class
subclass of: Equipment
comment: 1 MD02520 2 fitness equipment 3 None 4 fitness equipment 5 246137000 6 equipment 7 Equipment (attribute) 8 equipment 9 C0014672

fitness game
type: Class
subclass of: Sport
comment: 1 MD01682 2 fitness game 3 None 4 fitness game 5 405155000 6 Physical fitness behaviour 7 Physical fitness behavior (observable entity) 8 Physical fitness behavior 9 C1319164

fitness mode
type: Class
subclass of: Units
comment: 1 MD01798 2 fitness mode 3 None 4 fitness mode 5 405155000 6 Physical fitness behavior 7 Physical fitness behavior (observable entity) 8 Physical fitness behavior 9 C1319164

fitzpatrick skin type
type: Class
subclass of: Sensory function, Pain and Skin function (Body measurement)
comment: 1 MD01562 2 fitzpatrick skin type 3 None 4 fitzpatrick skin type 5 443635002 6 Fitzpatrick classification of skin type 7 Fitzpatrick classification of skin type (assessment scale) 8 Fitzpatrick classification of skin type 9 C2732923

flat rate
type: Class
subclass of: Hospital Administration
comment: 1 MD00159 2 flat rate 3 None 4 flat rate 5 308590000 6 Payment for service procedure 7 Payment for service procedure (procedure) 8 Rate 9 C1521828

flatulence
type: Class
subclass of: Digestive function (Body measurement)
comment: 1 MD05937 2 flatulence 3 None 4 flatulence 5 249504006 6 Flatulence 7 Passing flatus (finding) 8 Flatulence 9 C0016204

flexibility
type: Class
subclass of: Hospital information, examination/diagnosis/treatment data
comment: 1 MD02736 2 flexibility 3 None 4 flexibility 5 248326004 6 Body measurements 7 Body measure (observable entity) 8 Flexibility Index 9 C4050619

flexibility exercise
type: Class
subclass of: Aerobic Exercise
comment: 1 M02852 2 flexibility exercise 3 exercise flexibility, exercises flexibility, flexible movement 4 flexibility exercise 5 705202009 6 Flexibility exerciser 7 Flexibility exerciser (physical object) 8 flexibility exercises 9 C2945658
alternative label: exercise flexibility
alternative label: flexible movement
alternative label: exercises flexibility

flexion
type: Class
subclass of: Musculoskeletal function (Body measurement)
comment: 1 MD03324 2 Flexion 3 flexion 4 flexion 5 9964006 6 Flexion 7 Flexion, function (observable entity) 8 Flexion 9 C0231452

floor
type: Class
subclass of: Units
comment: 1 MD01642 2 floor 3 Floors 4 floor 5 709280007 6 Floor 7 Walking surface of room (physical object) 8 floor (object) 9 C0016249
alternative label: Floors

floors Climbed Goal
type: Class
subclass of: Units
comment: 1 MD02516 2 floors Climbed Goal 3 None 4 floors Climbed Goal 5 410518001 6 goal 7 Goal context (qualifier value) 8 objective (goal) 9 C0018017

fluid ounce
type: Class
subclass of: Units
comment: 1 MD01281 2 fluid ounce 3 None 4 fluid ounce 5 282118007 6 fluid ounce 7 fluid ounce (qualifier value) 8 fluid ounce 9 C0560011

flushing of face
type: Class
subclass of: Sensory function, Pain and Skin function (Symptom)
comment: 1 M01045 2 Face goes red 3 face flush, face flushed, face flushing, facial flush, FACIAL FLUSHING, flush face, flushed face, flushed skin, flushing face, flushing facial, skin flush, SKIN FLUSHED, flushed skin, flushing of face 5 271811009 6 Face goes red 7 Face goes red (finding) 8 Flushes/goes red 9 C0424518

folic acid
type: Class
subclass of: Nutritional management
comment: 1 MD01714 2 folic acid 3 None 4 folic acid 5 63718003 6 Folic acid 7 Folic acid (substance) 8 Folic acid 9 C0016410

food and fluid intake
type: Class
subclass of: Nutrient intake
comment: 1 M02536 2 food and fluid intake 3 fluid food intake, food fluid intake 4 food and fluid intake 5 405033005 6 Nutritional status: food and fluid intake 7 Nutritional status: food and fluid intake (observable entity) 8 food and fluid intake 9 C0518009
alternative label: food fluid intake
alternative label: fluid food intake

foot
type: Class
subclass of: Units
comment: 1 M03643 2 foot 3 ft 4 foot 5 56459004 6 Foot 7 Foot structure (body structure) 8 Foot 9 C0016504
comment: 1 M03643-1 2 foot 3 ft 4 foot 5 56459004 6 Foot 7 Foot structure (body structure) 8 Feet, unit of measurement 9 C0347981
comment: 1 M03643-2 2 foot 3 ft 4 foot 5 259051005 6 Foot 7 Foot (qualifier value) 8 Foot 9 C0016504
comment: 1 M03643-3 2 foot 3 ft 4 foot 5 259051005 6 Foot 7 Foot (qualifier value) 8 Feet, unit of measurement 9 C0347981
alternative label: ft

force - isometric motion
type: Class
subclass of: Units
comment: 1 MD03761 2 force - isometric motion 3 None 4 force - isometric motion 5 365605003 6 Body measurement finding 7 Body measurement finding (finding) 8 Body measurement finding 9 C1287249

fork
type: Class
subclass of: Equipment
comment: 1 MD04543 2 fork 3 None 4 fork 5 303513001 6 Fork 7 Fork (physical object) 8 Fork 9 C0546910

forward backwarding
type: Class
subclass of: Aerobic Exercise
comment: 1 MD02708 2 forward backwarding 3 None 4 forward backwarding 5 256235009 6 exercise 7 Exercise (observable entity) 8 Exercise 9 C0015259

four-legged
type: Class
subclass of: Equipment
comment: 1 MD04707 2 four-legged 3 None 4 four-legged 5 156031000146109 6 Four-legged walking cane 7 Quad cane (physical object) 8 Cane 9 C0006856

four-legged cane
type: Class
subclass of: Equipment
comment: 1 MD04374 2 four-legged cane 3 None 4 four-legged cane 5 156031000146109 6 Four-legged walking cane 7 Quad cane (physical object) 8 Walks with cane (finding) 9 C0750377

frequency exercise
type: Class
subclass of: Frequency of exercise
comment: 1 M02628 2 frequency exercise 3 exercise frequency 4 frequency exercise 5 228449008 6 Frequency of exercise 7 Frequency of exercise (observable entity) 8 Frequency of exercise 9 C0556455
alternative label: exercise frequency

frequency of defecation
type: Class
subclass of: Digestive function (Body measurement)
comment: 1 MD05935 2 frequency of defecation 3 None 4 frequency of defecation 5 162098000 6 frequency of defecation 7 Frequency of defecation (observable entity) 8 Frequency of defecation 9 C0581872

frequency of prescription
type: Class
subclass of: Hospital information, examination/diagnosis/treatment data
comment: 1 MD00889 2 frequency of prescription 3 None 4 frequency of prescription 5 33633005 6 prescription of drug 7 Prescription of drug (procedure) 8 Prescription of drug (procedure) 9 C2239117

friends
type: Class
subclass of: Units
comment: 1 MD00814 2 friends 3 None 4 friends 5 113163005 6 Friend 7 Friend (person) 8 friend 9 C0079382

front raise
type: Class
subclass of: Sport
comment: 1 MD01371 2 front raise 3 None 4 front raise 5 256235009 6 exercise 7 Exercise (observable entity) 8 Exercise 9 C0015259

frontal lobe
type: Class
subclass of: Nervous system and Mental function (Body region)
comment: 1 MD06822 2 frontal lobe 3 None 4 frontal lobe 5 83251001 6 Frontal lobe 7 Frontal lobe structure (body structure) 8 Frontal lobe 9 C0016733

fruit
type: Class
subclass of: Nutritional management
comment: 1 MD02120 2 fruit 3 None 4 fruit 5 72511004 6 Fruit 7 Fruit (substance) 8 Fruit 9 C0016767

ft3
type: Class
subclass of: Units
comment: 1 M03574 2 ft3 3 None 4 ft3 5 282121009 6 ft3 7 cubic foot (qualifier value) 8 cubic foot 9 C0560014

full
type: Class
subclass of: Questionnaire
comment: 1 MD01435 2 full 3 None 4 full 5 261015003 6 Full 7 Full (qualifier value) 8 Full 9 C0443225

full-body vibration
type: Class
subclass of: Questionnaire
comment: 1 MD05035 2 full-body vibration 3 None 4 full-body vibration 5 33679000 6 Vibration 7 Vibration (physical force) 8 Vibration 9 C0459800

functional ambulation category
type: Class
subclass of: Units
comment: 1 MD03097 2 functional ambulation category 3 functional ambulation category 4 functional ambulation category 5 767525000 6 Unit (qualifier value) 7 unit 8 Unit 9 C0439148

future
type: Class
subclass of: Units
comment: 1 MD02224 2 future 3 None 4 future 5 225649001 6 Hopeful for the future 7 Hopeful for the future (finding) 8 Future 9 C0016884

http://www.semanticweb.org/user/ontologies/2023/10/untitled-ontology-5#g
type: Class
subclass of: Units
comment: 1 M02900 2 g 3 None 4 g 5 257966000 6 G 7 Upper case Roman letter G (qualifier value) 8 Lower case Roman letter g 9 C1706061
comment: 1 M02900-1 2 g 3 None 4 g 5 257966000 6 G 7 Upper case Roman letter G (qualifier value) 8 Lower case Roman letter g 9 C0439208
comment: 1 M02900-2 2 g 3 None 4 g 5 257966000 6 G 7 Upper case Roman letter G (qualifier value) 8 upper case gee 9 C0439110
comment: 1 M02900-3 2 g 3 None 4 g 5 422112002 6 g 7 Lower case Roman letter g (qualifier value) 8 Lower case Roman letter g 9 C1706061
comment: 1 M02900-4 2 g 3 None 4 g 5 422112002 6 g 7 Lower case Roman letter g (qualifier value) 8 Lower case Roman letter g 9 C0439208
comment: 1 M02900-5 2 g 3 None 4 g 5 422112002 6 g 7 Lower case Roman letter g (qualifier value) 8 upper case gee 9 C0439110
comment: 1 M02900-6 2 Gram 3 gram grams g GM 4 g 5 258682000 6 g 7 gram (qualifier value) 8 Lower case Roman letter g 9 C0439208
comment: 1 M02900-7 2 Gram 3 gram grams g GM 4 g 5 258682000 6 g 7 gram (qualifier value) 8 upper case gee 9 C0439110
comment: 1 M02900-8 2 Gram 3 gram grams g GM 4 g 5 258682000 6 g 7 gram (qualifier value) 8 Lower case Roman letter g 9 C1706061

g.m
type: Class
subclass of: Units
comment: 1 M03081 2 g.m 3 None 4 g.m 5 277384007 6 g.m 7 Gram.meter (qualifier value) 8 g.m 9 C0456715

gas generation operations
type: Class
subclass of: Questionnaire
comment: 1 MD04997 2 gas generation operations 3 None 4 gas generation operations 5 74947009 6 Gas 7 Gaseous substance (substance) 8 Gas - SpecimenType 9 C1550641

gastrointestinal gas
type: Class
subclass of: Digestive function (Symptom)
comment: 1 M02671 2 gastrointestinal gas 3 None 4 gastrointestinal gas 5 736680000 6 Gas 7 Gas (state of matter) 8 gastrointestinal gas 9 C0596601

gauge diving
type: Class
subclass of: Sport
comment: 1 MD02512 2 gauge diving 3 None 4 gauge diving 5 63498000 6 diving 7 Diving (qualifier value) 8 downward 9 C0205104

general
type: Class
subclass of: Units
comment: 1 MD00174 2 general 3 None 4 general 5 60132005 6 General 7 Generalized (qualifier value) 8 Generalized 9 C0205246

general practitioner
type: Class
subclass of: Classification of Patient
comment: 1 MD00629 2 general practitioner 3 None 4 general practitioner 5 62247001 6 General practitioner 7 Family medicine specialist (occupation) 8 General Practitioners 9 C0017319

general status
type: Class
subclass of: Units
comment: 1 MD00733 2 general status 3 None 4 general status 5 263490005 6 Status 7 Status (attribute) 8 General status 9 C0947124

general surgery
type: Class
subclass of: Classification of Hospital
comment: 1 MD00633 2 general surgery 3 None 4 general surgery 5 394609007 6 General surgery 7 General surgery (qualifier value) 8 General surgery specialty 9 C1274039

genitals
type: Class
subclass of: Urogenital function (Body region)
comment: 1 MD00548 2 genitals 3 None 4 genitals 5 90264002 6 Male genital structure 7 Male genital structure (body structure) 8 Male Genital Organs 9 C0017422

get back
type: Class
subclass of: Health Related Factors
comment: 1 MD04962 2 get back 3 None 4 get back 5 844005 6 Behavior finding 7 Behavior finding (finding) 8 Behavior 9 C0004927

get rid
type: Class
subclass of: Health Related Factors
comment: 1 MD02216 2 get rid 3 None 4 get rid 5 118292001 6 To take something off or out, to get rid of, to eliminate 7 Removal (procedure) 8 Removing (action) 9 C1883720

get up
type: Class
subclass of: Health Related Factors
comment: 1 MD02186 2 get up 3 None 4 get up 5 401196007 6 Get up and go test 7 Get up and go test (procedure) 8 Get up and go test 9 C1303170

gigahertz
type: Class
subclass of: Units
comment: 1 M04504 2 gigahertz 3 GHz 4 gigahertz 5 229763006 6 gigahertz 7 Gigahertz (qualifier value) 8 gigahertz 9 C0556961
alternative label: GHz

gigantism
type: Class
subclass of: Functions of Blood System, Metabolic system and Endocrine system (Symptom)
comment: 1 MD00316 2 Hypophyseal gigantism 3 None 4 gigantism 5 80849007 6 Gigantism 7 Gigantism (disorder) 8 Gigantism 9 C0017547

glass
type: Class
subclass of: Units
comment: 1 MD01411 2 glass 3 None 4 glass 5 32039001 6 Glass 7 Glass (substance) 8 Glass (substance) 9 C0017596

glasses per day
type: Class
subclass of: Units
comment: 1 M04613 2 glasses per day 3 glasses/day 4 glasses per day 5 228949002 6 glasses/day 7 glasses/day (qualifier value) 8 glasses/day 9 C0560658
alternative label: glasses/day

globulin
type: Class
subclass of: Functions of Blood System, Metabolic system and Endocrine system (Body measurement)
comment: 1 MD03027 2 globulin 3 None 4 globulin 5 81905004 6 Globulin 7 Globulin (substance) 8 Globulin 9 C0017649

glomerular filtration rate
type: Class
subclass of: Hospital information, examination/diagnosis/treatment data
comment: 1 MD00748 2 glomerular filtration rate 3 None 4 glomerular filtration rate 5 80274001 6 Glomerular filtration rate 7 Glomerular filtration rate (observable entity) 8 Glomerular Filtration Rate 9 C0017654

glycemia
type: Class
subclass of: Functions of Blood System, Metabolic system and Endocrine system (Symptom)
comment: 1 M00759 2 glycemia 3 None 4 glycemia 5 390951007 6 Impaired fasting glycemia 7 impaired fasting glycemia (disorder) 8 Impaired fasting glycemia 9 C1272092

go bed time
type: Class
subclass of: Time
comment: 1 MD02146 2 go bed time 3 None 4 go bed time 5 247950007 6 Sleep behavior finding 7 Sleep behavior finding (finding) 8 Sleep behavior finding 9 C0474396

go to the bathroom
type: Class
subclass of: Health Related Factors
comment: 1 MD02187 2 go to the bathroom 3 None 4 go to the bathroom 5 183366004 6 Use of bathroom aids 7 Use of bathroom aids (regime/therap 8 Use of bathroom aids 9 C0418961

goal
type: Class
subclass of: Hospital information, examination/diagnosis/treatment data
comment: 1 MD01830 2 Goal 3 None 4 goal 5 410518001 6 Goal 7 Goal context (qualifier value) 8 objective (goal) 9 C0018017

goal assignment
type: Class
subclass of: Questionnaire
comment: 1 MD05491 2 goal assignment 3 None 4 goal assignment 5 410518001 6 Goal 7 Goal context (qualifier value) 8 Goal 9 C0018017

goal attainment graph
type: Class
subclass of: Hospital information, examination/diagnosis/treatment data
comment: 1 MD01831 2 goal attainment graph 3 None 4 goal attainment graph 5 390802008 6 Goal achieved 7 Goal achieved (finding) 8 Goal achieved 9 C1272277

going down
type: Class
subclass of: Health Related Factors
comment: 1 MD02816 2 going down 3 None 4 going down 5 282187005 6 does walk down step 7 Does walk down step (finding) 8 Does walk down step 9 C0516678

going to bed
type: Class
subclass of: Individual Related Factors
comment: 1 MD02171 2 going to bed 3 None 4 going to bed 5 21029003 6 Bedtime 7 Bedtime (qualifier value) 8 Bedtime (qualifier value) 9 C0521112

going up
type: Class
subclass of: Health Related Factors
comment: 1 MD02815 2 going up 3 None 4 going up 5 282181006 6 does walk up step 7 Does walk up step (finding) 8 Does walk up step 9 C0516677

golf coach
type: Class
subclass of: Units
comment: 1 MD01890 2 golf coach 3 None 4 golf coach 5 87448007 6 Sports coach 7 Sports coach (occupation) 8 Sports coach 9 C0335105

good
type: Class
subclass of: Questionnaire
comment: 1 MD01447 2 good 3 None 4 good 5 20572008 6 Good 7 Good (qualifier value) 8 Good 9 C0205170

goods
type: Class
subclass of: Questionnaire
comment: 1 MD05232 2 goods 3 None 4 goods 5 260787004 6 Objects 7 Physical object (physical object) 8 Manufactured Supplies 9 C0038848

government-funded patients
type: Class
subclass of: Classification of Patient
comment: 1 MD00568 2 government-funded patients 3 None 4 government-funded patients 5 116154003 6 Patient 7 Patient (person) 8 Patients 9 C0030705

grade
type: Class
subclass of: Questionnaire
comment: 1 MD04055 2 grade 3 None 4 grade 5 103421006 6 Grade 7 Grade (attribute) 8 Grade 9 C0441800

gram
type: Class
subclass of: Units
comment: 1 MD01388 2 Gram 3 gram grams g GM 4 gram 5 258682000 6 gram 7 gram (qualifier value) 8 gram 9 C0439208
alternative label: grams
alternative label: GM

gram meter
type: Class
subclass of: Units
comment: 1 M04447 2 gram meter 3 gram metre g m m g 4 gram meter 5 277384007 6 gram meter 7 Gram.meter (qualifier value) 8 gram meter 9 C0456715
alternative label: g m
alternative label: gram metre
alternative label: m g

gravel
type: Class
subclass of: Units
comment: 1 MD02507 2 gravel 3 None 4 gravel 5 261364001 6 Gravel 7 Gravel (substance) 8 Gravel 9 C0443001

gravel cycling
type: Class
subclass of: Sport
comment: 1 MD02506 2 gravel cycling 3 None 4 gravel cycling 5 415577004 6 sports 7 Sport (qualifier value) 8 spors 9 C0038039

grip
type: Class
subclass of: Health Related Factors
comment: 1 MD04466 2 Grip 3 grip 4 grip 5 284260004 6 grips 7 Does grip (finding) 8 Does grip 9 C0600117

grip strength
type: Class
subclass of: Musculoskeletal function (Body measurement)
comment: 1 MD02747 2 grip strength 3 None 4 grip strength 5 251433001 6 Grip strength 7 Grip strength (observable entity) 8 Grip strength 9 C0429271

grocery shopping
type: Class
subclass of: Health Related Factors
comment: 1 MD02268 2 grocery shopping 3 None 4 grocery shopping 5 129011005 6 shopping 7 Shopping (observable entity) 8 Shopping (activity) 9 C0150768

grooming
type: Class
subclass of: Health Related Factors
comment: 1 MD05176 2 grooming 3 None 4 grooming 5 704435007 6 Grooming activities 7 Personal grooming activities, function (observable entity) 8 Grooming activities 9 C0564676
comment: 1 MD05176-1 2 grooming 3 None 4 grooming 5 704435007 6 Grooming activities 7 Personal grooming activities, function (observable entity) 8 grooming behavior 9 C1154333

grooming and dressing
type: Class
subclass of: Health Related Factors
comment: 1 MD05281 2 grooming and dressing 3 None 4 grooming and dressing 5 704435007 6 Grooming activities 7 Personal grooming activities, function (observable entity) 8 grooming behavior 9 C1154333

ground
type: Class
subclass of: Physical/Chemical Environment
comment: 1 MD02504 2 ground 3 None 4 ground 5 276339004 6 Environment 7 Environment (environment) 8 Hiking 9 C4255280

growth
type: Class
subclass of: Health Related Factors
comment: 1 MD00515 2 growth 3 None 4 growth 5 365698005 6 Organism growth 7 Finding of organism growth (finding) 8 Growth 9 C0018270

gut pain
type: Class
subclass of: Digestive function (Symptom)
comment: 1 M00653 2 gut pain 3 None 4 gut pain 5 113276009 6 Intestines 7 Intestinal structure (body structure) 8 Gut 9 C0699819

gynoid
type: Class
subclass of: Units
comment: 1 MD03023 2 gynoid 3 None 4 gynoid 5 248312008 6 Gynoid Fat distrivution 7 Peripheral obesity (disorder) 8 Peripheral obesity 9 C0424629

gyx
type: Class
subclass of: Units
comment: 1 MD02825 2 gyx 3 None 4 gyx 5 246514001 6 units 7 Units (attribute) 8 Unit 9 C0439152

gyy
type: Class
subclass of: Units
comment: 1 MD02826 2 gyy 3 None 4 gyy 5 246514001 6 units 7 Units (attribute) 8 Unit 9 C0439153

gyz
type: Class
subclass of: Units
comment: 1 MD02827 2 gyz 3 None 4 gyz 5 246514001 6 units 7 Units (attribute) 8 Unit 9 C0439154

http://www.semanticweb.org/user/ontologies/2023/10/untitled-ontology-5#h
type: Class
subclass of: Units
comment: 1 M02912 2 H 3 h 4 h 5 257967009 6 H 7 Upper case Roman letter H (qualifier value) 8 Lower case Roman letter h 9 C0439134
comment: 1 M02912 2 H 3 h 4 h 5 257967009 6 H 7 Upper case Roman letter H (qualifier value) 8 Upper case Roman letter H 9 C0439111
comment: 1 M02912 2 H 3 h 4 h 5 257988000 6 h 7 Lower case Roman letter h (qualifier value) 8 Lower case Roman letter h 9 C0439134
comment: 1 M02912 2 H 3 h 4 h 5 257988000 6 h 7 Lower case Roman letter h (qualifier value) 8 Upper case Roman letter H 9 C0439111

haemoglobin
type: Class
subclass of: Functions of Blood System, Metabolic system and Endocrine system (Body measurement)
comment: 1 MD00827 2 haemoglobin 3 None 4 haemoglobin 5 38082009 6 Haemoglobin 7 Hemoglobin (substance) 8 Haemoglobin 9 C0019046

hair falling
type: Class
subclass of: Sensory function, Pain and Skin function (Symptom)
comment: 1 M00674 2 hair falling 3 Falling hair, falling hairs, falls hair 4 hair falling 5 278040002 6 Falling hair 7 Loss of hair (finding) 8 Falling hair 9 C0002171
alternative label: falls hair
alternative label: falling hairs
alternative label: Falling hair

halfway point
type: Class
subclass of: Musculoskeletal function (Body region)
comment: 1 MD04424 2 halfway point 3 None 4 halfway point 5 52530000 6 Body region 7 Body region structure (body structure) 8 Body Regions 9 C0005898

hammering
type: Class
subclass of: Individual Related Factors
comment: 1 MD04230 2 hammering 3 None 4 hammering 5 844005 6 Behavior finding 7 Behavior finding (finding) 8 Behavior 9 C0004927

hand
type: Class
subclass of: Musculoskeletal function (Body region)
comment: 1 MD02721 2 hand 3 hands 4 hand 5 85562004 6 Hand 7 Hand structure (body structure) 8 Hand 9 C0018563

hand cycling
type: Class
subclass of: Sport
comment: 1 MD01683 2 hand cycling 3 None 4 hand cycling 5 14468000 6 Sports 7 Sports activity (observable entity) 8 Bicycling (recreational activity) 9 C0005377

hand tools
type: Class
subclass of: Questionnaire
comment: 1 MD04993 2 hand tools 3 None 4 hand tools 5 20997002 6 Hand tool 7 Hand tool, device (physical object) 8 Hand tool 9 C0336792

hand washing
type: Class
subclass of: Health Related Factors
comment: 1 MD05399 2 hand washing 3 None 4 hand washing 5 286050003 6 Washes laundry 7 Does wash laundry (finding) 8 Laundry 9 C1830412

handball
type: Class
subclass of: Sport
comment: 1 MD01375 2 handball 3 None 4 handball 5 25976000 6 Handball 7 Handball (qualifier value) 8 Handball 9 C0336936

handled
type: Class
subclass of: Health Related Factors
comment: 1 MD04886 2 handling 3 handled 4 handled 5 844005 6 Behavior finding 7 Behavior finding (finding) 8 Behavior 9 C0004927

hands
type: Class
subclass of: Musculoskeletal function (Body region)
comment: 1 MD00546 2 hands 3 hand 4 hands 5 85562004 6 Hand 7 Hand structure (body structure) 8 Hand 9 C0018563

hang gliding
type: Class
subclass of: Sport
comment: 1 MD02503 2 hang gliding 3 hang gliding 4 hang gliding 5 19810007 6 Hang gliding 7 Hang gliding (qualifier value) 8 Hang gliding 9 C0336967

hanging
type: Class
subclass of: Health Related Factors
comment: 1 MD05395 2 hanging 3 None 4 hanging 5 844005 6 Behavior finding 7 Behavior finding (finding) 8 Behavior 9 C0004927

hanging laundry
type: Class
subclass of: Health Related Factors
comment: 1 MD05393 2 hanging laundry 3 None 4 hanging laundry 5 844005 6 Behavior finding 7 Behavior finding (finding) 8 Behavior 9 C0004927

happy
type: Class
subclass of: Nervous system and Mental function (Symptom)
comment: 1 MD02227 2 happy 3 None 4 happy 5 112080002 6 Happy 7 Cheerful mood (finding) 8 Happy 9 C0018592

hard
type: Class
subclass of: Respiratory function (Symptom)
subclass of: Sensory function, Pain and Skin function (Symptom)
comment: 1 MD02220 2 hard 3 None 4 hard 5 72505002 6 Hard 7 Hard (qualifier value) 8 Hard 9 C0018599
comment: Symptom Sensory function, Pain and Skin function None 1 MD01472 2 hard 3 None 4 hard 5 72505002 6 Hard 7 Hard (qualifier value) 8 Hardness 9 C0018599

hard palate
type: Class
subclass of: Digestive function (Body region)
comment: 1 MD06902 2 Hard palate 3 None 4 hard palate 5 90228003 6 Hard palate 7 Hard palate structure (body structure) 8 Hard palate 9 C0226901

headache
type: Class
subclass of: Sensory function, Pain and Skin function (Symptom)
comment: 1 MD01597 2 headache 3 HA - Headache, HEAD ACHE, Head Pain, HEAD PAIN CEPHALGIA, head pained, head pains, headaches, PAIN HEAD, Pain in head, (headache) 4 headache 5 25064002 6 Headache 7 Headache (finding) 8 Headache 9 C0018681

health agency
type: Class
subclass of: Classification of Hospital
comment: 1 MD00136 2 health agency 3 None 4 health agency 5 310115006 6 Public health service (qualifier value) 7 Public health service (qualifier value) 8 Health Systems Agencies 9 C0018763

health agency admission
type: Class
subclass of: Hospital Administration
comment: 1 MD00111 2 health agency admission 3 None 4 health agency admission 5 281685003 6 Admission for care 7 Admission for care (procedure) 8 Medical agency 9 C5142892

health agency outpatient
type: Class
subclass of: Hospital Administration
comment: 1 MD00112 2 health agency outpatient 3 None 4 health agency outpatient 5 312887003 6 Attends outpatients 7 Attending clinic (finding) 8 ealth Services, Outpatient 9 C4545175

health details
type: Class
subclass of: Hospital information, examination/diagnosis/treatment data
comment: 1 MD01560 2 health details 3 None 4 health details 5 406221003 6 Health status 7 Health status (observable entity) 8 Health status 9 C0018759

health perception
type: Class
subclass of: Hospital information, examination/diagnosis/treatment data
comment: 1 MD00769 2 health perception 3 None 4 health perception 5 129842001 6 Health perception finding 7 Health perception finding (finding) 8 Health perception finding 9 C1268743

health status
type: Class
subclass of: Hospital information, examination/diagnosis/treatment data
comment: 1 MD02237 2 health status 3 None 4 health status 5 406221003 6 Health status 7 Health status (observable entity) 8 Health status 9 C0018759

health summary
type: Class
subclass of: Hospital information, examination/diagnosis/treatment data
comment: 1 MD01847 2 health summary 3 None 4 health summary 5 406221003 6 Health status 7 Health status (observable entity) 8 Summary Report 9 C0242482

hearing
type: Class
subclass of: Body functions of disability
subclass of: Sensory function, Pain and Skin function (Body measurement)
comment: Body measurement Sensory function, Pain and Skin function None 1 MD00922 2 hearing 3 Hearing functions 4 hearing 5 47078008 6 Hearing 7 Hearing, function (observable entity) 8 Hearing 9 C0018767
comment: Clinical+Disability Classification of disability Body functions of disability 1 MD00105 2 hearing 3 Hearing functions 4 hearing 5 47078008 6 Hearing 7 Hearing, function (observable entity) 8 Hearing 9 C0018767
alternative label: Hearing functions

heart
type: Class
subclass of: Cardiovascular system function (Body region)
comment: 1 MD00281 2 heart 3 None 4 heart 5 80891009 6 Heart 7 Heart structure (body structure) 8 Heart 9 C0018787

heart disease
type: Class
subclass of: Hospital information, examination/diagnosis/treatment data
comment: 1 MD00019 2 heart disease 3 None 4 heart disease 5 56265001 6 Heart disease 7 Heart disease (disorder) 8 Heart disease 9 C0018799

heart normal rates
type: Class
subclass of: Cardiovascular system function (Body measurement)
comment: 1 M01933 2 Normal heart rate 3 heart normal rate heart rate normal heart normals rate Normal cardiac rate Normal heart beat heart beat normal normal pulses pulse normal 4 heart normal rates 5 76863003 6 normal heart rate 7 Normal heart rate (finding) 8 normal heart rate 9 C2712145
comment: 1 M01933-1 2 Normal heart rate 3 heart normal rate heart rate normal heart normals rate Normal cardiac rate Normal heart beat heart beat normal normal pulses pulse normal 4 heart normal rates 5 76863003 6 normal heart rate 7 Normal heart rate (finding) 8 normal heart rate 9 C2712145
comment: 1 M01933-2 2 Normal heart rate 3 heart normal rate heart rate normal heart normals rate Normal cardiac rate Normal heart beat heart beat normal normal pulses pulse normal 4 heart normal rates 5 76863003 6 normal heart rate 7 Normal heart rate (finding) 8 normal heart rate 9 C2712145

heart rate
type: Class
subclass of: Cardiovascular system function (Body measurement)
comment: 1 MD02500 2 heart rate 3 heart beat, Pulse rate, PR - Pulse rate, pulse rates 4 heart rate 5 364075005 6 Heart rate 7 Heart rate (observable entity) 8 Heart rate 9 C0018810
alternative label: pulse rates
alternative label: PR - Pulse rate
alternative label: Pulse rate
alternative label: heart beat

heart rate during rest
type: Class
subclass of: Cardiovascular system function (Body measurement)
comment: 1 MD01542 2 heart rate during rest 3 None 4 heart rate during rest 5 444981005 6 resting heart rate 7 Resting heart rate (observable entity) 8 RESTING HEART RATE 9 C1821417

heart rate warning
type: Class
subclass of: Hospital information, examination/diagnosis/treatment data
comment: 1 MD01492 2 heart rate warning 3 None 4 heart rate warning 5 361136003 6 Abnormal heart beat 7 Abnormal heart beat (finding) 8 Abnormal heart beat 9 C1744601

heart strengthening score
type: Class
subclass of: Units
comment: 1 MD01547 2 heart strengthening score 3 None 4 heart strengthening score 5 246262008 6 score 7 Score (attribute) 8 Score 9 C0449820
comment: 1 MD01547-1 2 heart strengthening score 3 None 4 heart strengthening score 5 278061009 6 Scores 7 Scores (qualifier value) 8 Score 9 C0449820

heartburn
type: Class
subclass of: Digestive function (Symptom)
comment: 1 MD01609 2 heartburn 3 None 4 heartburn 5 16331000 6 Heartburn 7 Heartburn (finding) 8 Heartburn 9 C0018834

heat
type: Class
subclass of: Health Related Factors
comment: 1 MD05362 2 heat 3 None 4 heat 5 88999006 6 Heat 7 Heat (physical force) 8 Heat 9 C0018837

height
type: Class
subclass of: Sensory function, Pain and Skin function (Body measurement)
comment: 1 MD00694 2 height 3 None 4 height 5 1153637007 6 Body height 7 Body height (observable entity) 8 Body Height 9 C0005890
comment: 1 MD01124 2 Height 3 None 4 height 5 1153637007 6 body height 7 Body height (observable entity) 8 height 9 C0489786
comment: 1 MD02084 2 height 3 None 4 height 5 1153637007 6 Body height 7 Body height (observable entity) 8 Body Height 9 C0005890
comment: 1 MD03987 2 Height 3 height 4 height 5 1153637007 6 Body height 7 Body height (observable entity) 8 Body height 9 C0005890

height measurement date
type: Class
subclass of: Day
comment: 1 MD00882 2 height measurement date 3 None 4 height measurement date 5 439771001 6 Date of event 7 Date of event (observable entity) 8 Date of event 9 C2585732

hem of a dress shirt
type: Class
subclass of: Equipment
comment: 1 MD04515 2 hem of a dress shirt 3 None 4 hem of a dress shirt 5 228194007 6 Shirt 7 Shirt (physical object) 8 Shirt 9 C0453917

hematooncology
type: Class
subclass of: Classification of Hospital
comment: 1 MD00683 2 hematology oncology 3 None 4 hematooncology 5 394593009 6 Medical oncology 7 Medical oncology (qualifier value) 8 Hematology+Medical oncology 9 C1555762